robotpkg/wip/ompl bulk build results

Log for ompl-1.4.1 on NetBSD-8.0-x86_64: bulk.log (Back)

=> Checking for clear installation ===> Installing bootstrap dependencies for ompl-1.4.1 => Installing /opt/robotpkg/var/lib/robotpkg/packages/bsd/NetBSD-8.0-x86_64/All/digest-20080510.tgz => Installing /opt/robotpkg/var/lib/robotpkg/packages/bsd/NetBSD-8.0-x86_64/All/tnftp-20130505~ssl.tgz ===> Checking bootstrap dependencies for ompl-1.4.1 => Required robotpkg package digest>=20080510: digest-20080510 found => Required robotpkg package tnftp>=20130505~ssl: tnftp-20130505~ssl found => Required system package gzip: gzip-20150113 found => Required system package pax and tar archivers: pax found => Required system package pkg_install>=20110805.9: pkg_install-20110805.9 found ===> Done bootstrap-depends for ompl-1.4.1 ===> Installing full dependencies for ompl-1.4.1 => Dependency digest-20080510 already installed => Dependency tnftp-20130505~ssl already installed ===> Checking build options for ompl-1.4.1 => Building with no option. ===> Checking alternatives for ompl-1.4.1 => Use the GNU C++ compiler: c++-compiler provided by g++>=4.8 => Use the GNU C compiler: c-compiler provided by gcc>=3 ===> Checking dependencies for ompl-1.4.1 => Required system package boost-headers>=1.34.1: boost-headers-1.71 found => Required system package boostlib-filesystem>=1.54: boost-libs-1.71 found => Required system package boostlib-iostreams>=1.54: boost-libs-1.71 found => Required system package boostlib-math>=1.54: boost-libs-1.71 found => Required system package boostlib-thread>=1.54: boost-libs-1.71 found => Required system package cmake>=2.8.7: cmake-3.15.3 found => Required system package g++>=4.8: g++-5.5.0 found => Required system package gcc>=3: gcc-5.5.0 found => Required system package libstdc++: libstdc++ found ===> Done depends for ompl-1.4.1 ===> Extracting for ompl-1.4.1 => SHA1 checksums OK => RMD160 checksums OK tar: ustar vol 1, 835 files, 51604480 bytes read, 0 bytes written in 2 secs (25802240 bytes/sec) ===> Configuring for ompl-1.4.1 ===> Building for ompl-1.4.1 In file included from /usr/pkg/include/boost/graph/adjacency_list.hpp:223:0, from /local/robotpkg/var/tmp/robotpkg/wip/ompl/work/ompl-1.4.1-Source/src/ompl/control/planners/ltl/ProductGraph.h:44, from /local/robotpkg/var/tmp/robotpkg/wip/ompl/work/ompl-1.4.1-Source/src/ompl/control/planners/ltl/src/ProductGraph.cpp:37: /usr/pkg/include/boost/graph/detail/adjacency_list.hpp: In member function 'void ompl::control::ProductGraph::buildGraph(ompl::control::ProductGraph::State*, const std::function&)': /usr/pkg/include/boost/graph/detail/adjacency_list.hpp:2239:43: warning: 'p.ompl::control::ProductGraph::Edge::cost' may be used uninitialized in this function [-Wmaybe-uninitialized] typename Config::edge_property_type p; ^ In file included from /usr/pkg/include/boost/graph/detail/adjacency_list.hpp:34:0, from /usr/pkg/include/boost/graph/adjacency_list.hpp:223, from /local/robotpkg/var/tmp/robotpkg/wip/ompl/work/ompl-1.4.1-Source/src/ompl/control/planners/ltl/ProductGraph.h:44, from /local/robotpkg/var/tmp/robotpkg/wip/ompl/work/ompl-1.4.1-Source/src/ompl/control/planners/ltl/src/ProductGraph.cpp:37: /usr/pkg/include/boost/graph/detail/adj_list_edge_iterator.hpp: In member function 'std::vector ompl::control::ProductGraph::computeLead(ompl::control::ProductGraph::State*, const std::function&)': /usr/pkg/include/boost/graph/detail/adj_list_edge_iterator.hpp:70:9: warning: '*((void*)& ei +48)' may be used uninitialized in this function [-Wmaybe-uninitialized] if (edges BOOST_GRAPH_MEMBER first == edges BOOST_GRAPH_MEMBER second) ^ /local/robotpkg/var/tmp/robotpkg/wip/ompl/work/ompl-1.4.1-Source/src/ompl/control/planners/ltl/src/ProductGraph.cpp:141:14: note: '*((void*)& ei +48)' was declared here EdgeIter ei, eend; ^ In file included from /usr/pkg/include/boost/graph/detail/adjacency_list.hpp:34:0, from /usr/pkg/include/boost/graph/adjacency_list.hpp:223, from /local/robotpkg/var/tmp/robotpkg/wip/ompl/work/ompl-1.4.1-Source/src/ompl/control/planners/ltl/ProductGraph.h:44, from /local/robotpkg/var/tmp/robotpkg/wip/ompl/work/ompl-1.4.1-Source/src/ompl/control/planners/ltl/src/ProductGraph.cpp:37: /usr/pkg/include/boost/graph/detail/adj_list_edge_iterator.hpp:95:84: warning: '*((void*)& eend +32)' may be used uninitialized in this function [-Wmaybe-uninitialized] && edges BOOST_GRAPH_MEMBER first != x.edges BOOST_GRAPH_MEMBER first); ^ /local/robotpkg/var/tmp/robotpkg/wip/ompl/work/ompl-1.4.1-Source/src/ompl/control/planners/ltl/src/ProductGraph.cpp:141:18: note: '*((void*)& eend +32)' was declared here EdgeIter ei, eend; ^ At global scope: cc1plus: warning: unrecognized command line option '-Wno-noexcept-type' In file included from /usr/pkg/include/boost/graph/detail/adjacency_list.hpp:34:0, from /usr/pkg/include/boost/graph/adjacency_list.hpp:223, from /local/robotpkg/var/tmp/robotpkg/wip/ompl/work/ompl-1.4.1-Source/src/ompl/control/planners/syclop/Syclop.h:42, from /local/robotpkg/var/tmp/robotpkg/wip/ompl/work/ompl-1.4.1-Source/src/ompl/control/planners/syclop/src/Syclop.cpp:37: /usr/pkg/include/boost/graph/detail/adj_list_edge_iterator.hpp: In member function 'void ompl::control::Syclop::clearGraphDetails()': /usr/pkg/include/boost/graph/detail/adj_list_edge_iterator.hpp:70:9: warning: '*((void*)& ei +48)' may be used uninitialized in this function [-Wmaybe-uninitialized] if (edges BOOST_GRAPH_MEMBER first == edges BOOST_GRAPH_MEMBER second) ^ /local/robotpkg/var/tmp/robotpkg/wip/ompl/work/ompl-1.4.1-Source/src/ompl/control/planners/syclop/src/Syclop.cpp:372:14: note: '*((void*)& ei +48)' was declared here EdgeIter ei, eend; ^ In file included from /usr/pkg/include/boost/graph/detail/adjacency_list.hpp:34:0, from /usr/pkg/include/boost/graph/adjacency_list.hpp:223, from /local/robotpkg/var/tmp/robotpkg/wip/ompl/work/ompl-1.4.1-Source/src/ompl/control/planners/syclop/Syclop.h:42, from /local/robotpkg/var/tmp/robotpkg/wip/ompl/work/ompl-1.4.1-Source/src/ompl/control/planners/syclop/src/Syclop.cpp:37: /usr/pkg/include/boost/graph/detail/adj_list_edge_iterator.hpp:95:84: warning: '*((void*)& eend +32)' may be used uninitialized in this function [-Wmaybe-uninitialized] && edges BOOST_GRAPH_MEMBER first != x.edges BOOST_GRAPH_MEMBER first); ^ /local/robotpkg/var/tmp/robotpkg/wip/ompl/work/ompl-1.4.1-Source/src/ompl/control/planners/syclop/src/Syclop.cpp:372:18: note: '*((void*)& eend +32)' was declared here EdgeIter ei, eend; ^ In file included from /usr/pkg/include/boost/graph/detail/adjacency_list.hpp:34:0, from /usr/pkg/include/boost/graph/adjacency_list.hpp:223, from /local/robotpkg/var/tmp/robotpkg/wip/ompl/work/ompl-1.4.1-Source/src/ompl/control/planners/syclop/Syclop.h:42, from /local/robotpkg/var/tmp/robotpkg/wip/ompl/work/ompl-1.4.1-Source/src/ompl/control/planners/syclop/src/Syclop.cpp:37: /usr/pkg/include/boost/graph/detail/adj_list_edge_iterator.hpp: In member function 'void ompl::control::Syclop::setupEdgeEstimates()': /usr/pkg/include/boost/graph/detail/adj_list_edge_iterator.hpp:70:9: warning: '*((void*)& ei +48)' may be used uninitialized in this function [-Wmaybe-uninitialized] if (edges BOOST_GRAPH_MEMBER first == edges BOOST_GRAPH_MEMBER second) ^ /local/robotpkg/var/tmp/robotpkg/wip/ompl/work/ompl-1.4.1-Source/src/ompl/control/planners/syclop/src/Syclop.cpp:296:14: note: '*((void*)& ei +48)' was declared here EdgeIter ei, eend; ^ In file included from /usr/pkg/include/boost/graph/detail/adjacency_list.hpp:34:0, from /usr/pkg/include/boost/graph/adjacency_list.hpp:223, from /local/robotpkg/var/tmp/robotpkg/wip/ompl/work/ompl-1.4.1-Source/src/ompl/control/planners/syclop/Syclop.h:42, from /local/robotpkg/var/tmp/robotpkg/wip/ompl/work/ompl-1.4.1-Source/src/ompl/control/planners/syclop/src/Syclop.cpp:37: /usr/pkg/include/boost/graph/detail/adj_list_edge_iterator.hpp:95:84: warning: '*((void*)(& ei)+32).__gnu_cxx::__normal_iterator*, std::vector, std::allocator > > >::_M_current' may be used uninitialized in this function [-Wmaybe-uninitialized] && edges BOOST_GRAPH_MEMBER first != x.edges BOOST_GRAPH_MEMBER first); ^ /local/robotpkg/var/tmp/robotpkg/wip/ompl/work/ompl-1.4.1-Source/src/ompl/control/planners/syclop/src/Syclop.cpp:296:14: note: '*((void*)(& ei)+32).__gnu_cxx::__normal_iterator*, std::vector, std::allocator > > >::_M_current' was declared here EdgeIter ei, eend; ^ In file included from /usr/pkg/include/boost/graph/detail/adjacency_list.hpp:34:0, from /usr/pkg/include/boost/graph/adjacency_list.hpp:223, from /local/robotpkg/var/tmp/robotpkg/wip/ompl/work/ompl-1.4.1-Source/src/ompl/control/planners/syclop/Syclop.h:42, from /local/robotpkg/var/tmp/robotpkg/wip/ompl/work/ompl-1.4.1-Source/src/ompl/control/planners/syclop/src/Syclop.cpp:37: /usr/pkg/include/boost/graph/detail/adj_list_edge_iterator.hpp:95:84: warning: '*((void*)& eend +32)' may be used uninitialized in this function [-Wmaybe-uninitialized] && edges BOOST_GRAPH_MEMBER first != x.edges BOOST_GRAPH_MEMBER first); ^ /local/robotpkg/var/tmp/robotpkg/wip/ompl/work/ompl-1.4.1-Source/src/ompl/control/planners/syclop/src/Syclop.cpp:296:18: note: '*((void*)& eend +32)' was declared here EdgeIter ei, eend; ^ At global scope: cc1plus: warning: unrecognized command line option '-Wno-noexcept-type' /local/robotpkg/var/tmp/robotpkg/wip/ompl/work/ompl-1.4.1-Source/src/ompl/tools/benchmark/src/MachineSpecs.cpp: In function 'std::string ompl::machine::getHostname()': /local/robotpkg/var/tmp/robotpkg/wip/ompl/work/ompl-1.4.1-Source/src/ompl/tools/benchmark/src/MachineSpecs.cpp:229:49: error: 'gethostname' was not declared in this scope int len = gethostname(buffer, sizeof(buffer)); ^ At global scope: cc1plus: warning: unrecognized command line option '-Wno-noexcept-type' gmake[2]: *** [src/ompl/CMakeFiles/ompl.dir/build.make:1769: src/ompl/CMakeFiles/ompl.dir/tools/benchmark/src/MachineSpecs.cpp.o] Error 1 gmake[2]: *** Waiting for unfinished jobs.... In file included from /local/robotpkg/var/tmp/robotpkg/wip/ompl/work/ompl-1.4.1-Source/src/ompl/tools/benchmark/src/Benchmark.cpp:42:0: /usr/pkg/include/boost/progress.hpp:23:98: note: #pragma message: This header is deprecated. Use the facilities in instead. In file included from /usr/pkg/include/boost/progress.hpp:25:0, from /local/robotpkg/var/tmp/robotpkg/wip/ompl/work/ompl-1.4.1-Source/src/ompl/tools/benchmark/src/Benchmark.cpp:42: /usr/pkg/include/boost/timer.hpp:21:98: note: #pragma message: This header is deprecated. Use the facilities in instead. gmake[1]: *** [CMakeFiles/Makefile2:203: src/ompl/CMakeFiles/ompl.dir/all] Error 2 gmake: *** [Makefile:166: all] Error 2 An unexpected error occured. The last 10 log lines are shown below. | gmake[2]: *** Waiting for unfinished jobs.... | In file included from /local/robotpkg/var/tmp/robotpkg/wip/ompl/work/ompl-1.4.1-Source/src/ompl/tools/benchmark/src/Benchmark.cpp:42:0: | /usr/pkg/include/boost/progress.hpp:23:98: note: #pragma message: This header is deprecated. Use the facilities in instead. | In file included from /usr/pkg/include/boost/progress.hpp:25:0, => Marking ompl-1.4.1 as broken | from /local/robotpkg/var/tmp/robotpkg/wip/ompl/work/ompl-1.4.1-Source/src/ompl/tools/benchmark/src/Benchmark.cpp:42: | /usr/pkg/include/boost/timer.hpp:21:98: note: #pragma message: This header is deprecated. Use the facilities in instead. | gmake[2]: Leaving directory '/local/robotpkg/var/tmp/robotpkg/wip/ompl/work/ompl-1.4.1-Source' | gmake[1]: Leaving directory '/local/robotpkg/var/tmp/robotpkg/wip/ompl/work/ompl-1.4.1-Source' | gmake[1]: *** [CMakeFiles/Makefile2:203: src/ompl/CMakeFiles/ompl.dir/all] Error 2 | gmake: *** [Makefile:166: all] Error 2 For details or bug reports, check the complete log file in: /local/robotpkg/var/tmp/robotpkg/wip/ompl/work/build.log gmake[3]: *** [/local/robotpkg/var/lib/robotpkg/mk/build/build.mk:199: do-build] Error 2 gmake[2]: *** [/local/robotpkg/var/lib/robotpkg/mk/pkg/package.mk:42: pkg-check-installed] Error 2 ERROR: /usr/pkg/bin/gmake: *** [package] Error 2 ===> Deinstalling for ompl Removed digest-20080510 Removed tnftp-20130505~ssl