robotpkg/wip/metapod bulk build results

Log for metapod-1.0.10 on Fedora-27-x86_64: build.log (Back)

--- Environment --- tag=Fedora-27-x86_64 PKG_CONFIG=/usr/bin/pkg-config LC_MONETARY=C LOWER_OPSYS=fedora LANG=C OS_VERSION=27 PKGTOOLS_VERSION=20110805.9 _override_vars_archivers_pax=PKGREQD PKGREQD BULK_LOGDIR=/local/robotpkg/var/log/bulk GXX=/usr/bin/g++ OLDPWD=/local/robotpkg/var/lib/robotpkg/wip/libhatp TAR=/usr/bin/tar MACHINE_KERNEL=Linux-4.18.19-100.fc27.x86_64-x86_64 PKG_CONFIG_LIBDIR=/usr/lib64/pkgconfig:/usr/share/pkgconfig _override_vars_devel_boost_libs=PKGREQD PKGREQD PKGREQD PKGREQD PKGREQD PKGREQD PKGREQD PKGREQD PKGREQD PKGREQD PKGREQD PKGREQD _override_vars_pkgtools_digest=PKGREQD PKGREQD OWNER_GID=robots TNFTP=/opt/openrobots/sbin/tnftp MAKECONF=/opt/robotpkg/etc/robotpkg-wip.conf _override_vars_wip_metapod=PKGREQD _overrides_archivers_pax_PKGREQD=pax pax _overrides_pkgtools_tnftp_PKGREQD=tnftp>=20091122 tnftp>=20091122 MFLAGS=--no-print-directory _overrides_devel_boost_headers_PKGREQD=boost-headers>=1.34.1 boost-headers>=1.34.1 boost-headers>=1.34.1 EXPECT_TARGETS=fetch install package CC=/usr/bin/gcc ROBOTPKG_DIR=/local/robotpkg/var/lib/robotpkg LC_COLLATE=C _overrides_math_eigen3_PKGREQD=eigen3>=3.0.0 eigen3>=3.0.0 eigen3>=3.0.0 _override_vars_devel_boost_headers=PKGREQD PKGREQD PKGREQD ROBOTPKG_BASE=/local/robotpkg MACHINE_PLATFORM=Fedora-27-x86_64 PWD=/local/robotpkg/var/lib/robotpkg/wip/metapod _override_vars_pkgtools_pkg_config=PKGREQD PKGREQD PKGREQD LC_CTYPE=C NODENAME=fluffy64-fedora27 OS_KERNEL_VERSION=4.18.19-100.fc27.x86_64 _overrides_pkgtools_pkg_config_PKGREQD=pkg-config>=0.22 pkg-config>=0.22 pkg-config>=0.22 PKG_DBDIR=/opt/openrobots/var/db/robotpkg RECURSIVE_PKGPATH=wip/metapod LOWER_OS_KERNEL=linux PAX=/usr/bin/pax OPSYS=Fedora _ROBOTPKG_NOW=1118131744 _overrides_pkgtools_digest_PKGREQD=digest>=20080510 digest>=20080510 bf= _override_vars_math_eigen3=PKGREQD PKGREQD PKGREQD DOXYGEN=/usr/bin/doxygen LC_NUMERIC=C OWNER_UID=rbulk _override_vars_pkgtools_tnftp=PKGREQD PKGREQD FC=false MACHINE_ARCH=x86_64 ECHO_N=echo -n BULKBASE=/opt/openrobots hline="$bf======================================================================$rm" _override_vars_pkgtools_pkg_install=PKGREQD PKGREQD PKGREQD CXX=/usr/bin/g++ LOCALBASE=/opt/openrobots MAKEOVERRIDES=PKGREQD.cmdline=metapod-1.0.10 RECURSIVE_PKGPATH=wip/metapod\ tag=Fedora-27-x86_64 BULK_LOGDIR=/local/robotpkg/var/log/bulk BULKBASE=/opt/openrobots LOCALBASE=/opt/openrobots PKG_DBDIR=/opt/openrobots/var/db/robotpkg EXPECT_TARGETS=fetch\ install\ package LC_MESSAGES=C _overrides_pkgtools_pkg_install_PKGREQD=pkg_install>=20110805.9 pkg_install>=20110805.9 pkg_install>=20110805.9 _overrides_wip_metapod_PKGREQD=metapod-1.0.10 GZIP_CMD=/usr/bin/gzip MAKELEVEL=4 rm= PDFLATEX=/usr/bin/pdflatex SHLVL=4 LOWER_ARCH=x86_64 ZCAT=/usr/bin/zcat DIGEST=/opt/openrobots/sbin/robotpkg_digest CMAKE=/usr/bin/cmake _overrides_devel_boost_libs_PKGREQD=boost-libs>=1.34.1 boost-libs>=1.34.1 boost-libs>=1.34.1 boost-libs>=1.34.1 boost-libs>=1.34.1 boost-libs>=1.34.1 boost-libs>=1.34.1 boost-libs>=1.34.1 boost-libs>=1.34.1 boost-libs>=1.34.1 boost-libs>=1.34.1 boost-libs>=1.34.1 CXXCPP=/usr/bin/g++ -E LOWER_OS_VERSION=27 PATH=/usr/local/sbin:/usr/local/bin:/usr/sbin:/usr/bin ROBOTPKG_TRUSTED_ENV=robotpkg GCC=/usr/bin/gcc PKG_CONFIG_PATH= MAKEFLAGS= --no-print-directory -- PKGREQD.cmdline=metapod-1.0.10 RECURSIVE_PKGPATH=wip/metapod\ tag=Fedora-27-x86_64 BULK_LOGDIR=/local/robotpkg/var/log/bulk BULKBASE=/opt/openrobots LOCALBASE=/opt/openrobots PKG_DBDIR=/opt/openrobots/var/db/robotpkg EXPECT_TARGETS=fetch\ install\ package OS_KERNEL=Linux CPP=/usr/bin/gcc -E LC_TIME=C _=/usr/bin/env --- Running set -e; \ cd /local/robotpkg/var/tmp/robotpkg/wip/metapod/work/metapod-1.0.10 && cd /local/robotpkg/var/tmp/robotpkg/wip/metapod/work/metapod-1.0.10 && /usr/bin/env MAKELEVEL= MAKEOVERRIDES= MAKEFLAGS= MFLAGS= 'CPPFLAGS=' 'CFLAGS=-pipe -O3 -DNDEBUG' 'LDFLAGS=' 'CXXFLAGS=-pipe -O3 -DNDEBUG' PREFIX='/opt/openrobots' HOME=/local/robotpkg/var/tmp/robotpkg/wip/metapod/work PATH='/opt/openrobots/sbin:/usr/bin:/usr/local/sbin:/usr/local/bin:/usr/sbin' LD_LIBRARY_PATH='' LOCALBASE=/opt/openrobots PKGMANDIR=man make -j4 -f Makefile all; /usr/bin/cmake -H/local/robotpkg/var/tmp/robotpkg/wip/metapod/work/metapod-1.0.10 -B/local/robotpkg/var/tmp/robotpkg/wip/metapod/work/metapod-1.0.10 --check-build-system CMakeFiles/Makefile.cmake 0 /usr/bin/cmake -E cmake_progress_start /local/robotpkg/var/tmp/robotpkg/wip/metapod/work/metapod-1.0.10/CMakeFiles /local/robotpkg/var/tmp/robotpkg/wip/metapod/work/metapod-1.0.10/CMakeFiles/progress.marks make -f CMakeFiles/Makefile2 all make[1]: Entering directory '/local/robotpkg/var/tmp/robotpkg/wip/metapod/work/metapod-1.0.10' make -f embedfile/CMakeFiles/embedfile.dir/build.make embedfile/CMakeFiles/embedfile.dir/depend make[2]: Entering directory '/local/robotpkg/var/tmp/robotpkg/wip/metapod/work/metapod-1.0.10' cd /local/robotpkg/var/tmp/robotpkg/wip/metapod/work/metapod-1.0.10 && /usr/bin/cmake -E cmake_depends "Unix Makefiles" /local/robotpkg/var/tmp/robotpkg/wip/metapod/work/metapod-1.0.10 /local/robotpkg/var/tmp/robotpkg/wip/metapod/work/metapod-1.0.10/embedfile /local/robotpkg/var/tmp/robotpkg/wip/metapod/work/metapod-1.0.10 /local/robotpkg/var/tmp/robotpkg/wip/metapod/work/metapod-1.0.10/embedfile /local/robotpkg/var/tmp/robotpkg/wip/metapod/work/metapod-1.0.10/embedfile/CMakeFiles/embedfile.dir/DependInfo.cmake --color= make -f tests/spatial/CMakeFiles/test_rotation.dir/build.make tests/spatial/CMakeFiles/test_rotation.dir/depend make -f tests/spatial/CMakeFiles/test_transform.dir/build.make tests/spatial/CMakeFiles/test_transform.dir/depend make[2]: Entering directory '/local/robotpkg/var/tmp/robotpkg/wip/metapod/work/metapod-1.0.10' cd /local/robotpkg/var/tmp/robotpkg/wip/metapod/work/metapod-1.0.10 && /usr/bin/cmake -E cmake_depends "Unix Makefiles" /local/robotpkg/var/tmp/robotpkg/wip/metapod/work/metapod-1.0.10 /local/robotpkg/var/tmp/robotpkg/wip/metapod/work/metapod-1.0.10/tests/spatial /local/robotpkg/var/tmp/robotpkg/wip/metapod/work/metapod-1.0.10 /local/robotpkg/var/tmp/robotpkg/wip/metapod/work/metapod-1.0.10/tests/spatial /local/robotpkg/var/tmp/robotpkg/wip/metapod/work/metapod-1.0.10/tests/spatial/CMakeFiles/test_transform.dir/DependInfo.cmake --color= make -f tests/spatial/CMakeFiles/test_doubledef.dir/build.make tests/spatial/CMakeFiles/test_doubledef.dir/depend make[2]: Entering directory '/local/robotpkg/var/tmp/robotpkg/wip/metapod/work/metapod-1.0.10' cd /local/robotpkg/var/tmp/robotpkg/wip/metapod/work/metapod-1.0.10 && /usr/bin/cmake -E cmake_depends "Unix Makefiles" /local/robotpkg/var/tmp/robotpkg/wip/metapod/work/metapod-1.0.10 /local/robotpkg/var/tmp/robotpkg/wip/metapod/work/metapod-1.0.10/tests/spatial /local/robotpkg/var/tmp/robotpkg/wip/metapod/work/metapod-1.0.10 /local/robotpkg/var/tmp/robotpkg/wip/metapod/work/metapod-1.0.10/tests/spatial /local/robotpkg/var/tmp/robotpkg/wip/metapod/work/metapod-1.0.10/tests/spatial/CMakeFiles/test_doubledef.dir/DependInfo.cmake --color= make[2]: Entering directory '/local/robotpkg/var/tmp/robotpkg/wip/metapod/work/metapod-1.0.10' cd /local/robotpkg/var/tmp/robotpkg/wip/metapod/work/metapod-1.0.10 && /usr/bin/cmake -E cmake_depends "Unix Makefiles" /local/robotpkg/var/tmp/robotpkg/wip/metapod/work/metapod-1.0.10 /local/robotpkg/var/tmp/robotpkg/wip/metapod/work/metapod-1.0.10/tests/spatial /local/robotpkg/var/tmp/robotpkg/wip/metapod/work/metapod-1.0.10 /local/robotpkg/var/tmp/robotpkg/wip/metapod/work/metapod-1.0.10/tests/spatial /local/robotpkg/var/tmp/robotpkg/wip/metapod/work/metapod-1.0.10/tests/spatial/CMakeFiles/test_rotation.dir/DependInfo.cmake --color= Scanning dependencies of target embedfile make[2]: Leaving directory '/local/robotpkg/var/tmp/robotpkg/wip/metapod/work/metapod-1.0.10' make -f embedfile/CMakeFiles/embedfile.dir/build.make embedfile/CMakeFiles/embedfile.dir/build make[2]: Entering directory '/local/robotpkg/var/tmp/robotpkg/wip/metapod/work/metapod-1.0.10' [ 0%] Building CXX object embedfile/CMakeFiles/embedfile.dir/src/embedfile.cc.o cd /local/robotpkg/var/tmp/robotpkg/wip/metapod/work/metapod-1.0.10/embedfile && /usr/bin/g++ -I/local/robotpkg/var/tmp/robotpkg/wip/metapod/work/metapod-1.0.10 -I/local/robotpkg/var/tmp/robotpkg/wip/metapod/work/metapod-1.0.10/include -isystem /usr/include/eigen3 -pedantic -Wno-long-long -Wall -Wextra -Wcast-align -Wcast-qual -Wformat -Wwrite-strings -Wconversion -pipe -O3 -DNDEBUG -fvisibility=hidden -Wno-variadic-macros -o CMakeFiles/embedfile.dir/src/embedfile.cc.o -c /local/robotpkg/var/tmp/robotpkg/wip/metapod/work/metapod-1.0.10/embedfile/src/embedfile.cc Scanning dependencies of target test_rotation make[2]: Leaving directory '/local/robotpkg/var/tmp/robotpkg/wip/metapod/work/metapod-1.0.10' make -f tests/spatial/CMakeFiles/test_rotation.dir/build.make tests/spatial/CMakeFiles/test_rotation.dir/build Scanning dependencies of target test_doubledef make[2]: Leaving directory '/local/robotpkg/var/tmp/robotpkg/wip/metapod/work/metapod-1.0.10' make -f tests/spatial/CMakeFiles/test_doubledef.dir/build.make tests/spatial/CMakeFiles/test_doubledef.dir/build make[2]: Entering directory '/local/robotpkg/var/tmp/robotpkg/wip/metapod/work/metapod-1.0.10' Scanning dependencies of target test_transform make[2]: Leaving directory '/local/robotpkg/var/tmp/robotpkg/wip/metapod/work/metapod-1.0.10' make -f tests/spatial/CMakeFiles/test_transform.dir/build.make tests/spatial/CMakeFiles/test_transform.dir/build make[2]: Entering directory '/local/robotpkg/var/tmp/robotpkg/wip/metapod/work/metapod-1.0.10' make[2]: Entering directory '/local/robotpkg/var/tmp/robotpkg/wip/metapod/work/metapod-1.0.10' [ 1%] Building CXX object tests/spatial/CMakeFiles/test_rotation.dir/test_rotation.cc.o cd /local/robotpkg/var/tmp/robotpkg/wip/metapod/work/metapod-1.0.10/tests/spatial && /usr/bin/g++ -DBOOST_TEST_DYN_LINK -DBOOST_TEST_MAIN -I/local/robotpkg/var/tmp/robotpkg/wip/metapod/work/metapod-1.0.10 -I/local/robotpkg/var/tmp/robotpkg/wip/metapod/work/metapod-1.0.10/include -isystem /usr/include/eigen3 -pedantic -Wno-long-long -Wall -Wextra -Wcast-align -Wcast-qual -Wformat -Wwrite-strings -Wconversion -pipe -O3 -DNDEBUG -fvisibility=hidden -Wno-variadic-macros -o CMakeFiles/test_rotation.dir/test_rotation.cc.o -c /local/robotpkg/var/tmp/robotpkg/wip/metapod/work/metapod-1.0.10/tests/spatial/test_rotation.cc [ 2%] Building CXX object tests/spatial/CMakeFiles/test_transform.dir/test_transform.cc.o cd /local/robotpkg/var/tmp/robotpkg/wip/metapod/work/metapod-1.0.10/tests/spatial && /usr/bin/g++ -DBOOST_TEST_DYN_LINK -DBOOST_TEST_MAIN -I/local/robotpkg/var/tmp/robotpkg/wip/metapod/work/metapod-1.0.10 -I/local/robotpkg/var/tmp/robotpkg/wip/metapod/work/metapod-1.0.10/include -isystem /usr/include/eigen3 -pedantic -Wno-long-long -Wall -Wextra -Wcast-align -Wcast-qual -Wformat -Wwrite-strings -Wconversion -pipe -O3 -DNDEBUG -fvisibility=hidden -Wno-variadic-macros -o CMakeFiles/test_transform.dir/test_transform.cc.o -c /local/robotpkg/var/tmp/robotpkg/wip/metapod/work/metapod-1.0.10/tests/spatial/test_transform.cc [ 3%] Building CXX object tests/spatial/CMakeFiles/test_doubledef.dir/test_doubledef.cc.o cd /local/robotpkg/var/tmp/robotpkg/wip/metapod/work/metapod-1.0.10/tests/spatial && /usr/bin/g++ -DBOOST_TEST_DYN_LINK -DBOOST_TEST_MAIN -I/local/robotpkg/var/tmp/robotpkg/wip/metapod/work/metapod-1.0.10 -I/local/robotpkg/var/tmp/robotpkg/wip/metapod/work/metapod-1.0.10/include -isystem /usr/include/eigen3 -pedantic -Wno-long-long -Wall -Wextra -Wcast-align -Wcast-qual -Wformat -Wwrite-strings -Wconversion -pipe -O3 -DNDEBUG -fvisibility=hidden -Wno-variadic-macros -o CMakeFiles/test_doubledef.dir/test_doubledef.cc.o -c /local/robotpkg/var/tmp/robotpkg/wip/metapod/work/metapod-1.0.10/tests/spatial/test_doubledef.cc In file included from /local/robotpkg/var/tmp/robotpkg/wip/metapod/work/metapod-1.0.10/tests/spatial/test_rotation.cc:20:0: /local/robotpkg/var/tmp/robotpkg/wip/metapod/work/metapod-1.0.10/tests/spatial/../common.hh: In function 'bool stringToDouble(const string&, double&)': /local/robotpkg/var/tmp/robotpkg/wip/metapod/work/metapod-1.0.10/tests/spatial/../common.hh:41:19: error: no match for 'operator!=' (operand types are 'std::basic_istream::__istream_type {aka std::basic_istream}' and 'int') return (i >> x) != 0; ~~~~~~~~~^~~~ /local/robotpkg/var/tmp/robotpkg/wip/metapod/work/metapod-1.0.10/tests/spatial/../common.hh:41:19: note: candidate: operator!=(int, int) /local/robotpkg/var/tmp/robotpkg/wip/metapod/work/metapod-1.0.10/tests/spatial/../common.hh:41:19: note: no known conversion for argument 1 from 'std::basic_istream::__istream_type {aka std::basic_istream}' to 'int' In file included from /usr/include/c++/7/list:63:0, from /usr/include/boost/test/tree/auto_registration.hpp:24, from /usr/include/boost/test/unit_test_suite.hpp:17, from /usr/include/boost/test/unit_test.hpp:19, from /local/robotpkg/var/tmp/robotpkg/wip/metapod/work/metapod-1.0.10/tests/spatial/../common.hh:35, from /local/robotpkg/var/tmp/robotpkg/wip/metapod/work/metapod-1.0.10/tests/spatial/test_rotation.cc:20: /usr/include/c++/7/bits/stl_list.h:1925:5: note: candidate: template bool std::operator!=(const std::__cxx11::list<_Tp, _Alloc>&, const std::__cxx11::list<_Tp, _Alloc>&) operator!=(const list<_Tp, _Alloc>& __x, const list<_Tp, _Alloc>& __y) ^~~~~~~~ /usr/include/c++/7/bits/stl_list.h:1925:5: note: template argument deduction/substitution failed: In file included from /local/robotpkg/var/tmp/robotpkg/wip/metapod/work/metapod-1.0.10/tests/spatial/test_rotation.cc:20:0: /local/robotpkg/var/tmp/robotpkg/wip/metapod/work/metapod-1.0.10/tests/spatial/../common.hh:41:22: note: 'std::basic_istream::__istream_type {aka std::basic_istream}' is not derived from 'const std::__cxx11::list<_Tp, _Alloc>' return (i >> x) != 0; ^ In file included from /usr/include/c++/7/list:63:0, from /usr/include/boost/test/tree/auto_registration.hpp:24, from /usr/include/boost/test/unit_test_suite.hpp:17, from /usr/include/boost/test/unit_test.hpp:19, from /local/robotpkg/var/tmp/robotpkg/wip/metapod/work/metapod-1.0.10/tests/spatial/../common.hh:35, from /local/robotpkg/var/tmp/robotpkg/wip/metapod/work/metapod-1.0.10/tests/spatial/test_rotation.cc:20: /usr/include/c++/7/bits/stl_list.h:293:5: note: candidate: template bool std::operator!=(const std::_List_iterator<_Tp>&, const std::_List_const_iterator<_Tp>&) operator!=(const _List_iterator<_Val>& __x, ^~~~~~~~ /usr/include/c++/7/bits/stl_list.h:293:5: note: template argument deduction/substitution failed: In file included from /local/robotpkg/var/tmp/robotpkg/wip/metapod/work/metapod-1.0.10/tests/spatial/test_rotation.cc:20:0: /local/robotpkg/var/tmp/robotpkg/wip/metapod/work/metapod-1.0.10/tests/spatial/../common.hh:41:22: note: 'std::basic_istream::__istream_type {aka std::basic_istream}' is not derived from 'const std::_List_iterator<_Tp>' return (i >> x) != 0; ^ In file included from /usr/include/c++/7/map:62:0, from /usr/include/boost/test/tree/test_unit.hpp:35, from /usr/include/boost/test/tree/auto_registration.hpp:21, from /usr/include/boost/test/unit_test_suite.hpp:17, from /usr/include/boost/test/unit_test.hpp:19, from /local/robotpkg/var/tmp/robotpkg/wip/metapod/work/metapod-1.0.10/tests/spatial/../common.hh:35, from /local/robotpkg/var/tmp/robotpkg/wip/metapod/work/metapod-1.0.10/tests/spatial/test_rotation.cc:20: /usr/include/c++/7/bits/stl_multimap.h:1085:5: note: candidate: template bool std::operator!=(const std::multimap<_Key, _Tp, _Compare, _Alloc>&, const std::multimap<_Key, _Tp, _Compare, _Alloc>&) operator!=(const multimap<_Key, _Tp, _Compare, _Alloc>& __x, ^~~~~~~~ /usr/include/c++/7/bits/stl_multimap.h:1085:5: note: template argument deduction/substitution failed: In file included from /local/robotpkg/var/tmp/robotpkg/wip/metapod/work/metapod-1.0.10/tests/spatial/test_rotation.cc:20:0: /local/robotpkg/var/tmp/robotpkg/wip/metapod/work/metapod-1.0.10/tests/spatial/../common.hh:41:22: note: 'std::basic_istream::__istream_type {aka std::basic_istream}' is not derived from 'const std::multimap<_Key, _Tp, _Compare, _Alloc>' return (i >> x) != 0; ^ In file included from /usr/include/c++/7/map:61:0, from /usr/include/boost/test/tree/test_unit.hpp:35, from /usr/include/boost/test/tree/auto_registration.hpp:21, from /usr/include/boost/test/unit_test_suite.hpp:17, from /usr/include/boost/test/unit_test.hpp:19, from /local/robotpkg/var/tmp/robotpkg/wip/metapod/work/metapod-1.0.10/tests/spatial/../common.hh:35, from /local/robotpkg/var/tmp/robotpkg/wip/metapod/work/metapod-1.0.10/tests/spatial/test_rotation.cc:20: /usr/include/c++/7/bits/stl_map.h:1419:5: note: candidate: template bool std::operator!=(const std::map<_Key, _Tp, _Compare, _Alloc>&, const std::map<_Key, _Tp, _Compare, _Alloc>&) operator!=(const map<_Key, _Tp, _Compare, _Alloc>& __x, ^~~~~~~~ /usr/include/c++/7/bits/stl_map.h:1419:5: note: template argument deduction/substitution failed: In file included from /local/robotpkg/var/tmp/robotpkg/wip/metapod/work/metapod-1.0.10/tests/spatial/test_rotation.cc:20:0: /local/robotpkg/var/tmp/robotpkg/wip/metapod/work/metapod-1.0.10/tests/spatial/../common.hh:41:22: note: 'std::basic_istream::__istream_type {aka std::basic_istream}' is not derived from 'const std::map<_Key, _Tp, _Compare, _Alloc>' return (i >> x) != 0; ^ In file included from /usr/include/c++/7/map:60:0, from /usr/include/boost/test/tree/test_unit.hpp:35, from /usr/include/boost/test/tree/auto_registration.hpp:21, from /usr/include/boost/test/unit_test_suite.hpp:17, from /usr/include/boost/test/unit_test.hpp:19, from /local/robotpkg/var/tmp/robotpkg/wip/metapod/work/metapod-1.0.10/tests/spatial/../common.hh:35, from /local/robotpkg/var/tmp/robotpkg/wip/metapod/work/metapod-1.0.10/tests/spatial/test_rotation.cc:20: /usr/include/c++/7/bits/stl_tree.h:1553:5: note: candidate: template bool std::operator!=(const std::_Rb_tree<_Key, _Val, _KeyOfValue, _Compare, _Alloc>&, const std::_Rb_tree<_Key, _Val, _KeyOfValue, _Compare, _Alloc>&) operator!=(const _Rb_tree<_Key, _Val, _KeyOfValue, _Compare, _Alloc>& __x, ^~~~~~~~ /usr/include/c++/7/bits/stl_tree.h:1553:5: note: template argument deduction/substitution failed: In file included from /local/robotpkg/var/tmp/robotpkg/wip/metapod/work/metapod-1.0.10/tests/spatial/test_rotation.cc:20:0: /local/robotpkg/var/tmp/robotpkg/wip/metapod/work/metapod-1.0.10/tests/spatial/../common.hh:41:22: note: 'std::basic_istream::__istream_type {aka std::basic_istream}' is not derived from 'const std::_Rb_tree<_Key, _Val, _KeyOfValue, _Compare, _Alloc>' return (i >> x) != 0; ^ In file included from /usr/include/c++/7/map:60:0, from /usr/include/boost/test/tree/test_unit.hpp:35, from /usr/include/boost/test/tree/auto_registration.hpp:21, from /usr/include/boost/test/unit_test_suite.hpp:17, from /usr/include/boost/test/unit_test.hpp:19, from /local/robotpkg/var/tmp/robotpkg/wip/metapod/work/metapod-1.0.10/tests/spatial/../common.hh:35, from /local/robotpkg/var/tmp/robotpkg/wip/metapod/work/metapod-1.0.10/tests/spatial/test_rotation.cc:20: /usr/include/c++/7/bits/stl_tree.h:412:5: note: candidate: template bool std::operator!=(const std::_Rb_tree_iterator<_Tp>&, const std::_Rb_tree_const_iterator<_Val>&) operator!=(const _Rb_tree_iterator<_Val>& __x, ^~~~~~~~ /usr/include/c++/7/bits/stl_tree.h:412:5: note: template argument deduction/substitution failed: In file included from /local/robotpkg/var/tmp/robotpkg/wip/metapod/work/metapod-1.0.10/tests/spatial/test_rotation.cc:20:0: /local/robotpkg/var/tmp/robotpkg/wip/metapod/work/metapod-1.0.10/tests/spatial/../common.hh:41:22: note: 'std::basic_istream::__istream_type {aka std::basic_istream}' is not derived from 'const std::_Rb_tree_iterator<_Tp>' return (i >> x) != 0; ^ In file included from /usr/include/c++/7/vector:64:0, from /usr/include/boost/test/tree/decorator.hpp:37, from /usr/include/boost/test/tools/fpc_tolerance.hpp:19, from /usr/include/boost/test/tools/fpc_op.hpp:19, from /usr/include/boost/test/test_tools.hpp:54, from /usr/include/boost/test/unit_test.hpp:18, from /local/robotpkg/var/tmp/robotpkg/wip/metapod/work/metapod-1.0.10/tests/spatial/../common.hh:35, from /local/robotpkg/var/tmp/robotpkg/wip/metapod/work/metapod-1.0.10/tests/spatial/test_rotation.cc:20: /usr/include/c++/7/bits/stl_vector.h:1620:5: note: candidate: template bool std::operator!=(const std::vector<_Tp, _Alloc>&, const std::vector<_Tp, _Alloc>&) operator!=(const vector<_Tp, _Alloc>& __x, const vector<_Tp, _Alloc>& __y) ^~~~~~~~ /usr/include/c++/7/bits/stl_vector.h:1620:5: note: template argument deduction/substitution failed: In file included from /local/robotpkg/var/tmp/robotpkg/wip/metapod/work/metapod-1.0.10/tests/spatial/test_rotation.cc:20:0: /local/robotpkg/var/tmp/robotpkg/wip/metapod/work/metapod-1.0.10/tests/spatial/../common.hh:41:22: note: 'std::basic_istream::__istream_type {aka std::basic_istream}' is not derived from 'const std::vector<_Tp, _Alloc>' return (i >> x) != 0; ^ In file included from /usr/include/c++/7/functional:58:0, from /usr/include/boost/smart_ptr/detail/shared_count.hpp:38, from /usr/include/boost/smart_ptr/shared_ptr.hpp:28, from /usr/include/boost/shared_ptr.hpp:17, from /usr/include/boost/test/tools/assertion_result.hpp:21, from /usr/include/boost/test/tools/old/impl.hpp:20, from /usr/include/boost/test/test_tools.hpp:46, from /usr/include/boost/test/unit_test.hpp:18, from /local/robotpkg/var/tmp/robotpkg/wip/metapod/work/metapod-1.0.10/tests/spatial/../common.hh:35, from /local/robotpkg/var/tmp/robotpkg/wip/metapod/work/metapod-1.0.10/tests/spatial/test_rotation.cc:20: /usr/include/c++/7/bits/std_function.h:788:5: note: candidate: template bool std::operator!=(std::nullptr_t, const std::function<_Res(_ArgTypes ...)>&) operator!=(nullptr_t, const function<_Res(_Args...)>& __f) noexcept ^~~~~~~~ /usr/include/c++/7/bits/std_function.h:788:5: note: template argument deduction/substitution failed: In file included from /local/robotpkg/var/tmp/robotpkg/wip/metapod/work/metapod-1.0.10/tests/spatial/test_rotation.cc:20:0: /local/robotpkg/var/tmp/robotpkg/wip/metapod/work/metapod-1.0.10/tests/spatial/../common.hh:41:22: note: mismatched types 'const std::function<_Res(_ArgTypes ...)>' and 'int' return (i >> x) != 0; ^ In file included from /usr/include/c++/7/functional:58:0, from /usr/include/boost/smart_ptr/detail/shared_count.hpp:38, from /usr/include/boost/smart_ptr/shared_ptr.hpp:28, from /usr/include/boost/shared_ptr.hpp:17, from /usr/include/boost/test/tools/assertion_result.hpp:21, from /usr/include/boost/test/tools/old/impl.hpp:20, from /usr/include/boost/test/test_tools.hpp:46, from /usr/include/boost/test/unit_test.hpp:18, from /local/robotpkg/var/tmp/robotpkg/wip/metapod/work/metapod-1.0.10/tests/spatial/../common.hh:35, from /local/robotpkg/var/tmp/robotpkg/wip/metapod/work/metapod-1.0.10/tests/spatial/test_rotation.cc:20: /usr/include/c++/7/bits/std_function.h:782:5: note: candidate: template bool std::operator!=(const std::function<_Res(_ArgTypes ...)>&, std::nullptr_t) operator!=(const function<_Res(_Args...)>& __f, nullptr_t) noexcept ^~~~~~~~ /usr/include/c++/7/bits/std_function.h:782:5: note: template argument deduction/substitution failed: In file included from /local/robotpkg/var/tmp/robotpkg/wip/metapod/work/metapod-1.0.10/tests/spatial/test_rotation.cc:20:0: /local/robotpkg/var/tmp/robotpkg/wip/metapod/work/metapod-1.0.10/tests/spatial/../common.hh:41:22: note: 'std::basic_istream::__istream_type {aka std::basic_istream}' is not derived from 'const std::function<_Res(_ArgTypes ...)>' return (i >> x) != 0; ^ In file included from /usr/include/c++/7/memory:81:0, from /usr/include/boost/config/no_tr1/memory.hpp:21, from /usr/include/boost/smart_ptr/shared_ptr.hpp:23, from /usr/include/boost/shared_ptr.hpp:17, from /usr/include/boost/test/tools/assertion_result.hpp:21, from /usr/include/boost/test/tools/old/impl.hpp:20, from /usr/include/boost/test/test_tools.hpp:46, from /usr/include/boost/test/unit_test.hpp:18, from /local/robotpkg/var/tmp/robotpkg/wip/metapod/work/metapod-1.0.10/tests/spatial/../common.hh:35, from /local/robotpkg/var/tmp/robotpkg/wip/metapod/work/metapod-1.0.10/tests/spatial/test_rotation.cc:20: /usr/include/c++/7/bits/shared_ptr.h:393:5: note: candidate: template bool std::operator!=(std::nullptr_t, const std::shared_ptr<_Tp>&) operator!=(nullptr_t, const shared_ptr<_Tp>& __a) noexcept ^~~~~~~~ /usr/include/c++/7/bits/shared_ptr.h:393:5: note: template argument deduction/substitution failed: In file included from /local/robotpkg/var/tmp/robotpkg/wip/metapod/work/metapod-1.0.10/tests/spatial/test_rotation.cc:20:0: /local/robotpkg/var/tmp/robotpkg/wip/metapod/work/metapod-1.0.10/tests/spatial/../common.hh:41:22: note: mismatched types 'const std::shared_ptr<_Tp>' and 'int' return (i >> x) != 0; ^ In file included from /usr/include/c++/7/memory:81:0, from /usr/include/boost/config/no_tr1/memory.hpp:21, from /usr/include/boost/smart_ptr/shared_ptr.hpp:23, from /usr/include/boost/shared_ptr.hpp:17, from /usr/include/boost/test/tools/assertion_result.hpp:21, from /usr/include/boost/test/tools/old/impl.hpp:20, from /usr/include/boost/test/test_tools.hpp:46, from /usr/include/boost/test/unit_test.hpp:18, from /local/robotpkg/var/tmp/robotpkg/wip/metapod/work/metapod-1.0.10/tests/spatial/../common.hh:35, from /local/robotpkg/var/tmp/robotpkg/wip/metapod/work/metapod-1.0.10/tests/spatial/test_rotation.cc:20: /usr/include/c++/7/bits/shared_ptr.h:388:5: note: candidate: template bool std::operator!=(const std::shared_ptr<_Tp>&, std::nullptr_t) operator!=(const shared_ptr<_Tp>& __a, nullptr_t) noexcept ^~~~~~~~ /usr/include/c++/7/bits/shared_ptr.h:388:5: note: template argument deduction/substitution failed: In file included from /local/robotpkg/var/tmp/robotpkg/wip/metapod/work/metapod-1.0.10/tests/spatial/test_rotation.cc:20:0: /local/robotpkg/var/tmp/robotpkg/wip/metapod/work/metapod-1.0.10/tests/spatial/../common.hh:41:22: note: 'std::basic_istream::__istream_type {aka std::basic_istream}' is not derived from 'const std::shared_ptr<_Tp>' return (i >> x) != 0; ^ In file included from /usr/include/c++/7/memory:81:0, from /usr/include/boost/config/no_tr1/memory.hpp:21, from /usr/include/boost/smart_ptr/shared_ptr.hpp:23, from /usr/include/boost/shared_ptr.hpp:17, from /usr/include/boost/test/tools/assertion_result.hpp:21, from /usr/include/boost/test/tools/old/impl.hpp:20, from /usr/include/boost/test/test_tools.hpp:46, from /usr/include/boost/test/unit_test.hpp:18, from /local/robotpkg/var/tmp/robotpkg/wip/metapod/work/metapod-1.0.10/tests/spatial/../common.hh:35, from /local/robotpkg/var/tmp/robotpkg/wip/metapod/work/metapod-1.0.10/tests/spatial/test_rotation.cc:20: /usr/include/c++/7/bits/shared_ptr.h:383:5: note: candidate: template bool std::operator!=(const std::shared_ptr<_Tp>&, const std::shared_ptr<_Up>&) operator!=(const shared_ptr<_Tp>& __a, const shared_ptr<_Up>& __b) noexcept ^~~~~~~~ /usr/include/c++/7/bits/shared_ptr.h:383:5: note: template argument deduction/substitution failed: In file included from /local/robotpkg/var/tmp/robotpkg/wip/metapod/work/metapod-1.0.10/tests/spatial/test_rotation.cc:20:0: /local/robotpkg/var/tmp/robotpkg/wip/metapod/work/metapod-1.0.10/tests/spatial/../common.hh:41:22: note: 'std::basic_istream::__istream_type {aka std::basic_istream}' is not derived from 'const std::shared_ptr<_Tp>' return (i >> x) != 0; ^ In file included from /usr/include/c++/7/bits/shared_ptr.h:52:0, from /usr/include/c++/7/memory:81, from /usr/include/boost/config/no_tr1/memory.hpp:21, from /usr/include/boost/smart_ptr/shared_ptr.hpp:23, from /usr/include/boost/shared_ptr.hpp:17, from /usr/include/boost/test/tools/assertion_result.hpp:21, from /usr/include/boost/test/tools/old/impl.hpp:20, from /usr/include/boost/test/test_tools.hpp:46, from /usr/include/boost/test/unit_test.hpp:18, from /local/robotpkg/var/tmp/robotpkg/wip/metapod/work/metapod-1.0.10/tests/spatial/../common.hh:35, from /local/robotpkg/var/tmp/robotpkg/wip/metapod/work/metapod-1.0.10/tests/spatial/test_rotation.cc:20: /usr/include/c++/7/bits/shared_ptr_base.h:1436:5: note: candidate: template bool std::operator!=(std::nullptr_t, const std::__shared_ptr<_Tp, _Lp>&) operator!=(nullptr_t, const __shared_ptr<_Tp, _Lp>& __a) noexcept ^~~~~~~~ /usr/include/c++/7/bits/shared_ptr_base.h:1436:5: note: template argument deduction/substitution failed: In file included from /local/robotpkg/var/tmp/robotpkg/wip/metapod/work/metapod-1.0.10/tests/spatial/test_rotation.cc:20:0: /local/robotpkg/var/tmp/robotpkg/wip/metapod/work/metapod-1.0.10/tests/spatial/../common.hh:41:22: note: mismatched types 'const std::__shared_ptr<_Tp, _Lp>' and 'int' return (i >> x) != 0; ^ In file included from /usr/include/c++/7/bits/shared_ptr.h:52:0, from /usr/include/c++/7/memory:81, from /usr/include/boost/config/no_tr1/memory.hpp:21, from /usr/include/boost/smart_ptr/shared_ptr.hpp:23, from /usr/include/boost/shared_ptr.hpp:17, from /usr/include/boost/test/tools/assertion_result.hpp:21, from /usr/include/boost/test/tools/old/impl.hpp:20, from /usr/include/boost/test/test_tools.hpp:46, from /usr/include/boost/test/unit_test.hpp:18, from /local/robotpkg/var/tmp/robotpkg/wip/metapod/work/metapod-1.0.10/tests/spatial/../common.hh:35, from /local/robotpkg/var/tmp/robotpkg/wip/metapod/work/metapod-1.0.10/tests/spatial/test_rotation.cc:20: /usr/include/c++/7/bits/shared_ptr_base.h:1431:5: note: candidate: template bool std::operator!=(const std::__shared_ptr<_Tp, _Lp>&, std::nullptr_t) operator!=(const __shared_ptr<_Tp, _Lp>& __a, nullptr_t) noexcept ^~~~~~~~ /usr/include/c++/7/bits/shared_ptr_base.h:1431:5: note: template argument deduction/substitution failed: In file included from /local/robotpkg/var/tmp/robotpkg/wip/metapod/work/metapod-1.0.10/tests/spatial/test_rotation.cc:20:0: /local/robotpkg/var/tmp/robotpkg/wip/metapod/work/metapod-1.0.10/tests/spatial/../common.hh:41:22: note: 'std::basic_istream::__istream_type {aka std::basic_istream}' is not derived from 'const std::__shared_ptr<_Tp, _Lp>' return (i >> x) != 0; ^ In file included from /usr/include/c++/7/bits/shared_ptr.h:52:0, from /usr/include/c++/7/memory:81, from /usr/include/boost/config/no_tr1/memory.hpp:21, from /usr/include/boost/smart_ptr/shared_ptr.hpp:23, from /usr/include/boost/shared_ptr.hpp:17, from /usr/include/boost/test/tools/assertion_result.hpp:21, from /usr/include/boost/test/tools/old/impl.hpp:20, from /usr/include/boost/test/test_tools.hpp:46, from /usr/include/boost/test/unit_test.hpp:18, from /local/robotpkg/var/tmp/robotpkg/wip/metapod/work/metapod-1.0.10/tests/spatial/../common.hh:35, from /local/robotpkg/var/tmp/robotpkg/wip/metapod/work/metapod-1.0.10/tests/spatial/test_rotation.cc:20: /usr/include/c++/7/bits/shared_ptr_base.h:1425:5: note: candidate: template bool std::operator!=(const std::__shared_ptr<_Tp1, _Lp>&, const std::__shared_ptr<_Tp2, _Lp>&) operator!=(const __shared_ptr<_Tp1, _Lp>& __a, ^~~~~~~~ /usr/include/c++/7/bits/shared_ptr_base.h:1425:5: note: template argument deduction/substitution failed: In file included from /local/robotpkg/var/tmp/robotpkg/wip/metapod/work/metapod-1.0.10/tests/spatial/test_rotation.cc:20:0: /local/robotpkg/var/tmp/robotpkg/wip/metapod/work/metapod-1.0.10/tests/spatial/../common.hh:41:22: note: 'std::basic_istream::__istream_type {aka std::basic_istream}' is not derived from 'const std::__shared_ptr<_Tp1, _Lp>' return (i >> x) != 0; ^ In file included from /usr/include/c++/7/memory:80:0, from /usr/include/boost/config/no_tr1/memory.hpp:21, from /usr/include/boost/smart_ptr/shared_ptr.hpp:23, from /usr/include/boost/shared_ptr.hpp:17, from /usr/include/boost/test/tools/assertion_result.hpp:21, from /usr/include/boost/test/tools/old/impl.hpp:20, from /usr/include/boost/test/test_tools.hpp:46, from /usr/include/boost/test/unit_test.hpp:18, from /local/robotpkg/var/tmp/robotpkg/wip/metapod/work/metapod-1.0.10/tests/spatial/../common.hh:35, from /local/robotpkg/var/tmp/robotpkg/wip/metapod/work/metapod-1.0.10/tests/spatial/test_rotation.cc:20: /usr/include/c++/7/bits/unique_ptr.h:711:5: note: candidate: template bool std::operator!=(std::nullptr_t, const std::unique_ptr<_Tp, _Dp>&) operator!=(nullptr_t, const unique_ptr<_Tp, _Dp>& __x) noexcept ^~~~~~~~ /usr/include/c++/7/bits/unique_ptr.h:711:5: note: template argument deduction/substitution failed: In file included from /local/robotpkg/var/tmp/robotpkg/wip/metapod/work/metapod-1.0.10/tests/spatial/test_rotation.cc:20:0: /local/robotpkg/var/tmp/robotpkg/wip/metapod/work/metapod-1.0.10/tests/spatial/../common.hh:41:22: note: mismatched types 'const std::unique_ptr<_Tp, _Dp>' and 'int' return (i >> x) != 0; ^ In file included from /usr/include/c++/7/memory:80:0, from /usr/include/boost/config/no_tr1/memory.hpp:21, from /usr/include/boost/smart_ptr/shared_ptr.hpp:23, from /usr/include/boost/shared_ptr.hpp:17, from /usr/include/boost/test/tools/assertion_result.hpp:21, from /usr/include/boost/test/tools/old/impl.hpp:20, from /usr/include/boost/test/test_tools.hpp:46, from /usr/include/boost/test/unit_test.hpp:18, from /local/robotpkg/var/tmp/robotpkg/wip/metapod/work/metapod-1.0.10/tests/spatial/../common.hh:35, from /local/robotpkg/var/tmp/robotpkg/wip/metapod/work/metapod-1.0.10/tests/spatial/test_rotation.cc:20: /usr/include/c++/7/bits/unique_ptr.h:706:5: note: candidate: template bool std::operator!=(const std::unique_ptr<_Tp, _Dp>&, std::nullptr_t) operator!=(const unique_ptr<_Tp, _Dp>& __x, nullptr_t) noexcept ^~~~~~~~ /usr/include/c++/7/bits/unique_ptr.h:706:5: note: template argument deduction/substitution failed: In file included from /local/robotpkg/var/tmp/robotpkg/wip/metapod/work/metapod-1.0.10/tests/spatial/test_rotation.cc:20:0: /local/robotpkg/var/tmp/robotpkg/wip/metapod/work/metapod-1.0.10/tests/spatial/../common.hh:41:22: note: 'std::basic_istream::__istream_type {aka std::basic_istream}' is not derived from 'const std::unique_ptr<_Tp, _Dp>' return (i >> x) != 0; ^ In file included from /usr/include/c++/7/memory:80:0, from /usr/include/boost/config/no_tr1/memory.hpp:21, from /usr/include/boost/smart_ptr/shared_ptr.hpp:23, from /usr/include/boost/shared_ptr.hpp:17, from /usr/include/boost/test/tools/assertion_result.hpp:21, from /usr/include/boost/test/tools/old/impl.hpp:20, from /usr/include/boost/test/test_tools.hpp:46, from /usr/include/boost/test/unit_test.hpp:18, from /local/robotpkg/var/tmp/robotpkg/wip/metapod/work/metapod-1.0.10/tests/spatial/../common.hh:35, from /local/robotpkg/var/tmp/robotpkg/wip/metapod/work/metapod-1.0.10/tests/spatial/test_rotation.cc:20: /usr/include/c++/7/bits/unique_ptr.h:700:5: note: candidate: template bool std::operator!=(const std::unique_ptr<_Tp, _Dp>&, const std::unique_ptr<_Up, _Ep>&) operator!=(const unique_ptr<_Tp, _Dp>& __x, ^~~~~~~~ /usr/include/c++/7/bits/unique_ptr.h:700:5: note: template argument deduction/substitution failed: In file included from /local/robotpkg/var/tmp/robotpkg/wip/metapod/work/metapod-1.0.10/tests/spatial/test_rotation.cc:20:0: /local/robotpkg/var/tmp/robotpkg/wip/metapod/work/metapod-1.0.10/tests/spatial/../common.hh:41:22: note: 'std::basic_istream::__istream_type {aka std::basic_istream}' is not derived from 'const std::unique_ptr<_Tp, _Dp>' return (i >> x) != 0; ^ In file included from /usr/include/c++/7/bits/unique_ptr.h:37:0, from /usr/include/c++/7/memory:80, from /usr/include/boost/config/no_tr1/memory.hpp:21, from /usr/include/boost/smart_ptr/shared_ptr.hpp:23, from /usr/include/boost/shared_ptr.hpp:17, from /usr/include/boost/test/tools/assertion_result.hpp:21, from /usr/include/boost/test/tools/old/impl.hpp:20, from /usr/include/boost/test/test_tools.hpp:46, from /usr/include/boost/test/unit_test.hpp:18, from /local/robotpkg/var/tmp/robotpkg/wip/metapod/work/metapod-1.0.10/tests/spatial/../common.hh:35, from /local/robotpkg/var/tmp/robotpkg/wip/metapod/work/metapod-1.0.10/tests/spatial/test_rotation.cc:20: /usr/include/c++/7/tuple:1423:5: note: candidate: template constexpr bool std::operator!=(const std::tuple<_Tps ...>&, const std::tuple<_Elements ...>&) operator!=(const tuple<_TElements...>& __t, ^~~~~~~~ /usr/include/c++/7/tuple:1423:5: note: template argument deduction/substitution failed: In file included from /local/robotpkg/var/tmp/robotpkg/wip/metapod/work/metapod-1.0.10/tests/spatial/test_rotation.cc:20:0: /local/robotpkg/var/tmp/robotpkg/wip/metapod/work/metapod-1.0.10/tests/spatial/../common.hh:41:22: note: 'std::basic_istream::__istream_type {aka std::basic_istream}' is not derived from 'const std::tuple<_Tps ...>' return (i >> x) != 0; ^ In file included from /usr/include/c++/7/tuple:39:0, from /usr/include/c++/7/bits/unique_ptr.h:37, from /usr/include/c++/7/memory:80, from /usr/include/boost/config/no_tr1/memory.hpp:21, from /usr/include/boost/smart_ptr/shared_ptr.hpp:23, from /usr/include/boost/shared_ptr.hpp:17, from /usr/include/boost/test/tools/assertion_result.hpp:21, from /usr/include/boost/test/tools/old/impl.hpp:20, from /usr/include/boost/test/test_tools.hpp:46, from /usr/include/boost/test/unit_test.hpp:18, from /local/robotpkg/var/tmp/robotpkg/wip/metapod/work/metapod-1.0.10/tests/spatial/../common.hh:35, from /local/robotpkg/var/tmp/robotpkg/wip/metapod/work/metapod-1.0.10/tests/spatial/test_rotation.cc:20: /usr/include/c++/7/array:257:5: note: candidate: template bool std::operator!=(const std::array<_Tp, _Nm>&, const std::array<_Tp, _Nm>&) operator!=(const array<_Tp, _Nm>& __one, const array<_Tp, _Nm>& __two) ^~~~~~~~ /usr/include/c++/7/array:257:5: note: template argument deduction/substitution failed: In file included from /local/robotpkg/var/tmp/robotpkg/wip/metapod/work/metapod-1.0.10/tests/spatial/test_rotation.cc:20:0: /local/robotpkg/var/tmp/robotpkg/wip/metapod/work/metapod-1.0.10/tests/spatial/../common.hh:41:22: note: 'std::basic_istream::__istream_type {aka std::basic_istream}' is not derived from 'const std::array<_Tp, _Nm>' return (i >> x) != 0; ^ In file included from /usr/include/c++/7/iterator:66:0, from /usr/include/boost/test/detail/workaround.hpp:19, from /usr/include/boost/test/detail/global_typedef.hpp:16, from /usr/include/boost/test/tree/observer.hpp:17, from /usr/include/boost/test/unit_test_log.hpp:18, from /usr/include/boost/test/tools/old/impl.hpp:19, from /usr/include/boost/test/test_tools.hpp:46, from /usr/include/boost/test/unit_test.hpp:18, from /local/robotpkg/var/tmp/robotpkg/wip/metapod/work/metapod-1.0.10/tests/spatial/../common.hh:35, from /local/robotpkg/var/tmp/robotpkg/wip/metapod/work/metapod-1.0.10/tests/spatial/test_rotation.cc:20: /usr/include/c++/7/bits/stream_iterator.h:137:5: note: candidate: template bool std::operator!=(const std::istream_iterator<_Tp, _CharT, _Traits, _Dist>&, const std::istream_iterator<_Tp, _CharT, _Traits, _Dist>&) operator!=(const istream_iterator<_Tp, _CharT, _Traits, _Dist>& __x, ^~~~~~~~ /usr/include/c++/7/bits/stream_iterator.h:137:5: note: template argument deduction/substitution failed: In file included from /local/robotpkg/var/tmp/robotpkg/wip/metapod/work/metapod-1.0.10/tests/spatial/test_rotation.cc:20:0: /local/robotpkg/var/tmp/robotpkg/wip/metapod/work/metapod-1.0.10/tests/spatial/../common.hh:41:22: note: 'std::basic_istream::__istream_type {aka std::basic_istream}' is not derived from 'const std::istream_iterator<_Tp, _CharT, _Traits, _Dist>' return (i >> x) != 0; ^ In file included from /usr/include/c++/7/bits/locale_facets.h:48:0, from /usr/include/c++/7/bits/basic_ios.h:37, from /usr/include/c++/7/ios:44, from /usr/include/c++/7/ostream:38, from /usr/include/c++/7/iostream:39, from /local/robotpkg/var/tmp/robotpkg/wip/metapod/work/metapod-1.0.10/tests/spatial/test_rotation.cc:18: /usr/include/c++/7/bits/streambuf_iterator.h:210:5: note: candidate: template bool std::operator!=(const std::istreambuf_iterator<_CharT, _Traits>&, const std::istreambuf_iterator<_CharT, _Traits>&) operator!=(const istreambuf_iterator<_CharT, _Traits>& __a, ^~~~~~~~ /usr/include/c++/7/bits/streambuf_iterator.h:210:5: note: template argument deduction/substitution failed: In file included from /local/robotpkg/var/tmp/robotpkg/wip/metapod/work/metapod-1.0.10/tests/spatial/test_rotation.cc:20:0: /local/robotpkg/var/tmp/robotpkg/wip/metapod/work/metapod-1.0.10/tests/spatial/../common.hh:41:22: note: 'std::basic_istream::__istream_type {aka std::basic_istream}' is not derived from 'const std::istreambuf_iterator<_CharT, _Traits>' return (i >> x) != 0; ^ In file included from /usr/include/c++/7/bits/ios_base.h:46:0, from /usr/include/c++/7/ios:42, from /usr/include/c++/7/ostream:38, from /usr/include/c++/7/iostream:39, from /local/robotpkg/var/tmp/robotpkg/wip/metapod/work/metapod-1.0.10/tests/spatial/test_rotation.cc:18: /usr/include/c++/7/system_error:331:3: note: candidate: bool std::operator!=(const std::error_condition&, const std::error_condition&) operator!=(const error_condition& __lhs, ^~~~~~~~ /usr/include/c++/7/system_error:331:3: note: no known conversion for argument 1 from 'std::basic_istream::__istream_type {aka std::basic_istream}' to 'const std::error_condition&' /usr/include/c++/7/system_error:327:3: note: candidate: bool std::operator!=(const std::error_condition&, const std::error_code&) operator!=(const error_condition& __lhs, const error_code& __rhs) noexcept ^~~~~~~~ /usr/include/c++/7/system_error:327:3: note: no known conversion for argument 1 from 'std::basic_istream::__istream_type {aka std::basic_istream}' to 'const std::error_condition&' /usr/include/c++/7/system_error:323:3: note: candidate: bool std::operator!=(const std::error_code&, const std::error_condition&) operator!=(const error_code& __lhs, const error_condition& __rhs) noexcept ^~~~~~~~ /usr/include/c++/7/system_error:323:3: note: no known conversion for argument 1 from 'std::basic_istream::__istream_type {aka std::basic_istream}' to 'const std::error_code&' /usr/include/c++/7/system_error:319:3: note: candidate: bool std::operator!=(const std::error_code&, const std::error_code&) operator!=(const error_code& __lhs, const error_code& __rhs) noexcept ^~~~~~~~ /usr/include/c++/7/system_error:319:3: note: no known conversion for argument 1 from 'std::basic_istream::__istream_type {aka std::basic_istream}' to 'const std::error_code&' In file included from /usr/include/c++/7/string:52:0, from /usr/include/c++/7/bits/locale_classes.h:40, from /usr/include/c++/7/bits/ios_base.h:41, from /usr/include/c++/7/ios:42, from /usr/include/c++/7/ostream:38, from /usr/include/c++/7/iostream:39, from /local/robotpkg/var/tmp/robotpkg/wip/metapod/work/metapod-1.0.10/tests/spatial/test_rotation.cc:18: /usr/include/c++/7/bits/basic_string.h:6072:5: note: candidate: template bool std::operator!=(const std::__cxx11::basic_string<_CharT, _Traits, _Alloc>&, const _CharT*) operator!=(const basic_string<_CharT, _Traits, _Alloc>& __lhs, ^~~~~~~~ /usr/include/c++/7/bits/basic_string.h:6072:5: note: template argument deduction/substitution failed: In file included from /local/robotpkg/var/tmp/robotpkg/wip/metapod/work/metapod-1.0.10/tests/spatial/test_rotation.cc:20:0: /local/robotpkg/var/tmp/robotpkg/wip/metapod/work/metapod-1.0.10/tests/spatial/../common.hh:41:22: note: 'std::basic_istream::__istream_type {aka std::basic_istream}' is not derived from 'const std::__cxx11::basic_string<_CharT, _Traits, _Alloc>' return (i >> x) != 0; ^ In file included from /usr/include/c++/7/string:52:0, from /usr/include/c++/7/bits/locale_classes.h:40, from /usr/include/c++/7/bits/ios_base.h:41, from /usr/include/c++/7/ios:42, from /usr/include/c++/7/ostream:38, from /usr/include/c++/7/iostream:39, from /local/robotpkg/var/tmp/robotpkg/wip/metapod/work/metapod-1.0.10/tests/spatial/test_rotation.cc:18: /usr/include/c++/7/bits/basic_string.h:6060:5: note: candidate: template bool std::operator!=(const _CharT*, const std::__cxx11::basic_string<_CharT, _Traits, _Alloc>&) operator!=(const _CharT* __lhs, ^~~~~~~~ /usr/include/c++/7/bits/basic_string.h:6060:5: note: template argument deduction/substitution failed: In file included from /local/robotpkg/var/tmp/robotpkg/wip/metapod/work/metapod-1.0.10/tests/spatial/test_rotation.cc:20:0: /local/robotpkg/var/tmp/robotpkg/wip/metapod/work/metapod-1.0.10/tests/spatial/../common.hh:41:22: note: mismatched types 'const _CharT*' and 'std::basic_istream' return (i >> x) != 0; ^ In file included from /usr/include/c++/7/string:52:0, from /usr/include/c++/7/bits/locale_classes.h:40, from /usr/include/c++/7/bits/ios_base.h:41, from /usr/include/c++/7/ios:42, from /usr/include/c++/7/ostream:38, from /usr/include/c++/7/iostream:39, from /local/robotpkg/var/tmp/robotpkg/wip/metapod/work/metapod-1.0.10/tests/spatial/test_rotation.cc:18: /usr/include/c++/7/bits/basic_string.h:6047:5: note: candidate: template bool std::operator!=(const std::__cxx11::basic_string<_CharT, _Traits, _Alloc>&, const std::__cxx11::basic_string<_CharT, _Traits, _Alloc>&) operator!=(const basic_string<_CharT, _Traits, _Alloc>& __lhs, ^~~~~~~~ /usr/include/c++/7/bits/basic_string.h:6047:5: note: template argument deduction/substitution failed: In file included from /local/robotpkg/var/tmp/robotpkg/wip/metapod/work/metapod-1.0.10/tests/spatial/test_rotation.cc:20:0: /local/robotpkg/var/tmp/robotpkg/wip/metapod/work/metapod-1.0.10/tests/spatial/../common.hh:41:22: note: 'std::basic_istream::__istream_type {aka std::basic_istream}' is not derived from 'const std::__cxx11::basic_string<_CharT, _Traits, _Alloc>' return (i >> x) != 0; ^ In file included from /usr/include/c++/7/string:41:0, from /usr/include/c++/7/bits/locale_classes.h:40, from /usr/include/c++/7/bits/ios_base.h:41, from /usr/include/c++/7/ios:42, from /usr/include/c++/7/ostream:38, from /usr/include/c++/7/iostream:39, from /local/robotpkg/var/tmp/robotpkg/wip/metapod/work/metapod-1.0.10/tests/spatial/test_rotation.cc:18: /usr/include/c++/7/bits/allocator.h:164:5: note: candidate: template bool std::operator!=(const std::allocator<_CharT>&, const std::allocator<_CharT>&) operator!=(const allocator<_Tp>&, const allocator<_Tp>&) ^~~~~~~~ /usr/include/c++/7/bits/allocator.h:164:5: note: template argument deduction/substitution failed: In file included from /local/robotpkg/var/tmp/robotpkg/wip/metapod/work/metapod-1.0.10/tests/spatial/test_rotation.cc:20:0: /local/robotpkg/var/tmp/robotpkg/wip/metapod/work/metapod-1.0.10/tests/spatial/../common.hh:41:22: note: 'std::basic_istream::__istream_type {aka std::basic_istream}' is not derived from 'const std::allocator<_CharT>' return (i >> x) != 0; ^ In file included from /usr/include/c++/7/string:41:0, from /usr/include/c++/7/bits/locale_classes.h:40, from /usr/include/c++/7/bits/ios_base.h:41, from /usr/include/c++/7/ios:42, from /usr/include/c++/7/ostream:38, from /usr/include/c++/7/iostream:39, from /local/robotpkg/var/tmp/robotpkg/wip/metapod/work/metapod-1.0.10/tests/spatial/test_rotation.cc:18: /usr/include/c++/7/bits/allocator.h:158:5: note: candidate: template bool std::operator!=(const std::allocator<_CharT>&, const std::allocator<_T2>&) operator!=(const allocator<_T1>&, const allocator<_T2>&) ^~~~~~~~ /usr/include/c++/7/bits/allocator.h:158:5: note: template argument deduction/substitution failed: In file included from /local/robotpkg/var/tmp/robotpkg/wip/metapod/work/metapod-1.0.10/tests/spatial/test_rotation.cc:20:0: /local/robotpkg/var/tmp/robotpkg/wip/metapod/work/metapod-1.0.10/tests/spatial/../common.hh:41:22: note: 'std::basic_istream::__istream_type {aka std::basic_istream}' is not derived from 'const std::allocator<_CharT>' return (i >> x) != 0; ^ In file included from /usr/include/c++/7/bits/stl_algobase.h:67:0, from /usr/include/c++/7/bits/char_traits.h:39, from /usr/include/c++/7/ios:40, from /usr/include/c++/7/ostream:38, from /usr/include/c++/7/iostream:39, from /local/robotpkg/var/tmp/robotpkg/wip/metapod/work/metapod-1.0.10/tests/spatial/test_rotation.cc:18: /usr/include/c++/7/bits/stl_iterator.h:1136:5: note: candidate: template bool std::operator!=(const std::move_iterator<_IteratorL>&, const std::move_iterator<_IteratorL>&) operator!=(const move_iterator<_Iterator>& __x, ^~~~~~~~ /usr/include/c++/7/bits/stl_iterator.h:1136:5: note: template argument deduction/substitution failed: In file included from /local/robotpkg/var/tmp/robotpkg/wip/metapod/work/metapod-1.0.10/tests/spatial/test_rotation.cc:20:0: /local/robotpkg/var/tmp/robotpkg/wip/metapod/work/metapod-1.0.10/tests/spatial/../common.hh:41:22: note: 'std::basic_istream::__istream_type {aka std::basic_istream}' is not derived from 'const std::move_iterator<_IteratorL>' return (i >> x) != 0; ^ In file included from /usr/include/c++/7/bits/stl_algobase.h:67:0, from /usr/include/c++/7/bits/char_traits.h:39, from /usr/include/c++/7/ios:40, from /usr/include/c++/7/ostream:38, from /usr/include/c++/7/iostream:39, from /local/robotpkg/var/tmp/robotpkg/wip/metapod/work/metapod-1.0.10/tests/spatial/test_rotation.cc:18: /usr/include/c++/7/bits/stl_iterator.h:1130:5: note: candidate: template bool std::operator!=(const std::move_iterator<_IteratorL>&, const std::move_iterator<_IteratorR>&) operator!=(const move_iterator<_IteratorL>& __x, ^~~~~~~~ /usr/include/c++/7/bits/stl_iterator.h:1130:5: note: template argument deduction/substitution failed: In file included from /local/robotpkg/var/tmp/robotpkg/wip/metapod/work/metapod-1.0.10/tests/spatial/test_rotation.cc:20:0: /local/robotpkg/var/tmp/robotpkg/wip/metapod/work/metapod-1.0.10/tests/spatial/../common.hh:41:22: note: 'std::basic_istream::__istream_type {aka std::basic_istream}' is not derived from 'const std::move_iterator<_IteratorL>' return (i >> x) != 0; ^ In file included from /usr/include/c++/7/bits/stl_algobase.h:67:0, from /usr/include/c++/7/bits/char_traits.h:39, from /usr/include/c++/7/ios:40, from /usr/include/c++/7/ostream:38, from /usr/include/c++/7/iostream:39, from /local/robotpkg/var/tmp/robotpkg/wip/metapod/work/metapod-1.0.10/tests/spatial/test_rotation.cc:18: /usr/include/c++/7/bits/stl_iterator.h:349:5: note: candidate: template bool std::operator!=(const std::reverse_iterator<_Iterator>&, const std::reverse_iterator<_IteratorR>&) operator!=(const reverse_iterator<_IteratorL>& __x, ^~~~~~~~ /usr/include/c++/7/bits/stl_iterator.h:349:5: note: template argument deduction/substitution failed: In file included from /local/robotpkg/var/tmp/robotpkg/wip/metapod/work/metapod-1.0.10/tests/spatial/test_rotation.cc:20:0: /local/robotpkg/var/tmp/robotpkg/wip/metapod/work/metapod-1.0.10/tests/spatial/../common.hh:41:22: note: 'std::basic_istream::__istream_type {aka std::basic_istream}' is not derived from 'const std::reverse_iterator<_Iterator>' return (i >> x) != 0; ^ In file included from /usr/include/c++/7/bits/stl_algobase.h:67:0, from /usr/include/c++/7/bits/char_traits.h:39, from /usr/include/c++/7/ios:40, from /usr/include/c++/7/ostream:38, from /usr/include/c++/7/iostream:39, from /local/robotpkg/var/tmp/robotpkg/wip/metapod/work/metapod-1.0.10/tests/spatial/test_rotation.cc:18: /usr/include/c++/7/bits/stl_iterator.h:311:5: note: candidate: template bool std::operator!=(const std::reverse_iterator<_Iterator>&, const std::reverse_iterator<_Iterator>&) operator!=(const reverse_iterator<_Iterator>& __x, ^~~~~~~~ /usr/include/c++/7/bits/stl_iterator.h:311:5: note: template argument deduction/substitution failed: In file included from /local/robotpkg/var/tmp/robotpkg/wip/metapod/work/metapod-1.0.10/tests/spatial/test_rotation.cc:20:0: /local/robotpkg/var/tmp/robotpkg/wip/metapod/work/metapod-1.0.10/tests/spatial/../common.hh:41:22: note: 'std::basic_istream::__istream_type {aka std::basic_istream}' is not derived from 'const std::reverse_iterator<_Iterator>' return (i >> x) != 0; ^ In file included from /usr/include/c++/7/bits/stl_algobase.h:64:0, from /usr/include/c++/7/bits/char_traits.h:39, from /usr/include/c++/7/ios:40, from /usr/include/c++/7/ostream:38, from /usr/include/c++/7/iostream:39, from /local/robotpkg/var/tmp/robotpkg/wip/metapod/work/metapod-1.0.10/tests/spatial/test_rotation.cc:18: /usr/include/c++/7/bits/stl_pair.h:456:5: note: candidate: template constexpr bool std::operator!=(const std::pair<_T1, _T2>&, const std::pair<_T1, _T2>&) operator!=(const pair<_T1, _T2>& __x, const pair<_T1, _T2>& __y) ^~~~~~~~ /usr/include/c++/7/bits/stl_pair.h:456:5: note: template argument deduction/substitution failed: In file included from /local/robotpkg/var/tmp/robotpkg/wip/metapod/work/metapod-1.0.10/tests/spatial/test_rotation.cc:20:0: /local/robotpkg/var/tmp/robotpkg/wip/metapod/work/metapod-1.0.10/tests/spatial/../common.hh:41:22: note: 'std::basic_istream::__istream_type {aka std::basic_istream}' is not derived from 'const std::pair<_T1, _T2>' return (i >> x) != 0; ^ In file included from /usr/include/c++/7/iosfwd:40:0, from /usr/include/c++/7/ios:38, from /usr/include/c++/7/ostream:38, from /usr/include/c++/7/iostream:39, from /local/robotpkg/var/tmp/robotpkg/wip/metapod/work/metapod-1.0.10/tests/spatial/test_rotation.cc:18: /usr/include/c++/7/bits/postypes.h:221:5: note: candidate: template bool std::operator!=(const std::fpos<_StateT>&, const std::fpos<_StateT>&) operator!=(const fpos<_StateT>& __lhs, const fpos<_StateT>& __rhs) ^~~~~~~~ /usr/include/c++/7/bits/postypes.h:221:5: note: template argument deduction/substitution failed: In file included from /local/robotpkg/var/tmp/robotpkg/wip/metapod/work/metapod-1.0.10/tests/spatial/test_rotation.cc:20:0: /local/robotpkg/var/tmp/robotpkg/wip/metapod/work/metapod-1.0.10/tests/spatial/../common.hh:41:22: note: 'std::basic_istream::__istream_type {aka std::basic_istream}' is not derived from 'const std::fpos<_StateT>' return (i >> x) != 0; ^ In file included from /local/robotpkg/var/tmp/robotpkg/wip/metapod/work/metapod-1.0.10/tests/spatial/test_doubledef.cc:23:0: /local/robotpkg/var/tmp/robotpkg/wip/metapod/work/metapod-1.0.10/tests/spatial/../common.hh: In function 'bool stringToDouble(const string&, double&)': /local/robotpkg/var/tmp/robotpkg/wip/metapod/work/metapod-1.0.10/tests/spatial/../common.hh:41:19: error: no match for 'operator!=' (operand types are 'std::basic_istream::__istream_type {aka std::basic_istream}' and 'int') return (i >> x) != 0; ~~~~~~~~~^~~~ /local/robotpkg/var/tmp/robotpkg/wip/metapod/work/metapod-1.0.10/tests/spatial/../common.hh:41:19: note: candidate: operator!=(int, int) /local/robotpkg/var/tmp/robotpkg/wip/metapod/work/metapod-1.0.10/tests/spatial/../common.hh:41:19: note: no known conversion for argument 1 from 'std::basic_istream::__istream_type {aka std::basic_istream}' to 'int' In file included from /usr/include/c++/7/list:63:0, from /usr/include/boost/test/tree/auto_registration.hpp:24, from /usr/include/boost/test/unit_test_suite.hpp:17, from /usr/include/boost/test/unit_test.hpp:19, from /local/robotpkg/var/tmp/robotpkg/wip/metapod/work/metapod-1.0.10/tests/spatial/../common.hh:35, from /local/robotpkg/var/tmp/robotpkg/wip/metapod/work/metapod-1.0.10/tests/spatial/test_doubledef.cc:23: /usr/include/c++/7/bits/stl_list.h:1925:5: note: candidate: template bool std::operator!=(const std::__cxx11::list<_Tp, _Alloc>&, const std::__cxx11::list<_Tp, _Alloc>&) operator!=(const list<_Tp, _Alloc>& __x, const list<_Tp, _Alloc>& __y) ^~~~~~~~ /usr/include/c++/7/bits/stl_list.h:1925:5: note: template argument deduction/substitution failed: In file included from /local/robotpkg/var/tmp/robotpkg/wip/metapod/work/metapod-1.0.10/tests/spatial/test_doubledef.cc:23:0: /local/robotpkg/var/tmp/robotpkg/wip/metapod/work/metapod-1.0.10/tests/spatial/../common.hh:41:22: note: 'std::basic_istream::__istream_type {aka std::basic_istream}' is not derived from 'const std::__cxx11::list<_Tp, _Alloc>' return (i >> x) != 0; ^ In file included from /usr/include/c++/7/list:63:0, from /usr/include/boost/test/tree/auto_registration.hpp:24, from /usr/include/boost/test/unit_test_suite.hpp:17, from /usr/include/boost/test/unit_test.hpp:19, from /local/robotpkg/var/tmp/robotpkg/wip/metapod/work/metapod-1.0.10/tests/spatial/../common.hh:35, from /local/robotpkg/var/tmp/robotpkg/wip/metapod/work/metapod-1.0.10/tests/spatial/test_doubledef.cc:23: /usr/include/c++/7/bits/stl_list.h:293:5: note: candidate: template bool std::operator!=(const std::_List_iterator<_Tp>&, const std::_List_const_iterator<_Tp>&) operator!=(const _List_iterator<_Val>& __x, ^~~~~~~~ /usr/include/c++/7/bits/stl_list.h:293:5: note: template argument deduction/substitution failed: In file included from /local/robotpkg/var/tmp/robotpkg/wip/metapod/work/metapod-1.0.10/tests/spatial/test_doubledef.cc:23:0: /local/robotpkg/var/tmp/robotpkg/wip/metapod/work/metapod-1.0.10/tests/spatial/../common.hh:41:22: note: 'std::basic_istream::__istream_type {aka std::basic_istream}' is not derived from 'const std::_List_iterator<_Tp>' return (i >> x) != 0; ^ In file included from /usr/include/c++/7/map:62:0, from /usr/include/boost/test/tree/test_unit.hpp:35, from /usr/include/boost/test/tree/auto_registration.hpp:21, from /usr/include/boost/test/unit_test_suite.hpp:17, from /usr/include/boost/test/unit_test.hpp:19, from /local/robotpkg/var/tmp/robotpkg/wip/metapod/work/metapod-1.0.10/tests/spatial/../common.hh:35, from /local/robotpkg/var/tmp/robotpkg/wip/metapod/work/metapod-1.0.10/tests/spatial/test_doubledef.cc:23: /usr/include/c++/7/bits/stl_multimap.h:1085:5: note: candidate: template bool std::operator!=(const std::multimap<_Key, _Tp, _Compare, _Alloc>&, const std::multimap<_Key, _Tp, _Compare, _Alloc>&) operator!=(const multimap<_Key, _Tp, _Compare, _Alloc>& __x, ^~~~~~~~ /usr/include/c++/7/bits/stl_multimap.h:1085:5: note: template argument deduction/substitution failed: In file included from /local/robotpkg/var/tmp/robotpkg/wip/metapod/work/metapod-1.0.10/tests/spatial/test_doubledef.cc:23:0: /local/robotpkg/var/tmp/robotpkg/wip/metapod/work/metapod-1.0.10/tests/spatial/../common.hh:41:22: note: 'std::basic_istream::__istream_type {aka std::basic_istream}' is not derived from 'const std::multimap<_Key, _Tp, _Compare, _Alloc>' return (i >> x) != 0; ^ In file included from /usr/include/c++/7/map:61:0, from /usr/include/boost/test/tree/test_unit.hpp:35, from /usr/include/boost/test/tree/auto_registration.hpp:21, from /usr/include/boost/test/unit_test_suite.hpp:17, from /usr/include/boost/test/unit_test.hpp:19, from /local/robotpkg/var/tmp/robotpkg/wip/metapod/work/metapod-1.0.10/tests/spatial/../common.hh:35, from /local/robotpkg/var/tmp/robotpkg/wip/metapod/work/metapod-1.0.10/tests/spatial/test_doubledef.cc:23: /usr/include/c++/7/bits/stl_map.h:1419:5: note: candidate: template bool std::operator!=(const std::map<_Key, _Tp, _Compare, _Alloc>&, const std::map<_Key, _Tp, _Compare, _Alloc>&) operator!=(const map<_Key, _Tp, _Compare, _Alloc>& __x, ^~~~~~~~ /usr/include/c++/7/bits/stl_map.h:1419:5: note: template argument deduction/substitution failed: In file included from /local/robotpkg/var/tmp/robotpkg/wip/metapod/work/metapod-1.0.10/tests/spatial/test_doubledef.cc:23:0: /local/robotpkg/var/tmp/robotpkg/wip/metapod/work/metapod-1.0.10/tests/spatial/../common.hh:41:22: note: 'std::basic_istream::__istream_type {aka std::basic_istream}' is not derived from 'const std::map<_Key, _Tp, _Compare, _Alloc>' return (i >> x) != 0; ^ In file included from /usr/include/c++/7/map:60:0, from /usr/include/boost/test/tree/test_unit.hpp:35, from /usr/include/boost/test/tree/auto_registration.hpp:21, from /usr/include/boost/test/unit_test_suite.hpp:17, from /usr/include/boost/test/unit_test.hpp:19, from /local/robotpkg/var/tmp/robotpkg/wip/metapod/work/metapod-1.0.10/tests/spatial/../common.hh:35, from /local/robotpkg/var/tmp/robotpkg/wip/metapod/work/metapod-1.0.10/tests/spatial/test_doubledef.cc:23: /usr/include/c++/7/bits/stl_tree.h:1553:5: note: candidate: template bool std::operator!=(const std::_Rb_tree<_Key, _Val, _KeyOfValue, _Compare, _Alloc>&, const std::_Rb_tree<_Key, _Val, _KeyOfValue, _Compare, _Alloc>&) operator!=(const _Rb_tree<_Key, _Val, _KeyOfValue, _Compare, _Alloc>& __x, ^~~~~~~~ /usr/include/c++/7/bits/stl_tree.h:1553:5: note: template argument deduction/substitution failed: In file included from /local/robotpkg/var/tmp/robotpkg/wip/metapod/work/metapod-1.0.10/tests/spatial/test_doubledef.cc:23:0: /local/robotpkg/var/tmp/robotpkg/wip/metapod/work/metapod-1.0.10/tests/spatial/../common.hh:41:22: note: 'std::basic_istream::__istream_type {aka std::basic_istream}' is not derived from 'const std::_Rb_tree<_Key, _Val, _KeyOfValue, _Compare, _Alloc>' return (i >> x) != 0; ^ In file included from /usr/include/c++/7/map:60:0, from /usr/include/boost/test/tree/test_unit.hpp:35, from /usr/include/boost/test/tree/auto_registration.hpp:21, from /usr/include/boost/test/unit_test_suite.hpp:17, from /usr/include/boost/test/unit_test.hpp:19, from /local/robotpkg/var/tmp/robotpkg/wip/metapod/work/metapod-1.0.10/tests/spatial/../common.hh:35, from /local/robotpkg/var/tmp/robotpkg/wip/metapod/work/metapod-1.0.10/tests/spatial/test_doubledef.cc:23: /usr/include/c++/7/bits/stl_tree.h:412:5: note: candidate: template bool std::operator!=(const std::_Rb_tree_iterator<_Tp>&, const std::_Rb_tree_const_iterator<_Val>&) operator!=(const _Rb_tree_iterator<_Val>& __x, ^~~~~~~~ /usr/include/c++/7/bits/stl_tree.h:412:5: note: template argument deduction/substitution failed: In file included from /local/robotpkg/var/tmp/robotpkg/wip/metapod/work/metapod-1.0.10/tests/spatial/test_doubledef.cc:23:0: /local/robotpkg/var/tmp/robotpkg/wip/metapod/work/metapod-1.0.10/tests/spatial/../common.hh:41:22: note: 'std::basic_istream::__istream_type {aka std::basic_istream}' is not derived from 'const std::_Rb_tree_iterator<_Tp>' return (i >> x) != 0; ^ In file included from /usr/include/c++/7/vector:64:0, from /usr/include/boost/test/tree/decorator.hpp:37, from /usr/include/boost/test/tools/fpc_tolerance.hpp:19, from /usr/include/boost/test/tools/fpc_op.hpp:19, from /usr/include/boost/test/test_tools.hpp:54, from /usr/include/boost/test/unit_test.hpp:18, from /local/robotpkg/var/tmp/robotpkg/wip/metapod/work/metapod-1.0.10/tests/spatial/../common.hh:35, from /local/robotpkg/var/tmp/robotpkg/wip/metapod/work/metapod-1.0.10/tests/spatial/test_doubledef.cc:23: /usr/include/c++/7/bits/stl_vector.h:1620:5: note: candidate: template bool std::operator!=(const std::vector<_Tp, _Alloc>&, const std::vector<_Tp, _Alloc>&) operator!=(const vector<_Tp, _Alloc>& __x, const vector<_Tp, _Alloc>& __y) ^~~~~~~~ /usr/include/c++/7/bits/stl_vector.h:1620:5: note: template argument deduction/substitution failed: In file included from /local/robotpkg/var/tmp/robotpkg/wip/metapod/work/metapod-1.0.10/tests/spatial/test_doubledef.cc:23:0: /local/robotpkg/var/tmp/robotpkg/wip/metapod/work/metapod-1.0.10/tests/spatial/../common.hh:41:22: note: 'std::basic_istream::__istream_type {aka std::basic_istream}' is not derived from 'const std::vector<_Tp, _Alloc>' return (i >> x) != 0; ^ In file included from /usr/include/c++/7/functional:58:0, from /usr/include/boost/smart_ptr/detail/shared_count.hpp:38, from /usr/include/boost/smart_ptr/shared_ptr.hpp:28, from /usr/include/boost/shared_ptr.hpp:17, from /usr/include/boost/test/tools/assertion_result.hpp:21, from /usr/include/boost/test/tools/old/impl.hpp:20, from /usr/include/boost/test/test_tools.hpp:46, from /usr/include/boost/test/unit_test.hpp:18, from /local/robotpkg/var/tmp/robotpkg/wip/metapod/work/metapod-1.0.10/tests/spatial/../common.hh:35, from /local/robotpkg/var/tmp/robotpkg/wip/metapod/work/metapod-1.0.10/tests/spatial/test_doubledef.cc:23: /usr/include/c++/7/bits/std_function.h:788:5: note: candidate: template bool std::operator!=(std::nullptr_t, const std::function<_Res(_ArgTypes ...)>&) operator!=(nullptr_t, const function<_Res(_Args...)>& __f) noexcept ^~~~~~~~ /usr/include/c++/7/bits/std_function.h:788:5: note: template argument deduction/substitution failed: In file included from /local/robotpkg/var/tmp/robotpkg/wip/metapod/work/metapod-1.0.10/tests/spatial/test_doubledef.cc:23:0: /local/robotpkg/var/tmp/robotpkg/wip/metapod/work/metapod-1.0.10/tests/spatial/../common.hh:41:22: note: mismatched types 'const std::function<_Res(_ArgTypes ...)>' and 'int' return (i >> x) != 0; ^ In file included from /usr/include/c++/7/functional:58:0, from /usr/include/boost/smart_ptr/detail/shared_count.hpp:38, from /usr/include/boost/smart_ptr/shared_ptr.hpp:28, from /usr/include/boost/shared_ptr.hpp:17, from /usr/include/boost/test/tools/assertion_result.hpp:21, from /usr/include/boost/test/tools/old/impl.hpp:20, from /usr/include/boost/test/test_tools.hpp:46, from /usr/include/boost/test/unit_test.hpp:18, from /local/robotpkg/var/tmp/robotpkg/wip/metapod/work/metapod-1.0.10/tests/spatial/../common.hh:35, from /local/robotpkg/var/tmp/robotpkg/wip/metapod/work/metapod-1.0.10/tests/spatial/test_doubledef.cc:23: /usr/include/c++/7/bits/std_function.h:782:5: note: candidate: template bool std::operator!=(const std::function<_Res(_ArgTypes ...)>&, std::nullptr_t) operator!=(const function<_Res(_Args...)>& __f, nullptr_t) noexcept ^~~~~~~~ /usr/include/c++/7/bits/std_function.h:782:5: note: template argument deduction/substitution failed: In file included from /local/robotpkg/var/tmp/robotpkg/wip/metapod/work/metapod-1.0.10/tests/spatial/test_doubledef.cc:23:0: /local/robotpkg/var/tmp/robotpkg/wip/metapod/work/metapod-1.0.10/tests/spatial/../common.hh:41:22: note: 'std::basic_istream::__istream_type {aka std::basic_istream}' is not derived from 'const std::function<_Res(_ArgTypes ...)>' return (i >> x) != 0; ^ In file included from /usr/include/c++/7/memory:81:0, from /usr/include/boost/config/no_tr1/memory.hpp:21, from /usr/include/boost/smart_ptr/shared_ptr.hpp:23, from /usr/include/boost/shared_ptr.hpp:17, from /usr/include/boost/test/tools/assertion_result.hpp:21, from /usr/include/boost/test/tools/old/impl.hpp:20, from /usr/include/boost/test/test_tools.hpp:46, from /usr/include/boost/test/unit_test.hpp:18, from /local/robotpkg/var/tmp/robotpkg/wip/metapod/work/metapod-1.0.10/tests/spatial/../common.hh:35, from /local/robotpkg/var/tmp/robotpkg/wip/metapod/work/metapod-1.0.10/tests/spatial/test_doubledef.cc:23: /usr/include/c++/7/bits/shared_ptr.h:393:5: note: candidate: template bool std::operator!=(std::nullptr_t, const std::shared_ptr<_Tp>&) operator!=(nullptr_t, const shared_ptr<_Tp>& __a) noexcept ^~~~~~~~ /usr/include/c++/7/bits/shared_ptr.h:393:5: note: template argument deduction/substitution failed: In file included from /local/robotpkg/var/tmp/robotpkg/wip/metapod/work/metapod-1.0.10/tests/spatial/test_doubledef.cc:23:0: /local/robotpkg/var/tmp/robotpkg/wip/metapod/work/metapod-1.0.10/tests/spatial/../common.hh:41:22: note: mismatched types 'const std::shared_ptr<_Tp>' and 'int' return (i >> x) != 0; ^ In file included from /usr/include/c++/7/memory:81:0, from /usr/include/boost/config/no_tr1/memory.hpp:21, from /usr/include/boost/smart_ptr/shared_ptr.hpp:23, from /usr/include/boost/shared_ptr.hpp:17, from /usr/include/boost/test/tools/assertion_result.hpp:21, from /usr/include/boost/test/tools/old/impl.hpp:20, from /usr/include/boost/test/test_tools.hpp:46, from /usr/include/boost/test/unit_test.hpp:18, from /local/robotpkg/var/tmp/robotpkg/wip/metapod/work/metapod-1.0.10/tests/spatial/../common.hh:35, from /local/robotpkg/var/tmp/robotpkg/wip/metapod/work/metapod-1.0.10/tests/spatial/test_doubledef.cc:23: /usr/include/c++/7/bits/shared_ptr.h:388:5: note: candidate: template bool std::operator!=(const std::shared_ptr<_Tp>&, std::nullptr_t) operator!=(const shared_ptr<_Tp>& __a, nullptr_t) noexcept ^~~~~~~~ /usr/include/c++/7/bits/shared_ptr.h:388:5: note: template argument deduction/substitution failed: In file included from /local/robotpkg/var/tmp/robotpkg/wip/metapod/work/metapod-1.0.10/tests/spatial/test_doubledef.cc:23:0: /local/robotpkg/var/tmp/robotpkg/wip/metapod/work/metapod-1.0.10/tests/spatial/../common.hh:41:22: note: 'std::basic_istream::__istream_type {aka std::basic_istream}' is not derived from 'const std::shared_ptr<_Tp>' return (i >> x) != 0; ^ In file included from /usr/include/c++/7/memory:81:0, from /usr/include/boost/config/no_tr1/memory.hpp:21, from /usr/include/boost/smart_ptr/shared_ptr.hpp:23, from /usr/include/boost/shared_ptr.hpp:17, from /usr/include/boost/test/tools/assertion_result.hpp:21, from /usr/include/boost/test/tools/old/impl.hpp:20, from /usr/include/boost/test/test_tools.hpp:46, from /usr/include/boost/test/unit_test.hpp:18, from /local/robotpkg/var/tmp/robotpkg/wip/metapod/work/metapod-1.0.10/tests/spatial/../common.hh:35, from /local/robotpkg/var/tmp/robotpkg/wip/metapod/work/metapod-1.0.10/tests/spatial/test_doubledef.cc:23: /usr/include/c++/7/bits/shared_ptr.h:383:5: note: candidate: template bool std::operator!=(const std::shared_ptr<_Tp>&, const std::shared_ptr<_Up>&) operator!=(const shared_ptr<_Tp>& __a, const shared_ptr<_Up>& __b) noexcept ^~~~~~~~ /usr/include/c++/7/bits/shared_ptr.h:383:5: note: template argument deduction/substitution failed: In file included from /local/robotpkg/var/tmp/robotpkg/wip/metapod/work/metapod-1.0.10/tests/spatial/test_doubledef.cc:23:0: /local/robotpkg/var/tmp/robotpkg/wip/metapod/work/metapod-1.0.10/tests/spatial/../common.hh:41:22: note: 'std::basic_istream::__istream_type {aka std::basic_istream}' is not derived from 'const std::shared_ptr<_Tp>' return (i >> x) != 0; ^ In file included from /usr/include/c++/7/bits/shared_ptr.h:52:0, from /usr/include/c++/7/memory:81, from /usr/include/boost/config/no_tr1/memory.hpp:21, from /usr/include/boost/smart_ptr/shared_ptr.hpp:23, from /usr/include/boost/shared_ptr.hpp:17, from /usr/include/boost/test/tools/assertion_result.hpp:21, from /usr/include/boost/test/tools/old/impl.hpp:20, from /usr/include/boost/test/test_tools.hpp:46, from /usr/include/boost/test/unit_test.hpp:18, from /local/robotpkg/var/tmp/robotpkg/wip/metapod/work/metapod-1.0.10/tests/spatial/../common.hh:35, from /local/robotpkg/var/tmp/robotpkg/wip/metapod/work/metapod-1.0.10/tests/spatial/test_doubledef.cc:23: /usr/include/c++/7/bits/shared_ptr_base.h:1436:5: note: candidate: template bool std::operator!=(std::nullptr_t, const std::__shared_ptr<_Tp, _Lp>&) operator!=(nullptr_t, const __shared_ptr<_Tp, _Lp>& __a) noexcept ^~~~~~~~ /usr/include/c++/7/bits/shared_ptr_base.h:1436:5: note: template argument deduction/substitution failed: In file included from /local/robotpkg/var/tmp/robotpkg/wip/metapod/work/metapod-1.0.10/tests/spatial/test_doubledef.cc:23:0: /local/robotpkg/var/tmp/robotpkg/wip/metapod/work/metapod-1.0.10/tests/spatial/../common.hh:41:22: note: mismatched types 'const std::__shared_ptr<_Tp, _Lp>' and 'int' return (i >> x) != 0; ^ In file included from /usr/include/c++/7/bits/shared_ptr.h:52:0, from /usr/include/c++/7/memory:81, from /usr/include/boost/config/no_tr1/memory.hpp:21, from /usr/include/boost/smart_ptr/shared_ptr.hpp:23, from /usr/include/boost/shared_ptr.hpp:17, from /usr/include/boost/test/tools/assertion_result.hpp:21, from /usr/include/boost/test/tools/old/impl.hpp:20, from /usr/include/boost/test/test_tools.hpp:46, from /usr/include/boost/test/unit_test.hpp:18, from /local/robotpkg/var/tmp/robotpkg/wip/metapod/work/metapod-1.0.10/tests/spatial/../common.hh:35, from /local/robotpkg/var/tmp/robotpkg/wip/metapod/work/metapod-1.0.10/tests/spatial/test_doubledef.cc:23: /usr/include/c++/7/bits/shared_ptr_base.h:1431:5: note: candidate: template bool std::operator!=(const std::__shared_ptr<_Tp, _Lp>&, std::nullptr_t) operator!=(const __shared_ptr<_Tp, _Lp>& __a, nullptr_t) noexcept ^~~~~~~~ /usr/include/c++/7/bits/shared_ptr_base.h:1431:5: note: template argument deduction/substitution failed: In file included from /local/robotpkg/var/tmp/robotpkg/wip/metapod/work/metapod-1.0.10/tests/spatial/test_doubledef.cc:23:0: /local/robotpkg/var/tmp/robotpkg/wip/metapod/work/metapod-1.0.10/tests/spatial/../common.hh:41:22: note: 'std::basic_istream::__istream_type {aka std::basic_istream}' is not derived from 'const std::__shared_ptr<_Tp, _Lp>' return (i >> x) != 0; ^ In file included from /usr/include/c++/7/bits/shared_ptr.h:52:0, from /usr/include/c++/7/memory:81, from /usr/include/boost/config/no_tr1/memory.hpp:21, from /usr/include/boost/smart_ptr/shared_ptr.hpp:23, from /usr/include/boost/shared_ptr.hpp:17, from /usr/include/boost/test/tools/assertion_result.hpp:21, from /usr/include/boost/test/tools/old/impl.hpp:20, from /usr/include/boost/test/test_tools.hpp:46, from /usr/include/boost/test/unit_test.hpp:18, from /local/robotpkg/var/tmp/robotpkg/wip/metapod/work/metapod-1.0.10/tests/spatial/../common.hh:35, from /local/robotpkg/var/tmp/robotpkg/wip/metapod/work/metapod-1.0.10/tests/spatial/test_doubledef.cc:23: /usr/include/c++/7/bits/shared_ptr_base.h:1425:5: note: candidate: template bool std::operator!=(const std::__shared_ptr<_Tp1, _Lp>&, const std::__shared_ptr<_Tp2, _Lp>&) operator!=(const __shared_ptr<_Tp1, _Lp>& __a, ^~~~~~~~ /usr/include/c++/7/bits/shared_ptr_base.h:1425:5: note: template argument deduction/substitution failed: In file included from /local/robotpkg/var/tmp/robotpkg/wip/metapod/work/metapod-1.0.10/tests/spatial/test_doubledef.cc:23:0: /local/robotpkg/var/tmp/robotpkg/wip/metapod/work/metapod-1.0.10/tests/spatial/../common.hh:41:22: note: 'std::basic_istream::__istream_type {aka std::basic_istream}' is not derived from 'const std::__shared_ptr<_Tp1, _Lp>' return (i >> x) != 0; ^ In file included from /usr/include/c++/7/memory:80:0, from /usr/include/boost/config/no_tr1/memory.hpp:21, from /usr/include/boost/smart_ptr/shared_ptr.hpp:23, from /usr/include/boost/shared_ptr.hpp:17, from /usr/include/boost/test/tools/assertion_result.hpp:21, from /usr/include/boost/test/tools/old/impl.hpp:20, from /usr/include/boost/test/test_tools.hpp:46, from /usr/include/boost/test/unit_test.hpp:18, from /local/robotpkg/var/tmp/robotpkg/wip/metapod/work/metapod-1.0.10/tests/spatial/../common.hh:35, from /local/robotpkg/var/tmp/robotpkg/wip/metapod/work/metapod-1.0.10/tests/spatial/test_doubledef.cc:23: /usr/include/c++/7/bits/unique_ptr.h:711:5: note: candidate: template bool std::operator!=(std::nullptr_t, const std::unique_ptr<_Tp, _Dp>&) operator!=(nullptr_t, const unique_ptr<_Tp, _Dp>& __x) noexcept ^~~~~~~~ /usr/include/c++/7/bits/unique_ptr.h:711:5: note: template argument deduction/substitution failed: In file included from /local/robotpkg/var/tmp/robotpkg/wip/metapod/work/metapod-1.0.10/tests/spatial/test_doubledef.cc:23:0: /local/robotpkg/var/tmp/robotpkg/wip/metapod/work/metapod-1.0.10/tests/spatial/../common.hh:41:22: note: mismatched types 'const std::unique_ptr<_Tp, _Dp>' and 'int' return (i >> x) != 0; ^ In file included from /usr/include/c++/7/memory:80:0, from /usr/include/boost/config/no_tr1/memory.hpp:21, from /usr/include/boost/smart_ptr/shared_ptr.hpp:23, from /usr/include/boost/shared_ptr.hpp:17, from /usr/include/boost/test/tools/assertion_result.hpp:21, from /usr/include/boost/test/tools/old/impl.hpp:20, from /usr/include/boost/test/test_tools.hpp:46, from /usr/include/boost/test/unit_test.hpp:18, from /local/robotpkg/var/tmp/robotpkg/wip/metapod/work/metapod-1.0.10/tests/spatial/../common.hh:35, from /local/robotpkg/var/tmp/robotpkg/wip/metapod/work/metapod-1.0.10/tests/spatial/test_doubledef.cc:23: /usr/include/c++/7/bits/unique_ptr.h:706:5: note: candidate: template bool std::operator!=(const std::unique_ptr<_Tp, _Dp>&, std::nullptr_t) operator!=(const unique_ptr<_Tp, _Dp>& __x, nullptr_t) noexcept ^~~~~~~~ /usr/include/c++/7/bits/unique_ptr.h:706:5: note: template argument deduction/substitution failed: In file included from /local/robotpkg/var/tmp/robotpkg/wip/metapod/work/metapod-1.0.10/tests/spatial/test_doubledef.cc:23:0: /local/robotpkg/var/tmp/robotpkg/wip/metapod/work/metapod-1.0.10/tests/spatial/../common.hh:41:22: note: 'std::basic_istream::__istream_type {aka std::basic_istream}' is not derived from 'const std::unique_ptr<_Tp, _Dp>' return (i >> x) != 0; ^ In file included from /usr/include/c++/7/memory:80:0, from /usr/include/boost/config/no_tr1/memory.hpp:21, from /usr/include/boost/smart_ptr/shared_ptr.hpp:23, from /usr/include/boost/shared_ptr.hpp:17, from /usr/include/boost/test/tools/assertion_result.hpp:21, from /usr/include/boost/test/tools/old/impl.hpp:20, from /usr/include/boost/test/test_tools.hpp:46, from /usr/include/boost/test/unit_test.hpp:18, from /local/robotpkg/var/tmp/robotpkg/wip/metapod/work/metapod-1.0.10/tests/spatial/../common.hh:35, from /local/robotpkg/var/tmp/robotpkg/wip/metapod/work/metapod-1.0.10/tests/spatial/test_doubledef.cc:23: /usr/include/c++/7/bits/unique_ptr.h:700:5: note: candidate: template bool std::operator!=(const std::unique_ptr<_Tp, _Dp>&, const std::unique_ptr<_Up, _Ep>&) operator!=(const unique_ptr<_Tp, _Dp>& __x, ^~~~~~~~ /usr/include/c++/7/bits/unique_ptr.h:700:5: note: template argument deduction/substitution failed: In file included from /local/robotpkg/var/tmp/robotpkg/wip/metapod/work/metapod-1.0.10/tests/spatial/test_doubledef.cc:23:0: /local/robotpkg/var/tmp/robotpkg/wip/metapod/work/metapod-1.0.10/tests/spatial/../common.hh:41:22: note: 'std::basic_istream::__istream_type {aka std::basic_istream}' is not derived from 'const std::unique_ptr<_Tp, _Dp>' return (i >> x) != 0; ^ In file included from /usr/include/c++/7/bits/unique_ptr.h:37:0, from /usr/include/c++/7/memory:80, from /usr/include/boost/config/no_tr1/memory.hpp:21, from /usr/include/boost/smart_ptr/shared_ptr.hpp:23, from /usr/include/boost/shared_ptr.hpp:17, from /usr/include/boost/test/tools/assertion_result.hpp:21, from /usr/include/boost/test/tools/old/impl.hpp:20, from /usr/include/boost/test/test_tools.hpp:46, from /usr/include/boost/test/unit_test.hpp:18, from /local/robotpkg/var/tmp/robotpkg/wip/metapod/work/metapod-1.0.10/tests/spatial/../common.hh:35, from /local/robotpkg/var/tmp/robotpkg/wip/metapod/work/metapod-1.0.10/tests/spatial/test_doubledef.cc:23: /usr/include/c++/7/tuple:1423:5: note: candidate: template constexpr bool std::operator!=(const std::tuple<_Tps ...>&, const std::tuple<_Elements ...>&) operator!=(const tuple<_TElements...>& __t, ^~~~~~~~ /usr/include/c++/7/tuple:1423:5: note: template argument deduction/substitution failed: In file included from /local/robotpkg/var/tmp/robotpkg/wip/metapod/work/metapod-1.0.10/tests/spatial/test_doubledef.cc:23:0: /local/robotpkg/var/tmp/robotpkg/wip/metapod/work/metapod-1.0.10/tests/spatial/../common.hh:41:22: note: 'std::basic_istream::__istream_type {aka std::basic_istream}' is not derived from 'const std::tuple<_Tps ...>' return (i >> x) != 0; ^ In file included from /usr/include/c++/7/tuple:39:0, from /usr/include/c++/7/bits/unique_ptr.h:37, from /usr/include/c++/7/memory:80, from /usr/include/boost/config/no_tr1/memory.hpp:21, from /usr/include/boost/smart_ptr/shared_ptr.hpp:23, from /usr/include/boost/shared_ptr.hpp:17, from /usr/include/boost/test/tools/assertion_result.hpp:21, from /usr/include/boost/test/tools/old/impl.hpp:20, from /usr/include/boost/test/test_tools.hpp:46, from /usr/include/boost/test/unit_test.hpp:18, from /local/robotpkg/var/tmp/robotpkg/wip/metapod/work/metapod-1.0.10/tests/spatial/../common.hh:35, from /local/robotpkg/var/tmp/robotpkg/wip/metapod/work/metapod-1.0.10/tests/spatial/test_doubledef.cc:23: /usr/include/c++/7/array:257:5: note: candidate: template bool std::operator!=(const std::array<_Tp, _Nm>&, const std::array<_Tp, _Nm>&) operator!=(const array<_Tp, _Nm>& __one, const array<_Tp, _Nm>& __two) ^~~~~~~~ /usr/include/c++/7/array:257:5: note: template argument deduction/substitution failed: In file included from /local/robotpkg/var/tmp/robotpkg/wip/metapod/work/metapod-1.0.10/tests/spatial/test_doubledef.cc:23:0: /local/robotpkg/var/tmp/robotpkg/wip/metapod/work/metapod-1.0.10/tests/spatial/../common.hh:41:22: note: 'std::basic_istream::__istream_type {aka std::basic_istream}' is not derived from 'const std::array<_Tp, _Nm>' return (i >> x) != 0; ^ In file included from /usr/include/c++/7/iterator:66:0, from /usr/include/boost/test/detail/workaround.hpp:19, from /usr/include/boost/test/detail/global_typedef.hpp:16, from /usr/include/boost/test/tree/observer.hpp:17, from /usr/include/boost/test/unit_test_log.hpp:18, from /usr/include/boost/test/tools/old/impl.hpp:19, from /usr/include/boost/test/test_tools.hpp:46, from /usr/include/boost/test/unit_test.hpp:18, from /local/robotpkg/var/tmp/robotpkg/wip/metapod/work/metapod-1.0.10/tests/spatial/../common.hh:35, from /local/robotpkg/var/tmp/robotpkg/wip/metapod/work/metapod-1.0.10/tests/spatial/test_doubledef.cc:23: /usr/include/c++/7/bits/stream_iterator.h:137:5: note: candidate: template bool std::operator!=(const std::istream_iterator<_Tp, _CharT, _Traits, _Dist>&, const std::istream_iterator<_Tp, _CharT, _Traits, _Dist>&) operator!=(const istream_iterator<_Tp, _CharT, _Traits, _Dist>& __x, ^~~~~~~~ /usr/include/c++/7/bits/stream_iterator.h:137:5: note: template argument deduction/substitution failed: In file included from /local/robotpkg/var/tmp/robotpkg/wip/metapod/work/metapod-1.0.10/tests/spatial/test_doubledef.cc:23:0: /local/robotpkg/var/tmp/robotpkg/wip/metapod/work/metapod-1.0.10/tests/spatial/../common.hh:41:22: note: 'std::basic_istream::__istream_type {aka std::basic_istream}' is not derived from 'const std::istream_iterator<_Tp, _CharT, _Traits, _Dist>' return (i >> x) != 0; ^ In file included from /usr/include/c++/7/bits/locale_facets.h:48:0, from /usr/include/c++/7/bits/basic_ios.h:37, from /usr/include/c++/7/ios:44, from /usr/include/c++/7/ostream:38, from /usr/include/c++/7/iostream:39, from /local/robotpkg/var/tmp/robotpkg/wip/metapod/work/metapod-1.0.10/tests/spatial/../common.hh:29, from /local/robotpkg/var/tmp/robotpkg/wip/metapod/work/metapod-1.0.10/tests/spatial/test_doubledef.cc:23: /usr/include/c++/7/bits/streambuf_iterator.h:210:5: note: candidate: template bool std::operator!=(const std::istreambuf_iterator<_CharT, _Traits>&, const std::istreambuf_iterator<_CharT, _Traits>&) operator!=(const istreambuf_iterator<_CharT, _Traits>& __a, ^~~~~~~~ /usr/include/c++/7/bits/streambuf_iterator.h:210:5: note: template argument deduction/substitution failed: In file included from /local/robotpkg/var/tmp/robotpkg/wip/metapod/work/metapod-1.0.10/tests/spatial/test_doubledef.cc:23:0: /local/robotpkg/var/tmp/robotpkg/wip/metapod/work/metapod-1.0.10/tests/spatial/../common.hh:41:22: note: 'std::basic_istream::__istream_type {aka std::basic_istream}' is not derived from 'const std::istreambuf_iterator<_CharT, _Traits>' return (i >> x) != 0; ^ In file included from /usr/include/c++/7/bits/ios_base.h:46:0, from /usr/include/c++/7/ios:42, from /usr/include/c++/7/ostream:38, from /usr/include/c++/7/iostream:39, from /local/robotpkg/var/tmp/robotpkg/wip/metapod/work/metapod-1.0.10/tests/spatial/../common.hh:29, from /local/robotpkg/var/tmp/robotpkg/wip/metapod/work/metapod-1.0.10/tests/spatial/test_doubledef.cc:23: /usr/include/c++/7/system_error:331:3: note: candidate: bool std::operator!=(const std::error_condition&, const std::error_condition&) operator!=(const error_condition& __lhs, ^~~~~~~~ /usr/include/c++/7/system_error:331:3: note: no known conversion for argument 1 from 'std::basic_istream::__istream_type {aka std::basic_istream}' to 'const std::error_condition&' /usr/include/c++/7/system_error:327:3: note: candidate: bool std::operator!=(const std::error_condition&, const std::error_code&) operator!=(const error_condition& __lhs, const error_code& __rhs) noexcept ^~~~~~~~ /usr/include/c++/7/system_error:327:3: note: no known conversion for argument 1 from 'std::basic_istream::__istream_type {aka std::basic_istream}' to 'const std::error_condition&' /usr/include/c++/7/system_error:323:3: note: candidate: bool std::operator!=(const std::error_code&, const std::error_condition&) operator!=(const error_code& __lhs, const error_condition& __rhs) noexcept ^~~~~~~~ /usr/include/c++/7/system_error:323:3: note: no known conversion for argument 1 from 'std::basic_istream::__istream_type {aka std::basic_istream}' to 'const std::error_code&' /usr/include/c++/7/system_error:319:3: note: candidate: bool std::operator!=(const std::error_code&, const std::error_code&) operator!=(const error_code& __lhs, const error_code& __rhs) noexcept ^~~~~~~~ /usr/include/c++/7/system_error:319:3: note: no known conversion for argument 1 from 'std::basic_istream::__istream_type {aka std::basic_istream}' to 'const std::error_code&' In file included from /usr/include/c++/7/string:52:0, from /local/robotpkg/var/tmp/robotpkg/wip/metapod/work/metapod-1.0.10/tests/spatial/../common.hh:28, from /local/robotpkg/var/tmp/robotpkg/wip/metapod/work/metapod-1.0.10/tests/spatial/test_doubledef.cc:23: /usr/include/c++/7/bits/basic_string.h:6072:5: note: candidate: template bool std::operator!=(const std::__cxx11::basic_string<_CharT, _Traits, _Alloc>&, const _CharT*) operator!=(const basic_string<_CharT, _Traits, _Alloc>& __lhs, ^~~~~~~~ /usr/include/c++/7/bits/basic_string.h:6072:5: note: template argument deduction/substitution failed: In file included from /local/robotpkg/var/tmp/robotpkg/wip/metapod/work/metapod-1.0.10/tests/spatial/test_doubledef.cc:23:0: /local/robotpkg/var/tmp/robotpkg/wip/metapod/work/metapod-1.0.10/tests/spatial/../common.hh:41:22: note: 'std::basic_istream::__istream_type {aka std::basic_istream}' is not derived from 'const std::__cxx11::basic_string<_CharT, _Traits, _Alloc>' return (i >> x) != 0; ^ In file included from /usr/include/c++/7/string:52:0, from /local/robotpkg/var/tmp/robotpkg/wip/metapod/work/metapod-1.0.10/tests/spatial/../common.hh:28, from /local/robotpkg/var/tmp/robotpkg/wip/metapod/work/metapod-1.0.10/tests/spatial/test_doubledef.cc:23: /usr/include/c++/7/bits/basic_string.h:6060:5: note: candidate: template bool std::operator!=(const _CharT*, const std::__cxx11::basic_string<_CharT, _Traits, _Alloc>&) operator!=(const _CharT* __lhs, ^~~~~~~~ /usr/include/c++/7/bits/basic_string.h:6060:5: note: template argument deduction/substitution failed: In file included from /local/robotpkg/var/tmp/robotpkg/wip/metapod/work/metapod-1.0.10/tests/spatial/test_doubledef.cc:23:0: /local/robotpkg/var/tmp/robotpkg/wip/metapod/work/metapod-1.0.10/tests/spatial/../common.hh:41:22: note: mismatched types 'const _CharT*' and 'std::basic_istream' return (i >> x) != 0; ^ In file included from /usr/include/c++/7/string:52:0, from /local/robotpkg/var/tmp/robotpkg/wip/metapod/work/metapod-1.0.10/tests/spatial/../common.hh:28, from /local/robotpkg/var/tmp/robotpkg/wip/metapod/work/metapod-1.0.10/tests/spatial/test_doubledef.cc:23: /usr/include/c++/7/bits/basic_string.h:6047:5: note: candidate: template bool std::operator!=(const std::__cxx11::basic_string<_CharT, _Traits, _Alloc>&, const std::__cxx11::basic_string<_CharT, _Traits, _Alloc>&) operator!=(const basic_string<_CharT, _Traits, _Alloc>& __lhs, ^~~~~~~~ /usr/include/c++/7/bits/basic_string.h:6047:5: note: template argument deduction/substitution failed: In file included from /local/robotpkg/var/tmp/robotpkg/wip/metapod/work/metapod-1.0.10/tests/spatial/test_doubledef.cc:23:0: /local/robotpkg/var/tmp/robotpkg/wip/metapod/work/metapod-1.0.10/tests/spatial/../common.hh:41:22: note: 'std::basic_istream::__istream_type {aka std::basic_istream}' is not derived from 'const std::__cxx11::basic_string<_CharT, _Traits, _Alloc>' return (i >> x) != 0; ^ In file included from /usr/include/c++/7/string:41:0, from /local/robotpkg/var/tmp/robotpkg/wip/metapod/work/metapod-1.0.10/tests/spatial/../common.hh:28, from /local/robotpkg/var/tmp/robotpkg/wip/metapod/work/metapod-1.0.10/tests/spatial/test_doubledef.cc:23: /usr/include/c++/7/bits/allocator.h:164:5: note: candidate: template bool std::operator!=(const std::allocator<_CharT>&, const std::allocator<_CharT>&) operator!=(const allocator<_Tp>&, const allocator<_Tp>&) ^~~~~~~~ /usr/include/c++/7/bits/allocator.h:164:5: note: template argument deduction/substitution failed: In file included from /local/robotpkg/var/tmp/robotpkg/wip/metapod/work/metapod-1.0.10/tests/spatial/test_doubledef.cc:23:0: /local/robotpkg/var/tmp/robotpkg/wip/metapod/work/metapod-1.0.10/tests/spatial/../common.hh:41:22: note: 'std::basic_istream::__istream_type {aka std::basic_istream}' is not derived from 'const std::allocator<_CharT>' return (i >> x) != 0; ^ In file included from /usr/include/c++/7/string:41:0, from /local/robotpkg/var/tmp/robotpkg/wip/metapod/work/metapod-1.0.10/tests/spatial/../common.hh:28, from /local/robotpkg/var/tmp/robotpkg/wip/metapod/work/metapod-1.0.10/tests/spatial/test_doubledef.cc:23: /usr/include/c++/7/bits/allocator.h:158:5: note: candidate: template bool std::operator!=(const std::allocator<_CharT>&, const std::allocator<_T2>&) operator!=(const allocator<_T1>&, const allocator<_T2>&) ^~~~~~~~ /usr/include/c++/7/bits/allocator.h:158:5: note: template argument deduction/substitution failed: In file included from /local/robotpkg/var/tmp/robotpkg/wip/metapod/work/metapod-1.0.10/tests/spatial/test_doubledef.cc:23:0: /local/robotpkg/var/tmp/robotpkg/wip/metapod/work/metapod-1.0.10/tests/spatial/../common.hh:41:22: note: 'std::basic_istream::__istream_type {aka std::basic_istream}' is not derived from 'const std::allocator<_CharT>' return (i >> x) != 0; ^ In file included from /usr/include/c++/7/bits/char_traits.h:40:0, from /usr/include/c++/7/string:40, from /local/robotpkg/var/tmp/robotpkg/wip/metapod/work/metapod-1.0.10/tests/spatial/../common.hh:28, from /local/robotpkg/var/tmp/robotpkg/wip/metapod/work/metapod-1.0.10/tests/spatial/test_doubledef.cc:23: /usr/include/c++/7/bits/postypes.h:221:5: note: candidate: template bool std::operator!=(const std::fpos<_StateT>&, const std::fpos<_StateT>&) operator!=(const fpos<_StateT>& __lhs, const fpos<_StateT>& __rhs) ^~~~~~~~ /usr/include/c++/7/bits/postypes.h:221:5: note: template argument deduction/substitution failed: In file included from /local/robotpkg/var/tmp/robotpkg/wip/metapod/work/metapod-1.0.10/tests/spatial/test_doubledef.cc:23:0: /local/robotpkg/var/tmp/robotpkg/wip/metapod/work/metapod-1.0.10/tests/spatial/../common.hh:41:22: note: 'std::basic_istream::__istream_type {aka std::basic_istream}' is not derived from 'const std::fpos<_StateT>' return (i >> x) != 0; ^ In file included from /usr/include/c++/7/bits/stl_algobase.h:67:0, from /usr/include/c++/7/bits/char_traits.h:39, from /usr/include/c++/7/string:40, from /local/robotpkg/var/tmp/robotpkg/wip/metapod/work/metapod-1.0.10/tests/spatial/../common.hh:28, from /local/robotpkg/var/tmp/robotpkg/wip/metapod/work/metapod-1.0.10/tests/spatial/test_doubledef.cc:23: /usr/include/c++/7/bits/stl_iterator.h:1136:5: note: candidate: template bool std::operator!=(const std::move_iterator<_IteratorL>&, const std::move_iterator<_IteratorL>&) operator!=(const move_iterator<_Iterator>& __x, ^~~~~~~~ /usr/include/c++/7/bits/stl_iterator.h:1136:5: note: template argument deduction/substitution failed: In file included from /local/robotpkg/var/tmp/robotpkg/wip/metapod/work/metapod-1.0.10/tests/spatial/test_doubledef.cc:23:0: /local/robotpkg/var/tmp/robotpkg/wip/metapod/work/metapod-1.0.10/tests/spatial/../common.hh:41:22: note: 'std::basic_istream::__istream_type {aka std::basic_istream}' is not derived from 'const std::move_iterator<_IteratorL>' return (i >> x) != 0; ^ In file included from /usr/include/c++/7/bits/stl_algobase.h:67:0, from /usr/include/c++/7/bits/char_traits.h:39, from /usr/include/c++/7/string:40, from /local/robotpkg/var/tmp/robotpkg/wip/metapod/work/metapod-1.0.10/tests/spatial/../common.hh:28, from /local/robotpkg/var/tmp/robotpkg/wip/metapod/work/metapod-1.0.10/tests/spatial/test_doubledef.cc:23: /usr/include/c++/7/bits/stl_iterator.h:1130:5: note: candidate: template bool std::operator!=(const std::move_iterator<_IteratorL>&, const std::move_iterator<_IteratorR>&) operator!=(const move_iterator<_IteratorL>& __x, ^~~~~~~~ /usr/include/c++/7/bits/stl_iterator.h:1130:5: note: template argument deduction/substitution failed: In file included from /local/robotpkg/var/tmp/robotpkg/wip/metapod/work/metapod-1.0.10/tests/spatial/test_doubledef.cc:23:0: /local/robotpkg/var/tmp/robotpkg/wip/metapod/work/metapod-1.0.10/tests/spatial/../common.hh:41:22: note: 'std::basic_istream::__istream_type {aka std::basic_istream}' is not derived from 'const std::move_iterator<_IteratorL>' return (i >> x) != 0; ^ In file included from /usr/include/c++/7/bits/stl_algobase.h:67:0, from /usr/include/c++/7/bits/char_traits.h:39, from /usr/include/c++/7/string:40, from /local/robotpkg/var/tmp/robotpkg/wip/metapod/work/metapod-1.0.10/tests/spatial/../common.hh:28, from /local/robotpkg/var/tmp/robotpkg/wip/metapod/work/metapod-1.0.10/tests/spatial/test_doubledef.cc:23: /usr/include/c++/7/bits/stl_iterator.h:349:5: note: candidate: template bool std::operator!=(const std::reverse_iterator<_Iterator>&, const std::reverse_iterator<_IteratorR>&) operator!=(const reverse_iterator<_IteratorL>& __x, ^~~~~~~~ /usr/include/c++/7/bits/stl_iterator.h:349:5: note: template argument deduction/substitution failed: In file included from /local/robotpkg/var/tmp/robotpkg/wip/metapod/work/metapod-1.0.10/tests/spatial/test_doubledef.cc:23:0: /local/robotpkg/var/tmp/robotpkg/wip/metapod/work/metapod-1.0.10/tests/spatial/../common.hh:41:22: note: 'std::basic_istream::__istream_type {aka std::basic_istream}' is not derived from 'const std::reverse_iterator<_Iterator>' return (i >> x) != 0; ^ In file included from /usr/include/c++/7/bits/stl_algobase.h:67:0, from /usr/include/c++/7/bits/char_traits.h:39, from /usr/include/c++/7/string:40, from /local/robotpkg/var/tmp/robotpkg/wip/metapod/work/metapod-1.0.10/tests/spatial/../common.hh:28, from /local/robotpkg/var/tmp/robotpkg/wip/metapod/work/metapod-1.0.10/tests/spatial/test_doubledef.cc:23: /usr/include/c++/7/bits/stl_iterator.h:311:5: note: candidate: template bool std::operator!=(const std::reverse_iterator<_Iterator>&, const std::reverse_iterator<_Iterator>&) operator!=(const reverse_iterator<_Iterator>& __x, ^~~~~~~~ /usr/include/c++/7/bits/stl_iterator.h:311:5: note: template argument deduction/substitution failed: In file included from /local/robotpkg/var/tmp/robotpkg/wip/metapod/work/metapod-1.0.10/tests/spatial/test_doubledef.cc:23:0: /local/robotpkg/var/tmp/robotpkg/wip/metapod/work/metapod-1.0.10/tests/spatial/../common.hh:41:22: note: 'std::basic_istream::__istream_type {aka std::basic_istream}' is not derived from 'const std::reverse_iterator<_Iterator>' return (i >> x) != 0; ^ In file included from /usr/include/c++/7/bits/stl_algobase.h:64:0, from /usr/include/c++/7/bits/char_traits.h:39, from /usr/include/c++/7/string:40, from /local/robotpkg/var/tmp/robotpkg/wip/metapod/work/metapod-1.0.10/tests/spatial/../common.hh:28, from /local/robotpkg/var/tmp/robotpkg/wip/metapod/work/metapod-1.0.10/tests/spatial/test_doubledef.cc:23: /usr/include/c++/7/bits/stl_pair.h:456:5: note: candidate: template constexpr bool std::operator!=(const std::pair<_T1, _T2>&, const std::pair<_T1, _T2>&) operator!=(const pair<_T1, _T2>& __x, const pair<_T1, _T2>& __y) ^~~~~~~~ /usr/include/c++/7/bits/stl_pair.h:456:5: note: template argument deduction/substitution failed: In file included from /local/robotpkg/var/tmp/robotpkg/wip/metapod/work/metapod-1.0.10/tests/spatial/test_doubledef.cc:23:0: /local/robotpkg/var/tmp/robotpkg/wip/metapod/work/metapod-1.0.10/tests/spatial/../common.hh:41:22: note: 'std::basic_istream::__istream_type {aka std::basic_istream}' is not derived from 'const std::pair<_T1, _T2>' return (i >> x) != 0; ^ In file included from /local/robotpkg/var/tmp/robotpkg/wip/metapod/work/metapod-1.0.10/tests/spatial/test_transform.cc:19:0: /local/robotpkg/var/tmp/robotpkg/wip/metapod/work/metapod-1.0.10/tests/spatial/../common.hh: In function 'bool stringToDouble(const string&, double&)': /local/robotpkg/var/tmp/robotpkg/wip/metapod/work/metapod-1.0.10/tests/spatial/../common.hh:41:19: error: no match for 'operator!=' (operand types are 'std::basic_istream::__istream_type {aka std::basic_istream}' and 'int') return (i >> x) != 0; ~~~~~~~~~^~~~ /local/robotpkg/var/tmp/robotpkg/wip/metapod/work/metapod-1.0.10/tests/spatial/../common.hh:41:19: note: candidate: operator!=(int, int) /local/robotpkg/var/tmp/robotpkg/wip/metapod/work/metapod-1.0.10/tests/spatial/../common.hh:41:19: note: no known conversion for argument 1 from 'std::basic_istream::__istream_type {aka std::basic_istream}' to 'int' In file included from /usr/include/c++/7/list:63:0, from /usr/include/boost/test/tree/auto_registration.hpp:24, from /usr/include/boost/test/unit_test_suite.hpp:17, from /usr/include/boost/test/unit_test.hpp:19, from /local/robotpkg/var/tmp/robotpkg/wip/metapod/work/metapod-1.0.10/tests/spatial/../common.hh:35, from /local/robotpkg/var/tmp/robotpkg/wip/metapod/work/metapod-1.0.10/tests/spatial/test_transform.cc:19: /usr/include/c++/7/bits/stl_list.h:1925:5: note: candidate: template bool std::operator!=(const std::__cxx11::list<_Tp, _Alloc>&, const std::__cxx11::list<_Tp, _Alloc>&) operator!=(const list<_Tp, _Alloc>& __x, const list<_Tp, _Alloc>& __y) ^~~~~~~~ /usr/include/c++/7/bits/stl_list.h:1925:5: note: template argument deduction/substitution failed: In file included from /local/robotpkg/var/tmp/robotpkg/wip/metapod/work/metapod-1.0.10/tests/spatial/test_transform.cc:19:0: /local/robotpkg/var/tmp/robotpkg/wip/metapod/work/metapod-1.0.10/tests/spatial/../common.hh:41:22: note: 'std::basic_istream::__istream_type {aka std::basic_istream}' is not derived from 'const std::__cxx11::list<_Tp, _Alloc>' return (i >> x) != 0; ^ In file included from /usr/include/c++/7/list:63:0, from /usr/include/boost/test/tree/auto_registration.hpp:24, from /usr/include/boost/test/unit_test_suite.hpp:17, from /usr/include/boost/test/unit_test.hpp:19, from /local/robotpkg/var/tmp/robotpkg/wip/metapod/work/metapod-1.0.10/tests/spatial/../common.hh:35, from /local/robotpkg/var/tmp/robotpkg/wip/metapod/work/metapod-1.0.10/tests/spatial/test_transform.cc:19: /usr/include/c++/7/bits/stl_list.h:293:5: note: candidate: template bool std::operator!=(const std::_List_iterator<_Tp>&, const std::_List_const_iterator<_Tp>&) operator!=(const _List_iterator<_Val>& __x, ^~~~~~~~ /usr/include/c++/7/bits/stl_list.h:293:5: note: template argument deduction/substitution failed: In file included from /local/robotpkg/var/tmp/robotpkg/wip/metapod/work/metapod-1.0.10/tests/spatial/test_transform.cc:19:0: /local/robotpkg/var/tmp/robotpkg/wip/metapod/work/metapod-1.0.10/tests/spatial/../common.hh:41:22: note: 'std::basic_istream::__istream_type {aka std::basic_istream}' is not derived from 'const std::_List_iterator<_Tp>' return (i >> x) != 0; ^ In file included from /usr/include/c++/7/map:62:0, from /usr/include/boost/test/tree/test_unit.hpp:35, from /usr/include/boost/test/tree/auto_registration.hpp:21, from /usr/include/boost/test/unit_test_suite.hpp:17, from /usr/include/boost/test/unit_test.hpp:19, from /local/robotpkg/var/tmp/robotpkg/wip/metapod/work/metapod-1.0.10/tests/spatial/../common.hh:35, from /local/robotpkg/var/tmp/robotpkg/wip/metapod/work/metapod-1.0.10/tests/spatial/test_transform.cc:19: /usr/include/c++/7/bits/stl_multimap.h:1085:5: note: candidate: template bool std::operator!=(const std::multimap<_Key, _Tp, _Compare, _Alloc>&, const std::multimap<_Key, _Tp, _Compare, _Alloc>&) operator!=(const multimap<_Key, _Tp, _Compare, _Alloc>& __x, ^~~~~~~~ /usr/include/c++/7/bits/stl_multimap.h:1085:5: note: template argument deduction/substitution failed: In file included from /local/robotpkg/var/tmp/robotpkg/wip/metapod/work/metapod-1.0.10/tests/spatial/test_transform.cc:19:0: /local/robotpkg/var/tmp/robotpkg/wip/metapod/work/metapod-1.0.10/tests/spatial/../common.hh:41:22: note: 'std::basic_istream::__istream_type {aka std::basic_istream}' is not derived from 'const std::multimap<_Key, _Tp, _Compare, _Alloc>' return (i >> x) != 0; ^ In file included from /usr/include/c++/7/map:61:0, from /usr/include/boost/test/tree/test_unit.hpp:35, from /usr/include/boost/test/tree/auto_registration.hpp:21, from /usr/include/boost/test/unit_test_suite.hpp:17, from /usr/include/boost/test/unit_test.hpp:19, from /local/robotpkg/var/tmp/robotpkg/wip/metapod/work/metapod-1.0.10/tests/spatial/../common.hh:35, from /local/robotpkg/var/tmp/robotpkg/wip/metapod/work/metapod-1.0.10/tests/spatial/test_transform.cc:19: /usr/include/c++/7/bits/stl_map.h:1419:5: note: candidate: template bool std::operator!=(const std::map<_Key, _Tp, _Compare, _Alloc>&, const std::map<_Key, _Tp, _Compare, _Alloc>&) operator!=(const map<_Key, _Tp, _Compare, _Alloc>& __x, ^~~~~~~~ /usr/include/c++/7/bits/stl_map.h:1419:5: note: template argument deduction/substitution failed: In file included from /local/robotpkg/var/tmp/robotpkg/wip/metapod/work/metapod-1.0.10/tests/spatial/test_transform.cc:19:0: /local/robotpkg/var/tmp/robotpkg/wip/metapod/work/metapod-1.0.10/tests/spatial/../common.hh:41:22: note: 'std::basic_istream::__istream_type {aka std::basic_istream}' is not derived from 'const std::map<_Key, _Tp, _Compare, _Alloc>' return (i >> x) != 0; ^ In file included from /usr/include/c++/7/map:60:0, from /usr/include/boost/test/tree/test_unit.hpp:35, from /usr/include/boost/test/tree/auto_registration.hpp:21, from /usr/include/boost/test/unit_test_suite.hpp:17, from /usr/include/boost/test/unit_test.hpp:19, from /local/robotpkg/var/tmp/robotpkg/wip/metapod/work/metapod-1.0.10/tests/spatial/../common.hh:35, from /local/robotpkg/var/tmp/robotpkg/wip/metapod/work/metapod-1.0.10/tests/spatial/test_transform.cc:19: /usr/include/c++/7/bits/stl_tree.h:1553:5: note: candidate: template bool std::operator!=(const std::_Rb_tree<_Key, _Val, _KeyOfValue, _Compare, _Alloc>&, const std::_Rb_tree<_Key, _Val, _KeyOfValue, _Compare, _Alloc>&) operator!=(const _Rb_tree<_Key, _Val, _KeyOfValue, _Compare, _Alloc>& __x, ^~~~~~~~ /usr/include/c++/7/bits/stl_tree.h:1553:5: note: template argument deduction/substitution failed: In file included from /local/robotpkg/var/tmp/robotpkg/wip/metapod/work/metapod-1.0.10/tests/spatial/test_transform.cc:19:0: /local/robotpkg/var/tmp/robotpkg/wip/metapod/work/metapod-1.0.10/tests/spatial/../common.hh:41:22: note: 'std::basic_istream::__istream_type {aka std::basic_istream}' is not derived from 'const std::_Rb_tree<_Key, _Val, _KeyOfValue, _Compare, _Alloc>' return (i >> x) != 0; ^ In file included from /usr/include/c++/7/map:60:0, from /usr/include/boost/test/tree/test_unit.hpp:35, from /usr/include/boost/test/tree/auto_registration.hpp:21, from /usr/include/boost/test/unit_test_suite.hpp:17, from /usr/include/boost/test/unit_test.hpp:19, from /local/robotpkg/var/tmp/robotpkg/wip/metapod/work/metapod-1.0.10/tests/spatial/../common.hh:35, from /local/robotpkg/var/tmp/robotpkg/wip/metapod/work/metapod-1.0.10/tests/spatial/test_transform.cc:19: /usr/include/c++/7/bits/stl_tree.h:412:5: note: candidate: template bool std::operator!=(const std::_Rb_tree_iterator<_Tp>&, const std::_Rb_tree_const_iterator<_Val>&) operator!=(const _Rb_tree_iterator<_Val>& __x, ^~~~~~~~ /usr/include/c++/7/bits/stl_tree.h:412:5: note: template argument deduction/substitution failed: In file included from /local/robotpkg/var/tmp/robotpkg/wip/metapod/work/metapod-1.0.10/tests/spatial/test_transform.cc:19:0: /local/robotpkg/var/tmp/robotpkg/wip/metapod/work/metapod-1.0.10/tests/spatial/../common.hh:41:22: note: 'std::basic_istream::__istream_type {aka std::basic_istream}' is not derived from 'const std::_Rb_tree_iterator<_Tp>' return (i >> x) != 0; ^ In file included from /usr/include/c++/7/vector:64:0, from /usr/include/boost/test/tree/decorator.hpp:37, from /usr/include/boost/test/tools/fpc_tolerance.hpp:19, from /usr/include/boost/test/tools/fpc_op.hpp:19, from /usr/include/boost/test/test_tools.hpp:54, from /usr/include/boost/test/unit_test.hpp:18, from /local/robotpkg/var/tmp/robotpkg/wip/metapod/work/metapod-1.0.10/tests/spatial/../common.hh:35, from /local/robotpkg/var/tmp/robotpkg/wip/metapod/work/metapod-1.0.10/tests/spatial/test_transform.cc:19: /usr/include/c++/7/bits/stl_vector.h:1620:5: note: candidate: template bool std::operator!=(const std::vector<_Tp, _Alloc>&, const std::vector<_Tp, _Alloc>&) operator!=(const vector<_Tp, _Alloc>& __x, const vector<_Tp, _Alloc>& __y) ^~~~~~~~ /usr/include/c++/7/bits/stl_vector.h:1620:5: note: template argument deduction/substitution failed: In file included from /local/robotpkg/var/tmp/robotpkg/wip/metapod/work/metapod-1.0.10/tests/spatial/test_transform.cc:19:0: /local/robotpkg/var/tmp/robotpkg/wip/metapod/work/metapod-1.0.10/tests/spatial/../common.hh:41:22: note: 'std::basic_istream::__istream_type {aka std::basic_istream}' is not derived from 'const std::vector<_Tp, _Alloc>' return (i >> x) != 0; ^ In file included from /usr/include/c++/7/functional:58:0, from /usr/include/boost/smart_ptr/detail/shared_count.hpp:38, from /usr/include/boost/smart_ptr/shared_ptr.hpp:28, from /usr/include/boost/shared_ptr.hpp:17, from /usr/include/boost/test/tools/assertion_result.hpp:21, from /usr/include/boost/test/tools/old/impl.hpp:20, from /usr/include/boost/test/test_tools.hpp:46, from /usr/include/boost/test/unit_test.hpp:18, from /local/robotpkg/var/tmp/robotpkg/wip/metapod/work/metapod-1.0.10/tests/spatial/../common.hh:35, from /local/robotpkg/var/tmp/robotpkg/wip/metapod/work/metapod-1.0.10/tests/spatial/test_transform.cc:19: /usr/include/c++/7/bits/std_function.h:788:5: note: candidate: template bool std::operator!=(std::nullptr_t, const std::function<_Res(_ArgTypes ...)>&) operator!=(nullptr_t, const function<_Res(_Args...)>& __f) noexcept ^~~~~~~~ /usr/include/c++/7/bits/std_function.h:788:5: note: template argument deduction/substitution failed: In file included from /local/robotpkg/var/tmp/robotpkg/wip/metapod/work/metapod-1.0.10/tests/spatial/test_transform.cc:19:0: /local/robotpkg/var/tmp/robotpkg/wip/metapod/work/metapod-1.0.10/tests/spatial/../common.hh:41:22: note: mismatched types 'const std::function<_Res(_ArgTypes ...)>' and 'int' return (i >> x) != 0; ^ In file included from /usr/include/c++/7/functional:58:0, from /usr/include/boost/smart_ptr/detail/shared_count.hpp:38, from /usr/include/boost/smart_ptr/shared_ptr.hpp:28, from /usr/include/boost/shared_ptr.hpp:17, from /usr/include/boost/test/tools/assertion_result.hpp:21, from /usr/include/boost/test/tools/old/impl.hpp:20, from /usr/include/boost/test/test_tools.hpp:46, from /usr/include/boost/test/unit_test.hpp:18, from /local/robotpkg/var/tmp/robotpkg/wip/metapod/work/metapod-1.0.10/tests/spatial/../common.hh:35, from /local/robotpkg/var/tmp/robotpkg/wip/metapod/work/metapod-1.0.10/tests/spatial/test_transform.cc:19: /usr/include/c++/7/bits/std_function.h:782:5: note: candidate: template bool std::operator!=(const std::function<_Res(_ArgTypes ...)>&, std::nullptr_t) operator!=(const function<_Res(_Args...)>& __f, nullptr_t) noexcept ^~~~~~~~ /usr/include/c++/7/bits/std_function.h:782:5: note: template argument deduction/substitution failed: In file included from /local/robotpkg/var/tmp/robotpkg/wip/metapod/work/metapod-1.0.10/tests/spatial/test_transform.cc:19:0: /local/robotpkg/var/tmp/robotpkg/wip/metapod/work/metapod-1.0.10/tests/spatial/../common.hh:41:22: note: 'std::basic_istream::__istream_type {aka std::basic_istream}' is not derived from 'const std::function<_Res(_ArgTypes ...)>' return (i >> x) != 0; ^ In file included from /usr/include/c++/7/memory:81:0, from /usr/include/boost/config/no_tr1/memory.hpp:21, from /usr/include/boost/smart_ptr/shared_ptr.hpp:23, from /usr/include/boost/shared_ptr.hpp:17, from /usr/include/boost/test/tools/assertion_result.hpp:21, from /usr/include/boost/test/tools/old/impl.hpp:20, from /usr/include/boost/test/test_tools.hpp:46, from /usr/include/boost/test/unit_test.hpp:18, from /local/robotpkg/var/tmp/robotpkg/wip/metapod/work/metapod-1.0.10/tests/spatial/../common.hh:35, from /local/robotpkg/var/tmp/robotpkg/wip/metapod/work/metapod-1.0.10/tests/spatial/test_transform.cc:19: /usr/include/c++/7/bits/shared_ptr.h:393:5: note: candidate: template bool std::operator!=(std::nullptr_t, const std::shared_ptr<_Tp>&) operator!=(nullptr_t, const shared_ptr<_Tp>& __a) noexcept ^~~~~~~~ /usr/include/c++/7/bits/shared_ptr.h:393:5: note: template argument deduction/substitution failed: In file included from /local/robotpkg/var/tmp/robotpkg/wip/metapod/work/metapod-1.0.10/tests/spatial/test_transform.cc:19:0: /local/robotpkg/var/tmp/robotpkg/wip/metapod/work/metapod-1.0.10/tests/spatial/../common.hh:41:22: note: mismatched types 'const std::shared_ptr<_Tp>' and 'int' return (i >> x) != 0; ^ In file included from /usr/include/c++/7/memory:81:0, from /usr/include/boost/config/no_tr1/memory.hpp:21, from /usr/include/boost/smart_ptr/shared_ptr.hpp:23, from /usr/include/boost/shared_ptr.hpp:17, from /usr/include/boost/test/tools/assertion_result.hpp:21, from /usr/include/boost/test/tools/old/impl.hpp:20, from /usr/include/boost/test/test_tools.hpp:46, from /usr/include/boost/test/unit_test.hpp:18, from /local/robotpkg/var/tmp/robotpkg/wip/metapod/work/metapod-1.0.10/tests/spatial/../common.hh:35, from /local/robotpkg/var/tmp/robotpkg/wip/metapod/work/metapod-1.0.10/tests/spatial/test_transform.cc:19: /usr/include/c++/7/bits/shared_ptr.h:388:5: note: candidate: template bool std::operator!=(const std::shared_ptr<_Tp>&, std::nullptr_t) operator!=(const shared_ptr<_Tp>& __a, nullptr_t) noexcept ^~~~~~~~ /usr/include/c++/7/bits/shared_ptr.h:388:5: note: template argument deduction/substitution failed: In file included from /local/robotpkg/var/tmp/robotpkg/wip/metapod/work/metapod-1.0.10/tests/spatial/test_transform.cc:19:0: /local/robotpkg/var/tmp/robotpkg/wip/metapod/work/metapod-1.0.10/tests/spatial/../common.hh:41:22: note: 'std::basic_istream::__istream_type {aka std::basic_istream}' is not derived from 'const std::shared_ptr<_Tp>' return (i >> x) != 0; ^ In file included from /usr/include/c++/7/memory:81:0, from /usr/include/boost/config/no_tr1/memory.hpp:21, from /usr/include/boost/smart_ptr/shared_ptr.hpp:23, from /usr/include/boost/shared_ptr.hpp:17, from /usr/include/boost/test/tools/assertion_result.hpp:21, from /usr/include/boost/test/tools/old/impl.hpp:20, from /usr/include/boost/test/test_tools.hpp:46, from /usr/include/boost/test/unit_test.hpp:18, from /local/robotpkg/var/tmp/robotpkg/wip/metapod/work/metapod-1.0.10/tests/spatial/../common.hh:35, from /local/robotpkg/var/tmp/robotpkg/wip/metapod/work/metapod-1.0.10/tests/spatial/test_transform.cc:19: /usr/include/c++/7/bits/shared_ptr.h:383:5: note: candidate: template bool std::operator!=(const std::shared_ptr<_Tp>&, const std::shared_ptr<_Up>&) operator!=(const shared_ptr<_Tp>& __a, const shared_ptr<_Up>& __b) noexcept ^~~~~~~~ /usr/include/c++/7/bits/shared_ptr.h:383:5: note: template argument deduction/substitution failed: In file included from /local/robotpkg/var/tmp/robotpkg/wip/metapod/work/metapod-1.0.10/tests/spatial/test_transform.cc:19:0: /local/robotpkg/var/tmp/robotpkg/wip/metapod/work/metapod-1.0.10/tests/spatial/../common.hh:41:22: note: 'std::basic_istream::__istream_type {aka std::basic_istream}' is not derived from 'const std::shared_ptr<_Tp>' return (i >> x) != 0; ^ In file included from /usr/include/c++/7/bits/shared_ptr.h:52:0, from /usr/include/c++/7/memory:81, from /usr/include/boost/config/no_tr1/memory.hpp:21, from /usr/include/boost/smart_ptr/shared_ptr.hpp:23, from /usr/include/boost/shared_ptr.hpp:17, from /usr/include/boost/test/tools/assertion_result.hpp:21, from /usr/include/boost/test/tools/old/impl.hpp:20, from /usr/include/boost/test/test_tools.hpp:46, from /usr/include/boost/test/unit_test.hpp:18, from /local/robotpkg/var/tmp/robotpkg/wip/metapod/work/metapod-1.0.10/tests/spatial/../common.hh:35, from /local/robotpkg/var/tmp/robotpkg/wip/metapod/work/metapod-1.0.10/tests/spatial/test_transform.cc:19: /usr/include/c++/7/bits/shared_ptr_base.h:1436:5: note: candidate: template bool std::operator!=(std::nullptr_t, const std::__shared_ptr<_Tp, _Lp>&) operator!=(nullptr_t, const __shared_ptr<_Tp, _Lp>& __a) noexcept ^~~~~~~~ /usr/include/c++/7/bits/shared_ptr_base.h:1436:5: note: template argument deduction/substitution failed: In file included from /local/robotpkg/var/tmp/robotpkg/wip/metapod/work/metapod-1.0.10/tests/spatial/test_transform.cc:19:0: /local/robotpkg/var/tmp/robotpkg/wip/metapod/work/metapod-1.0.10/tests/spatial/../common.hh:41:22: note: mismatched types 'const std::__shared_ptr<_Tp, _Lp>' and 'int' return (i >> x) != 0; ^ In file included from /usr/include/c++/7/bits/shared_ptr.h:52:0, from /usr/include/c++/7/memory:81, from /usr/include/boost/config/no_tr1/memory.hpp:21, from /usr/include/boost/smart_ptr/shared_ptr.hpp:23, from /usr/include/boost/shared_ptr.hpp:17, from /usr/include/boost/test/tools/assertion_result.hpp:21, from /usr/include/boost/test/tools/old/impl.hpp:20, from /usr/include/boost/test/test_tools.hpp:46, from /usr/include/boost/test/unit_test.hpp:18, from /local/robotpkg/var/tmp/robotpkg/wip/metapod/work/metapod-1.0.10/tests/spatial/../common.hh:35, from /local/robotpkg/var/tmp/robotpkg/wip/metapod/work/metapod-1.0.10/tests/spatial/test_transform.cc:19: /usr/include/c++/7/bits/shared_ptr_base.h:1431:5: note: candidate: template bool std::operator!=(const std::__shared_ptr<_Tp, _Lp>&, std::nullptr_t) operator!=(const __shared_ptr<_Tp, _Lp>& __a, nullptr_t) noexcept ^~~~~~~~ /usr/include/c++/7/bits/shared_ptr_base.h:1431:5: note: template argument deduction/substitution failed: In file included from /local/robotpkg/var/tmp/robotpkg/wip/metapod/work/metapod-1.0.10/tests/spatial/test_transform.cc:19:0: /local/robotpkg/var/tmp/robotpkg/wip/metapod/work/metapod-1.0.10/tests/spatial/../common.hh:41:22: note: 'std::basic_istream::__istream_type {aka std::basic_istream}' is not derived from 'const std::__shared_ptr<_Tp, _Lp>' return (i >> x) != 0; ^ In file included from /usr/include/c++/7/bits/shared_ptr.h:52:0, from /usr/include/c++/7/memory:81, from /usr/include/boost/config/no_tr1/memory.hpp:21, from /usr/include/boost/smart_ptr/shared_ptr.hpp:23, from /usr/include/boost/shared_ptr.hpp:17, from /usr/include/boost/test/tools/assertion_result.hpp:21, from /usr/include/boost/test/tools/old/impl.hpp:20, from /usr/include/boost/test/test_tools.hpp:46, from /usr/include/boost/test/unit_test.hpp:18, from /local/robotpkg/var/tmp/robotpkg/wip/metapod/work/metapod-1.0.10/tests/spatial/../common.hh:35, from /local/robotpkg/var/tmp/robotpkg/wip/metapod/work/metapod-1.0.10/tests/spatial/test_transform.cc:19: /usr/include/c++/7/bits/shared_ptr_base.h:1425:5: note: candidate: template bool std::operator!=(const std::__shared_ptr<_Tp1, _Lp>&, const std::__shared_ptr<_Tp2, _Lp>&) operator!=(const __shared_ptr<_Tp1, _Lp>& __a, ^~~~~~~~ /usr/include/c++/7/bits/shared_ptr_base.h:1425:5: note: template argument deduction/substitution failed: In file included from /local/robotpkg/var/tmp/robotpkg/wip/metapod/work/metapod-1.0.10/tests/spatial/test_transform.cc:19:0: /local/robotpkg/var/tmp/robotpkg/wip/metapod/work/metapod-1.0.10/tests/spatial/../common.hh:41:22: note: 'std::basic_istream::__istream_type {aka std::basic_istream}' is not derived from 'const std::__shared_ptr<_Tp1, _Lp>' return (i >> x) != 0; ^ In file included from /usr/include/c++/7/memory:80:0, from /usr/include/boost/config/no_tr1/memory.hpp:21, from /usr/include/boost/smart_ptr/shared_ptr.hpp:23, from /usr/include/boost/shared_ptr.hpp:17, from /usr/include/boost/test/tools/assertion_result.hpp:21, from /usr/include/boost/test/tools/old/impl.hpp:20, from /usr/include/boost/test/test_tools.hpp:46, from /usr/include/boost/test/unit_test.hpp:18, from /local/robotpkg/var/tmp/robotpkg/wip/metapod/work/metapod-1.0.10/tests/spatial/../common.hh:35, from /local/robotpkg/var/tmp/robotpkg/wip/metapod/work/metapod-1.0.10/tests/spatial/test_transform.cc:19: /usr/include/c++/7/bits/unique_ptr.h:711:5: note: candidate: template bool std::operator!=(std::nullptr_t, const std::unique_ptr<_Tp, _Dp>&) operator!=(nullptr_t, const unique_ptr<_Tp, _Dp>& __x) noexcept ^~~~~~~~ /usr/include/c++/7/bits/unique_ptr.h:711:5: note: template argument deduction/substitution failed: In file included from /local/robotpkg/var/tmp/robotpkg/wip/metapod/work/metapod-1.0.10/tests/spatial/test_transform.cc:19:0: /local/robotpkg/var/tmp/robotpkg/wip/metapod/work/metapod-1.0.10/tests/spatial/../common.hh:41:22: note: mismatched types 'const std::unique_ptr<_Tp, _Dp>' and 'int' return (i >> x) != 0; ^ In file included from /usr/include/c++/7/memory:80:0, from /usr/include/boost/config/no_tr1/memory.hpp:21, from /usr/include/boost/smart_ptr/shared_ptr.hpp:23, from /usr/include/boost/shared_ptr.hpp:17, from /usr/include/boost/test/tools/assertion_result.hpp:21, from /usr/include/boost/test/tools/old/impl.hpp:20, from /usr/include/boost/test/test_tools.hpp:46, from /usr/include/boost/test/unit_test.hpp:18, from /local/robotpkg/var/tmp/robotpkg/wip/metapod/work/metapod-1.0.10/tests/spatial/../common.hh:35, from /local/robotpkg/var/tmp/robotpkg/wip/metapod/work/metapod-1.0.10/tests/spatial/test_transform.cc:19: /usr/include/c++/7/bits/unique_ptr.h:706:5: note: candidate: template bool std::operator!=(const std::unique_ptr<_Tp, _Dp>&, std::nullptr_t) operator!=(const unique_ptr<_Tp, _Dp>& __x, nullptr_t) noexcept ^~~~~~~~ /usr/include/c++/7/bits/unique_ptr.h:706:5: note: template argument deduction/substitution failed: In file included from /local/robotpkg/var/tmp/robotpkg/wip/metapod/work/metapod-1.0.10/tests/spatial/test_transform.cc:19:0: /local/robotpkg/var/tmp/robotpkg/wip/metapod/work/metapod-1.0.10/tests/spatial/../common.hh:41:22: note: 'std::basic_istream::__istream_type {aka std::basic_istream}' is not derived from 'const std::unique_ptr<_Tp, _Dp>' return (i >> x) != 0; ^ In file included from /usr/include/c++/7/memory:80:0, from /usr/include/boost/config/no_tr1/memory.hpp:21, from /usr/include/boost/smart_ptr/shared_ptr.hpp:23, from /usr/include/boost/shared_ptr.hpp:17, from /usr/include/boost/test/tools/assertion_result.hpp:21, from /usr/include/boost/test/tools/old/impl.hpp:20, from /usr/include/boost/test/test_tools.hpp:46, from /usr/include/boost/test/unit_test.hpp:18, from /local/robotpkg/var/tmp/robotpkg/wip/metapod/work/metapod-1.0.10/tests/spatial/../common.hh:35, from /local/robotpkg/var/tmp/robotpkg/wip/metapod/work/metapod-1.0.10/tests/spatial/test_transform.cc:19: /usr/include/c++/7/bits/unique_ptr.h:700:5: note: candidate: template bool std::operator!=(const std::unique_ptr<_Tp, _Dp>&, const std::unique_ptr<_Up, _Ep>&) operator!=(const unique_ptr<_Tp, _Dp>& __x, ^~~~~~~~ /usr/include/c++/7/bits/unique_ptr.h:700:5: note: template argument deduction/substitution failed: In file included from /local/robotpkg/var/tmp/robotpkg/wip/metapod/work/metapod-1.0.10/tests/spatial/test_transform.cc:19:0: /local/robotpkg/var/tmp/robotpkg/wip/metapod/work/metapod-1.0.10/tests/spatial/../common.hh:41:22: note: 'std::basic_istream::__istream_type {aka std::basic_istream}' is not derived from 'const std::unique_ptr<_Tp, _Dp>' return (i >> x) != 0; ^ In file included from /usr/include/c++/7/bits/unique_ptr.h:37:0, from /usr/include/c++/7/memory:80, from /usr/include/boost/config/no_tr1/memory.hpp:21, from /usr/include/boost/smart_ptr/shared_ptr.hpp:23, from /usr/include/boost/shared_ptr.hpp:17, from /usr/include/boost/test/tools/assertion_result.hpp:21, from /usr/include/boost/test/tools/old/impl.hpp:20, from /usr/include/boost/test/test_tools.hpp:46, from /usr/include/boost/test/unit_test.hpp:18, from /local/robotpkg/var/tmp/robotpkg/wip/metapod/work/metapod-1.0.10/tests/spatial/../common.hh:35, from /local/robotpkg/var/tmp/robotpkg/wip/metapod/work/metapod-1.0.10/tests/spatial/test_transform.cc:19: /usr/include/c++/7/tuple:1423:5: note: candidate: template constexpr bool std::operator!=(const std::tuple<_Tps ...>&, const std::tuple<_Elements ...>&) operator!=(const tuple<_TElements...>& __t, ^~~~~~~~ /usr/include/c++/7/tuple:1423:5: note: template argument deduction/substitution failed: In file included from /local/robotpkg/var/tmp/robotpkg/wip/metapod/work/metapod-1.0.10/tests/spatial/test_transform.cc:19:0: /local/robotpkg/var/tmp/robotpkg/wip/metapod/work/metapod-1.0.10/tests/spatial/../common.hh:41:22: note: 'std::basic_istream::__istream_type {aka std::basic_istream}' is not derived from 'const std::tuple<_Tps ...>' return (i >> x) != 0; ^ In file included from /usr/include/c++/7/tuple:39:0, from /usr/include/c++/7/bits/unique_ptr.h:37, from /usr/include/c++/7/memory:80, from /usr/include/boost/config/no_tr1/memory.hpp:21, from /usr/include/boost/smart_ptr/shared_ptr.hpp:23, from /usr/include/boost/shared_ptr.hpp:17, from /usr/include/boost/test/tools/assertion_result.hpp:21, from /usr/include/boost/test/tools/old/impl.hpp:20, from /usr/include/boost/test/test_tools.hpp:46, from /usr/include/boost/test/unit_test.hpp:18, from /local/robotpkg/var/tmp/robotpkg/wip/metapod/work/metapod-1.0.10/tests/spatial/../common.hh:35, from /local/robotpkg/var/tmp/robotpkg/wip/metapod/work/metapod-1.0.10/tests/spatial/test_transform.cc:19: /usr/include/c++/7/array:257:5: note: candidate: template bool std::operator!=(const std::array<_Tp, _Nm>&, const std::array<_Tp, _Nm>&) operator!=(const array<_Tp, _Nm>& __one, const array<_Tp, _Nm>& __two) ^~~~~~~~ /usr/include/c++/7/array:257:5: note: template argument deduction/substitution failed: In file included from /local/robotpkg/var/tmp/robotpkg/wip/metapod/work/metapod-1.0.10/tests/spatial/test_transform.cc:19:0: /local/robotpkg/var/tmp/robotpkg/wip/metapod/work/metapod-1.0.10/tests/spatial/../common.hh:41:22: note: 'std::basic_istream::__istream_type {aka std::basic_istream}' is not derived from 'const std::array<_Tp, _Nm>' return (i >> x) != 0; ^ In file included from /usr/include/c++/7/iterator:66:0, from /usr/include/boost/test/detail/workaround.hpp:19, from /usr/include/boost/test/detail/global_typedef.hpp:16, from /usr/include/boost/test/tree/observer.hpp:17, from /usr/include/boost/test/unit_test_log.hpp:18, from /usr/include/boost/test/tools/old/impl.hpp:19, from /usr/include/boost/test/test_tools.hpp:46, from /usr/include/boost/test/unit_test.hpp:18, from /local/robotpkg/var/tmp/robotpkg/wip/metapod/work/metapod-1.0.10/tests/spatial/../common.hh:35, from /local/robotpkg/var/tmp/robotpkg/wip/metapod/work/metapod-1.0.10/tests/spatial/test_transform.cc:19: /usr/include/c++/7/bits/stream_iterator.h:137:5: note: candidate: template bool std::operator!=(const std::istream_iterator<_Tp, _CharT, _Traits, _Dist>&, const std::istream_iterator<_Tp, _CharT, _Traits, _Dist>&) operator!=(const istream_iterator<_Tp, _CharT, _Traits, _Dist>& __x, ^~~~~~~~ /usr/include/c++/7/bits/stream_iterator.h:137:5: note: template argument deduction/substitution failed: In file included from /local/robotpkg/var/tmp/robotpkg/wip/metapod/work/metapod-1.0.10/tests/spatial/test_transform.cc:19:0: /local/robotpkg/var/tmp/robotpkg/wip/metapod/work/metapod-1.0.10/tests/spatial/../common.hh:41:22: note: 'std::basic_istream::__istream_type {aka std::basic_istream}' is not derived from 'const std::istream_iterator<_Tp, _CharT, _Traits, _Dist>' return (i >> x) != 0; ^ In file included from /usr/include/c++/7/bits/locale_facets.h:48:0, from /usr/include/c++/7/bits/basic_ios.h:37, from /usr/include/c++/7/ios:44, from /usr/include/c++/7/ostream:38, from /usr/include/c++/7/iostream:39, from /local/robotpkg/var/tmp/robotpkg/wip/metapod/work/metapod-1.0.10/tests/spatial/test_transform.cc:17: /usr/include/c++/7/bits/streambuf_iterator.h:210:5: note: candidate: template bool std::operator!=(const std::istreambuf_iterator<_CharT, _Traits>&, const std::istreambuf_iterator<_CharT, _Traits>&) operator!=(const istreambuf_iterator<_CharT, _Traits>& __a, ^~~~~~~~ /usr/include/c++/7/bits/streambuf_iterator.h:210:5: note: template argument deduction/substitution failed: In file included from /local/robotpkg/var/tmp/robotpkg/wip/metapod/work/metapod-1.0.10/tests/spatial/test_transform.cc:19:0: /local/robotpkg/var/tmp/robotpkg/wip/metapod/work/metapod-1.0.10/tests/spatial/../common.hh:41:22: note: 'std::basic_istream::__istream_type {aka std::basic_istream}' is not derived from 'const std::istreambuf_iterator<_CharT, _Traits>' return (i >> x) != 0; ^ In file included from /usr/include/c++/7/bits/ios_base.h:46:0, from /usr/include/c++/7/ios:42, from /usr/include/c++/7/ostream:38, from /usr/include/c++/7/iostream:39, from /local/robotpkg/var/tmp/robotpkg/wip/metapod/work/metapod-1.0.10/tests/spatial/test_transform.cc:17: /usr/include/c++/7/system_error:331:3: note: candidate: bool std::operator!=(const std::error_condition&, const std::error_condition&) operator!=(const error_condition& __lhs, ^~~~~~~~ /usr/include/c++/7/system_error:331:3: note: no known conversion for argument 1 from 'std::basic_istream::__istream_type {aka std::basic_istream}' to 'const std::error_condition&' /usr/include/c++/7/system_error:327:3: note: candidate: bool std::operator!=(const std::error_condition&, const std::error_code&) operator!=(const error_condition& __lhs, const error_code& __rhs) noexcept ^~~~~~~~ /usr/include/c++/7/system_error:327:3: note: no known conversion for argument 1 from 'std::basic_istream::__istream_type {aka std::basic_istream}' to 'const std::error_condition&' /usr/include/c++/7/system_error:323:3: note: candidate: bool std::operator!=(const std::error_code&, const std::error_condition&) operator!=(const error_code& __lhs, const error_condition& __rhs) noexcept ^~~~~~~~ /usr/include/c++/7/system_error:323:3: note: no known conversion for argument 1 from 'std::basic_istream::__istream_type {aka std::basic_istream}' to 'const std::error_code&' /usr/include/c++/7/system_error:319:3: note: candidate: bool std::operator!=(const std::error_code&, const std::error_code&) operator!=(const error_code& __lhs, const error_code& __rhs) noexcept ^~~~~~~~ /usr/include/c++/7/system_error:319:3: note: no known conversion for argument 1 from 'std::basic_istream::__istream_type {aka std::basic_istream}' to 'const std::error_code&' In file included from /usr/include/c++/7/string:52:0, from /usr/include/c++/7/bits/locale_classes.h:40, from /usr/include/c++/7/bits/ios_base.h:41, from /usr/include/c++/7/ios:42, from /usr/include/c++/7/ostream:38, from /usr/include/c++/7/iostream:39, from /local/robotpkg/var/tmp/robotpkg/wip/metapod/work/metapod-1.0.10/tests/spatial/test_transform.cc:17: /usr/include/c++/7/bits/basic_string.h:6072:5: note: candidate: template bool std::operator!=(const std::__cxx11::basic_string<_CharT, _Traits, _Alloc>&, const _CharT*) operator!=(const basic_string<_CharT, _Traits, _Alloc>& __lhs, ^~~~~~~~ /usr/include/c++/7/bits/basic_string.h:6072:5: note: template argument deduction/substitution failed: In file included from /local/robotpkg/var/tmp/robotpkg/wip/metapod/work/metapod-1.0.10/tests/spatial/test_transform.cc:19:0: /local/robotpkg/var/tmp/robotpkg/wip/metapod/work/metapod-1.0.10/tests/spatial/../common.hh:41:22: note: 'std::basic_istream::__istream_type {aka std::basic_istream}' is not derived from 'const std::__cxx11::basic_string<_CharT, _Traits, _Alloc>' return (i >> x) != 0; ^ In file included from /usr/include/c++/7/string:52:0, from /usr/include/c++/7/bits/locale_classes.h:40, from /usr/include/c++/7/bits/ios_base.h:41, from /usr/include/c++/7/ios:42, from /usr/include/c++/7/ostream:38, from /usr/include/c++/7/iostream:39, from /local/robotpkg/var/tmp/robotpkg/wip/metapod/work/metapod-1.0.10/tests/spatial/test_transform.cc:17: /usr/include/c++/7/bits/basic_string.h:6060:5: note: candidate: template bool std::operator!=(const _CharT*, const std::__cxx11::basic_string<_CharT, _Traits, _Alloc>&) operator!=(const _CharT* __lhs, ^~~~~~~~ /usr/include/c++/7/bits/basic_string.h:6060:5: note: template argument deduction/substitution failed: In file included from /local/robotpkg/var/tmp/robotpkg/wip/metapod/work/metapod-1.0.10/tests/spatial/test_transform.cc:19:0: /local/robotpkg/var/tmp/robotpkg/wip/metapod/work/metapod-1.0.10/tests/spatial/../common.hh:41:22: note: mismatched types 'const _CharT*' and 'std::basic_istream' return (i >> x) != 0; ^ In file included from /usr/include/c++/7/string:52:0, from /usr/include/c++/7/bits/locale_classes.h:40, from /usr/include/c++/7/bits/ios_base.h:41, from /usr/include/c++/7/ios:42, from /usr/include/c++/7/ostream:38, from /usr/include/c++/7/iostream:39, from /local/robotpkg/var/tmp/robotpkg/wip/metapod/work/metapod-1.0.10/tests/spatial/test_transform.cc:17: /usr/include/c++/7/bits/basic_string.h:6047:5: note: candidate: template bool std::operator!=(const std::__cxx11::basic_string<_CharT, _Traits, _Alloc>&, const std::__cxx11::basic_string<_CharT, _Traits, _Alloc>&) operator!=(const basic_string<_CharT, _Traits, _Alloc>& __lhs, ^~~~~~~~ /usr/include/c++/7/bits/basic_string.h:6047:5: note: template argument deduction/substitution failed: In file included from /local/robotpkg/var/tmp/robotpkg/wip/metapod/work/metapod-1.0.10/tests/spatial/test_transform.cc:19:0: /local/robotpkg/var/tmp/robotpkg/wip/metapod/work/metapod-1.0.10/tests/spatial/../common.hh:41:22: note: 'std::basic_istream::__istream_type {aka std::basic_istream}' is not derived from 'const std::__cxx11::basic_string<_CharT, _Traits, _Alloc>' return (i >> x) != 0; ^ In file included from /usr/include/c++/7/string:41:0, from /usr/include/c++/7/bits/locale_classes.h:40, from /usr/include/c++/7/bits/ios_base.h:41, from /usr/include/c++/7/ios:42, from /usr/include/c++/7/ostream:38, from /usr/include/c++/7/iostream:39, from /local/robotpkg/var/tmp/robotpkg/wip/metapod/work/metapod-1.0.10/tests/spatial/test_transform.cc:17: /usr/include/c++/7/bits/allocator.h:164:5: note: candidate: template bool std::operator!=(const std::allocator<_CharT>&, const std::allocator<_CharT>&) operator!=(const allocator<_Tp>&, const allocator<_Tp>&) ^~~~~~~~ /usr/include/c++/7/bits/allocator.h:164:5: note: template argument deduction/substitution failed: In file included from /local/robotpkg/var/tmp/robotpkg/wip/metapod/work/metapod-1.0.10/tests/spatial/test_transform.cc:19:0: /local/robotpkg/var/tmp/robotpkg/wip/metapod/work/metapod-1.0.10/tests/spatial/../common.hh:41:22: note: 'std::basic_istream::__istream_type {aka std::basic_istream}' is not derived from 'const std::allocator<_CharT>' return (i >> x) != 0; ^ In file included from /usr/include/c++/7/string:41:0, from /usr/include/c++/7/bits/locale_classes.h:40, from /usr/include/c++/7/bits/ios_base.h:41, from /usr/include/c++/7/ios:42, from /usr/include/c++/7/ostream:38, from /usr/include/c++/7/iostream:39, from /local/robotpkg/var/tmp/robotpkg/wip/metapod/work/metapod-1.0.10/tests/spatial/test_transform.cc:17: /usr/include/c++/7/bits/allocator.h:158:5: note: candidate: template bool std::operator!=(const std::allocator<_CharT>&, const std::allocator<_T2>&) operator!=(const allocator<_T1>&, const allocator<_T2>&) ^~~~~~~~ /usr/include/c++/7/bits/allocator.h:158:5: note: template argument deduction/substitution failed: In file included from /local/robotpkg/var/tmp/robotpkg/wip/metapod/work/metapod-1.0.10/tests/spatial/test_transform.cc:19:0: /local/robotpkg/var/tmp/robotpkg/wip/metapod/work/metapod-1.0.10/tests/spatial/../common.hh:41:22: note: 'std::basic_istream::__istream_type {aka std::basic_istream}' is not derived from 'const std::allocator<_CharT>' return (i >> x) != 0; ^ In file included from /usr/include/c++/7/bits/stl_algobase.h:67:0, from /usr/include/c++/7/bits/char_traits.h:39, from /usr/include/c++/7/ios:40, from /usr/include/c++/7/ostream:38, from /usr/include/c++/7/iostream:39, from /local/robotpkg/var/tmp/robotpkg/wip/metapod/work/metapod-1.0.10/tests/spatial/test_transform.cc:17: /usr/include/c++/7/bits/stl_iterator.h:1136:5: note: candidate: template bool std::operator!=(const std::move_iterator<_IteratorL>&, const std::move_iterator<_IteratorL>&) operator!=(const move_iterator<_Iterator>& __x, ^~~~~~~~ /usr/include/c++/7/bits/stl_iterator.h:1136:5: note: template argument deduction/substitution failed: In file included from /local/robotpkg/var/tmp/robotpkg/wip/metapod/work/metapod-1.0.10/tests/spatial/test_transform.cc:19:0: /local/robotpkg/var/tmp/robotpkg/wip/metapod/work/metapod-1.0.10/tests/spatial/../common.hh:41:22: note: 'std::basic_istream::__istream_type {aka std::basic_istream}' is not derived from 'const std::move_iterator<_IteratorL>' return (i >> x) != 0; ^ In file included from /usr/include/c++/7/bits/stl_algobase.h:67:0, from /usr/include/c++/7/bits/char_traits.h:39, from /usr/include/c++/7/ios:40, from /usr/include/c++/7/ostream:38, from /usr/include/c++/7/iostream:39, from /local/robotpkg/var/tmp/robotpkg/wip/metapod/work/metapod-1.0.10/tests/spatial/test_transform.cc:17: /usr/include/c++/7/bits/stl_iterator.h:1130:5: note: candidate: template bool std::operator!=(const std::move_iterator<_IteratorL>&, const std::move_iterator<_IteratorR>&) operator!=(const move_iterator<_IteratorL>& __x, ^~~~~~~~ /usr/include/c++/7/bits/stl_iterator.h:1130:5: note: template argument deduction/substitution failed: In file included from /local/robotpkg/var/tmp/robotpkg/wip/metapod/work/metapod-1.0.10/tests/spatial/test_transform.cc:19:0: /local/robotpkg/var/tmp/robotpkg/wip/metapod/work/metapod-1.0.10/tests/spatial/../common.hh:41:22: note: 'std::basic_istream::__istream_type {aka std::basic_istream}' is not derived from 'const std::move_iterator<_IteratorL>' return (i >> x) != 0; ^ In file included from /usr/include/c++/7/bits/stl_algobase.h:67:0, from /usr/include/c++/7/bits/char_traits.h:39, from /usr/include/c++/7/ios:40, from /usr/include/c++/7/ostream:38, from /usr/include/c++/7/iostream:39, from /local/robotpkg/var/tmp/robotpkg/wip/metapod/work/metapod-1.0.10/tests/spatial/test_transform.cc:17: /usr/include/c++/7/bits/stl_iterator.h:349:5: note: candidate: template bool std::operator!=(const std::reverse_iterator<_Iterator>&, const std::reverse_iterator<_IteratorR>&) operator!=(const reverse_iterator<_IteratorL>& __x, ^~~~~~~~ /usr/include/c++/7/bits/stl_iterator.h:349:5: note: template argument deduction/substitution failed: In file included from /local/robotpkg/var/tmp/robotpkg/wip/metapod/work/metapod-1.0.10/tests/spatial/test_transform.cc:19:0: /local/robotpkg/var/tmp/robotpkg/wip/metapod/work/metapod-1.0.10/tests/spatial/../common.hh:41:22: note: 'std::basic_istream::__istream_type {aka std::basic_istream}' is not derived from 'const std::reverse_iterator<_Iterator>' return (i >> x) != 0; ^ In file included from /usr/include/c++/7/bits/stl_algobase.h:67:0, from /usr/include/c++/7/bits/char_traits.h:39, from /usr/include/c++/7/ios:40, from /usr/include/c++/7/ostream:38, from /usr/include/c++/7/iostream:39, from /local/robotpkg/var/tmp/robotpkg/wip/metapod/work/metapod-1.0.10/tests/spatial/test_transform.cc:17: /usr/include/c++/7/bits/stl_iterator.h:311:5: note: candidate: template bool std::operator!=(const std::reverse_iterator<_Iterator>&, const std::reverse_iterator<_Iterator>&) operator!=(const reverse_iterator<_Iterator>& __x, ^~~~~~~~ /usr/include/c++/7/bits/stl_iterator.h:311:5: note: template argument deduction/substitution failed: In file included from /local/robotpkg/var/tmp/robotpkg/wip/metapod/work/metapod-1.0.10/tests/spatial/test_transform.cc:19:0: /local/robotpkg/var/tmp/robotpkg/wip/metapod/work/metapod-1.0.10/tests/spatial/../common.hh:41:22: note: 'std::basic_istream::__istream_type {aka std::basic_istream}' is not derived from 'const std::reverse_iterator<_Iterator>' return (i >> x) != 0; ^ In file included from /usr/include/c++/7/bits/stl_algobase.h:64:0, from /usr/include/c++/7/bits/char_traits.h:39, from /usr/include/c++/7/ios:40, from /usr/include/c++/7/ostream:38, from /usr/include/c++/7/iostream:39, from /local/robotpkg/var/tmp/robotpkg/wip/metapod/work/metapod-1.0.10/tests/spatial/test_transform.cc:17: /usr/include/c++/7/bits/stl_pair.h:456:5: note: candidate: template constexpr bool std::operator!=(const std::pair<_T1, _T2>&, const std::pair<_T1, _T2>&) operator!=(const pair<_T1, _T2>& __x, const pair<_T1, _T2>& __y) ^~~~~~~~ /usr/include/c++/7/bits/stl_pair.h:456:5: note: template argument deduction/substitution failed: In file included from /local/robotpkg/var/tmp/robotpkg/wip/metapod/work/metapod-1.0.10/tests/spatial/test_transform.cc:19:0: /local/robotpkg/var/tmp/robotpkg/wip/metapod/work/metapod-1.0.10/tests/spatial/../common.hh:41:22: note: 'std::basic_istream::__istream_type {aka std::basic_istream}' is not derived from 'const std::pair<_T1, _T2>' return (i >> x) != 0; ^ In file included from /usr/include/c++/7/iosfwd:40:0, from /usr/include/c++/7/ios:38, from /usr/include/c++/7/ostream:38, from /usr/include/c++/7/iostream:39, from /local/robotpkg/var/tmp/robotpkg/wip/metapod/work/metapod-1.0.10/tests/spatial/test_transform.cc:17: /usr/include/c++/7/bits/postypes.h:221:5: note: candidate: template bool std::operator!=(const std::fpos<_StateT>&, const std::fpos<_StateT>&) operator!=(const fpos<_StateT>& __lhs, const fpos<_StateT>& __rhs) ^~~~~~~~ /usr/include/c++/7/bits/postypes.h:221:5: note: template argument deduction/substitution failed: In file included from /local/robotpkg/var/tmp/robotpkg/wip/metapod/work/metapod-1.0.10/tests/spatial/test_transform.cc:19:0: /local/robotpkg/var/tmp/robotpkg/wip/metapod/work/metapod-1.0.10/tests/spatial/../common.hh:41:22: note: 'std::basic_istream::__istream_type {aka std::basic_istream}' is not derived from 'const std::fpos<_StateT>' return (i >> x) != 0; ^ make[2]: *** [tests/spatial/CMakeFiles/test_doubledef.dir/build.make:66: tests/spatial/CMakeFiles/test_doubledef.dir/test_doubledef.cc.o] Error 1 make[1]: *** [CMakeFiles/Makefile2:904: tests/spatial/CMakeFiles/test_doubledef.dir/all] Error 2 make[1]: *** Waiting for unfinished jobs.... make[2]: Leaving directory '/local/robotpkg/var/tmp/robotpkg/wip/metapod/work/metapod-1.0.10' [ 4%] Linking CXX executable embedfile cd /local/robotpkg/var/tmp/robotpkg/wip/metapod/work/metapod-1.0.10/embedfile && /usr/bin/cmake -E cmake_link_script CMakeFiles/embedfile.dir/link.txt --verbose=1 /usr/bin/g++ -pedantic -Wno-long-long -Wall -Wextra -Wcast-align -Wcast-qual -Wformat -Wwrite-strings -Wconversion -pipe -O3 -DNDEBUG -rdynamic CMakeFiles/embedfile.dir/src/embedfile.cc.o -o embedfile -lboost_filesystem -lboost_system -lboost_unit_test_framework -lboost_program_options -lboost_regex make[2]: Leaving directory '/local/robotpkg/var/tmp/robotpkg/wip/metapod/work/metapod-1.0.10' [ 4%] Built target embedfile make[2]: *** [tests/spatial/CMakeFiles/test_rotation.dir/build.make:66: tests/spatial/CMakeFiles/test_rotation.dir/test_rotation.cc.o] Error 1 make[2]: Leaving directory '/local/robotpkg/var/tmp/robotpkg/wip/metapod/work/metapod-1.0.10' make[1]: *** [CMakeFiles/Makefile2:830: tests/spatial/CMakeFiles/test_rotation.dir/all] Error 2 make[2]: *** [tests/spatial/CMakeFiles/test_transform.dir/build.make:66: tests/spatial/CMakeFiles/test_transform.dir/test_transform.cc.o] Error 1 make[1]: *** [CMakeFiles/Makefile2:867: tests/spatial/CMakeFiles/test_transform.dir/all] Error 2 make: *** [Makefile:166: all] Error 2 make[2]: Leaving directory '/local/robotpkg/var/tmp/robotpkg/wip/metapod/work/metapod-1.0.10' make[1]: Leaving directory '/local/robotpkg/var/tmp/robotpkg/wip/metapod/work/metapod-1.0.10'