robotpkg/wip/libmove3d-planners bulk build results

Log for libmove3d-planners-1.4.0 on Ubuntu-16.04-x86_64: bulk.log (Back)

=> Checking for clear installation ===> Installing bootstrap dependencies for libmove3d-planners-1.4.0 => Installing /opt/robotpkg/var/lib/robotpkg/packages/bsd/Ubuntu-16.04-x86_64/All/digest-20080510.tgz => Installing /opt/robotpkg/var/lib/robotpkg/packages/bsd/Ubuntu-16.04-x86_64/All/tnftp-20130505~ssl.tgz ===> Checking bootstrap dependencies for libmove3d-planners-1.4.0 => Required robotpkg package digest>=20080510: digest-20080510 found => Required robotpkg package tnftp>=20091122: tnftp-20130505~ssl found => Required system package gnupg>=1: gnupg-1.4.20 found => Required system package gzip: gzip-1.6 found => Required system package pax and tar archivers: pax found => Required system package pkg_install>=20110805.9: pkg_install-20110805.9 found => Required system package pkgrepo2deb>=1.6.1: pkgrepo2deb-1.6.1 found ===> Done bootstrap-depends for libmove3d-planners-1.4.0 ===> Installing full dependencies for libmove3d-planners-1.4.0 => Dependency digest-20080510 already installed WARNING: Cannot check installed version of libXpm => Installing /opt/robotpkg/var/lib/robotpkg/wip/packages/bsd/Ubuntu-16.04-x86_64/All/libmove3d-3.22.0r1.tgz => Installing /opt/robotpkg/var/lib/robotpkg/wip/packages/bsd/Ubuntu-16.04-x86_64/All/libmove3d-hri-2.24.tgz => Dependency tnftp-20130505~ssl already installed ===> Checking build options for libmove3d-planners-1.4.0 => Building with no option. ===> Checking alternatives for libmove3d-planners-1.4.0 => Use the GNU C++ compiler: c++-compiler provided by g++>=3 => Use the GNU C compiler: c-compiler provided by gcc>=3 ===> Checking dependencies for libmove3d-planners-1.4.0 => Required system package boost-headers>=1.34.1: boost-headers-1.58 found => Required system package boostlib-filesystem{>=1.34.1<1.49,>=1.50}: boost-lib-filesystem-1.58.0 found => Required system package boostlib-iostreams{>=1.34.1<1.49,>=1.50}: boost-lib-iostreams-1.58.0 found => Required system package boostlib-math{>=1.34.1<1.49,>=1.50}: boost-lib-math-1.58.0 found => Required system package boostlib-thread{>=1.34.1<1.49,>=1.50}: boost-lib-thread-1.58.0 found => Required system package cmake>=2.6: cmake-3.5.1 found => Required system package eigen3>=3.0.0: eigen3-3.2.92 found => Required system package g++>=3: g++-5.4.0 found => Required system package gcc>=3: gcc-5.4.0 found => Required system package glu>=7: glu-9.0.0 found => Required system package libXpm>=3.5.7: libXpm found => Required system package libstdc++: libstdc++ found => Required system package pkg-config>=0.22: pkg-config-0.29.1 found WARNING: Cannot check installed version of libXpm => Required robotpkg package libmove3d>=3.22.0: libmove3d-3.22.0r1 found => Required robotpkg package libmove3d-hri>=2.24: libmove3d-hri-2.24 found ===> Done depends for libmove3d-planners-1.4.0 ===> Extracting for libmove3d-planners-1.4.0 => SHA1 checksums OK => RMD160 checksums OK ===> Configuring for libmove3d-planners-1.4.0 I've found Qt4 libraries. I will compile libmove3d-planners with it. Active Flags : QT_LIBRARY P3D_CONSTRAINTS P3D_COLLISION_CHECKING P3D_LOCALPATH P3D_PLANNER LIGHT_PLANNER GRASP_PLANNING MULTILOCALPATH MULTIGRAPH USE_GBM USE_GSL HRI_COSTSPACE HRI_PLANNER HRICS_MHO_REPLACE_OTP DEBUG_STATUS IMPORTANT : ----- linking against ----> libmove3d-viewer MOVE3DVIEWER_INCLUDE_DIRS = /opt/openrobots/include/libmove3d/opt/openrobots/include/libmove3d/include/opt/openrobots/include/usr/include/qt4/usr/include/libxml2/opt/openrobots/include MOVE3DVIEWER_LIBRARIES = move3d include dirs: /usr/include;/usr/include/libxml2;/usr/include;/usr/include/eigen3;/usr/include;/opt/openrobots/include;/opt/openrobots/include ===> Building for libmove3d-planners-1.4.0 /local/robotpkg/var/tmp/robotpkg/wip/libmove3d-planners/work/libmove3d-planners-1.4.0/src/API/Grids/TwoDCell.cpp:10:23: fatal error: Eigen/Array: No such file or directory compilation terminated. make[2]: *** [CMakeFiles/move3d-planners.dir/src/API/Grids/TwoDCell.cpp.o] Error 1 make[2]: *** Waiting for unfinished jobs.... make[1]: *** [CMakeFiles/move3d-planners.dir/all] Error 2 make: *** [all] Error 2 An unexpected error occured. The last 10 log lines are shown below. | compilation terminated. | CMakeFiles/move3d-planners.dir/build.make:382: recipe for target 'CMakeFiles/move3d-planners.dir/src/API/Grids/TwoDCell.cpp.o' failed | make[2]: *** [CMakeFiles/move3d-planners.dir/src/API/Grids/TwoDCell.cpp.o] Error 1 | make[2]: *** Waiting for unfinished jobs.... | make[2]: Leaving directory '/local/robotpkg/var/tmp/robotpkg/wip/libmove3d-planners/work/libmove3d-planners-1.4.0' | CMakeFiles/Makefile2:70: recipe for target 'CMakeFiles/move3d-planners.dir/all' failed | make[1]: *** [CMakeFiles/move3d-planners.dir/all] Error 2 | make[1]: Leaving directory '/local/robotpkg/var/tmp/robotpkg/wip/libmove3d-planners/work/libmove3d-planners-1.4.0' | Makefile:130: recipe for target 'all' failed | make: *** [all] Error 2 For details or bug reports, check the complete log file in: /local/robotpkg/var/tmp/robotpkg/wip/libmove3d-planners/work/build.log make[3]: *** [do-build] Error 2 /local/robotpkg/var/lib/robotpkg/mk/build/build.mk:198: recipe for target 'do-build' failed /local/robotpkg/var/lib/robotpkg/mk/pkg/package.mk:42: recipe for target 'pkg-check-installed' failed make[2]: *** [pkg-check-installed] Error 2 => Marking libmove3d-planners-1.4.0 as broken ERROR: make: *** [package] Error 2 ===> Deinstalling for libmove3d-planners Removed digest-20080510 Removing dependency gbM-0.11~tcl Removing dependency softMotion-libs-3.12~tcl Removing dependency Removing dependency libmove3d-hri-2.24 Removed libmove3d-3.22.0r1 Removed tnftp-20130505~ssl