robotpkg/wip/eigen-quadprog bulk build results

Log for eigen-quadprog-1.0.0 on NetBSD-8.0-x86_64: bulk.log (Back)

=> Checking for clear installation ===> Installing bootstrap dependencies for eigen-quadprog-1.0.0 => Installing /opt/robotpkg/var/lib/robotpkg/packages/bsd/NetBSD-8.0-x86_64/All/digest-20080510.tgz => Installing /opt/robotpkg/var/lib/robotpkg/packages/bsd/NetBSD-8.0-x86_64/All/tnftp-20130505~ssl.tgz ===> Checking bootstrap dependencies for eigen-quadprog-1.0.0 => Required robotpkg package digest>=20080510: digest-20080510 found => Required robotpkg package tnftp>=20091122: tnftp-20130505~ssl found => Required system package gzip: gzip-20150113 found => Required system package pax and tar archivers: pax found => Required system package pkg_install>=20110805.9: pkg_install-20110805.9 found ===> Done bootstrap-depends for eigen-quadprog-1.0.0 ===> Installing full dependencies for eigen-quadprog-1.0.0 => Dependency digest-20080510 already installed => Dependency tnftp-20130505~ssl already installed ===> Checking build options for eigen-quadprog-1.0.0 => Building with no option. ===> Checking alternatives for eigen-quadprog-1.0.0 => Use the GNU C++ compiler: c++-compiler provided by g++>=3 => Use the GNU C compiler: c-compiler provided by gcc>=3 => Use the g95 fortran compiler: fortran-compiler provided by g95>=0.92 => Use python-2.7: python>=2.5<3.9 provided by python27>=2.7<2.8 ===> Checking dependencies for eigen-quadprog-1.0.0 => Required system package boost-headers>=1.34.1: boost-headers-1.71 found => Required system package boostlib-filesystem>=1.34.1: boost-libs-1.71 found => Required system package boostlib-iostreams>=1.34.1: boost-libs-1.71 found => Required system package boostlib-math>=1.34.1: boost-libs-1.71 found => Required system package boostlib-thread>=1.34.1: boost-libs-1.71 found => Required system package cmake>=2.6: cmake-3.15.3 found => Required system package eigen3>=3.0.0: eigen3-3.3.7 found => Required system package g++>=3: g++-5.5.0 found => Required system package g95>=0.92: g95-0.93 found => Required system package gcc>=3: gcc-5.5.0 found => Required system package libstdc++: libstdc++ found => Required system package pkg-config>=0.22: pkg-config-1.6.0 found => Required system package python27>=2.7<2.8: python27-2.7.16 found ===> Done depends for eigen-quadprog-1.0.0 ===> Extracting for eigen-quadprog-1.0.0 => SHA1 checksums OK => RMD160 checksums OK tar: ustar vol 1, 393 files, 3422208 bytes read, 0 bytes written in 1 secs (3422208 bytes/sec) ===> Configuring for eigen-quadprog-1.0.0 -- Doxygen rendering: using MathJax backend ===> Building for eigen-quadprog-1.0.0 /local/robotpkg/var/tmp/robotpkg/wip/eigen-quadprog/work/eigen-quadprog-1.0.0/src/QuadProg/f/solve.QP.f: In function 'qpgen2_': /local/robotpkg/var/tmp/robotpkg/wip/eigen-quadprog/work/eigen-quadprog-1.0.0/src/QuadProg/f/solve.QP.f:503: warning: will never be executed /local/robotpkg/var/tmp/robotpkg/wip/eigen-quadprog/work/eigen-quadprog-1.0.0/src/QuadProg/f/solve.QP.f:411: warning: will never be executed /local/robotpkg/var/tmp/robotpkg/wip/eigen-quadprog/work/eigen-quadprog-1.0.0/src/QuadProg/f/solve.QP.compact.f: In function 'qpgen1_': /local/robotpkg/var/tmp/robotpkg/wip/eigen-quadprog/work/eigen-quadprog-1.0.0/src/QuadProg/f/solve.QP.compact.f:512: warning: will never be executed /local/robotpkg/var/tmp/robotpkg/wip/eigen-quadprog/work/eigen-quadprog-1.0.0/src/QuadProg/f/solve.QP.compact.f:420: warning: will never be executed /local/robotpkg/var/tmp/robotpkg/wip/eigen-quadprog/work/eigen-quadprog-1.0.0/src/QuadProg/f/solve.QP.f:237: warning: will never be executed /local/robotpkg/var/tmp/robotpkg/wip/eigen-quadprog/work/eigen-quadprog-1.0.0/src/QuadProg/f/solve.QP.f:208: warning: will never be executed /local/robotpkg/var/tmp/robotpkg/wip/eigen-quadprog/work/eigen-quadprog-1.0.0/src/QuadProg/f/solve.QP.f:124: warning: will never be executed /local/robotpkg/var/tmp/robotpkg/wip/eigen-quadprog/work/eigen-quadprog-1.0.0/src/QuadProg/f/solve.QP.compact.f:246: warning: will never be executed /local/robotpkg/var/tmp/robotpkg/wip/eigen-quadprog/work/eigen-quadprog-1.0.0/src/QuadProg/f/solve.QP.compact.f:217: warning: will never be executed /local/robotpkg/var/tmp/robotpkg/wip/eigen-quadprog/work/eigen-quadprog-1.0.0/src/QuadProg/f/solve.QP.compact.f:133: warning: will never be executed /local/robotpkg/var/tmp/robotpkg/wip/eigen-quadprog/work/eigen-quadprog-1.0.0/src/BLAS/f/blas.f: In function 'dscal_': /local/robotpkg/var/tmp/robotpkg/wip/eigen-quadprog/work/eigen-quadprog-1.0.0/src/BLAS/f/blas.f:260: warning: will never be executed /local/robotpkg/var/tmp/robotpkg/wip/eigen-quadprog/work/eigen-quadprog-1.0.0/src/BLAS/f/blas.f: In function 'ddot_': /local/robotpkg/var/tmp/robotpkg/wip/eigen-quadprog/work/eigen-quadprog-1.0.0/src/BLAS/f/blas.f:120: warning: will never be executed /local/robotpkg/var/tmp/robotpkg/wip/eigen-quadprog/work/eigen-quadprog-1.0.0/src/BLAS/f/blas.f: In function 'daxpy_': /local/robotpkg/var/tmp/robotpkg/wip/eigen-quadprog/work/eigen-quadprog-1.0.0/src/BLAS/f/blas.f:47: warning: will never be executed /local/robotpkg/var/tmp/robotpkg/wip/eigen-quadprog/work/eigen-quadprog-1.0.0/src/BLAS/f/blas.f: In function 'ddot_': /local/robotpkg/var/tmp/robotpkg/wip/eigen-quadprog/work/eigen-quadprog-1.0.0/src/BLAS/f/blas.f:133: warning: will never be executed /local/robotpkg/var/tmp/robotpkg/wip/eigen-quadprog/work/eigen-quadprog-1.0.0/src/BLAS/f/blas.f: In function 'dscal_': /local/robotpkg/var/tmp/robotpkg/wip/eigen-quadprog/work/eigen-quadprog-1.0.0/src/BLAS/f/blas.f:272: warning: will never be executed /local/robotpkg/var/tmp/robotpkg/wip/eigen-quadprog/work/eigen-quadprog-1.0.0/src/QuadProg.cpp: In member function 'bool Eigen::QuadProgSparse::solve(const MatrixXd&, const VectorXd&, const Eigen::SparseMatrix&, const VectorXd&, const Eigen::SparseMatrix&, const VectorXd&, bool)': /local/robotpkg/var/tmp/robotpkg/wip/eigen-quadprog/work/eigen-quadprog-1.0.0/src/QuadProg.cpp:206:27: warning: conversion to 'Eigen::DenseCoeffsBase, 1>::Scalar {aka int}' from 'Eigen::Index {aka long int}' may alter its value [-Wconversion] iA_(nrValCi, it.row()) = it.col() + 1; ^ /local/robotpkg/var/tmp/robotpkg/wip/eigen-quadprog/work/eigen-quadprog-1.0.0/src/QuadProg.cpp:216:34: warning: conversion to 'Eigen::DenseCoeffsBase, 1>::Scalar {aka int}' from 'Eigen::Index {aka long int}' may alter its value [-Wconversion] iA_(nrValCi, it.row() + nreq) = it.col() + 1; ^ In file included from /local/robotpkg/var/tmp/robotpkg/wip/eigen-quadprog/work/eigen-quadprog-1.0.0/tests/QPTest.cpp:25:0: /usr/pkg/include/boost/test/floating_point_comparison.hpp:14:152: note: #pragma message: This header is deprecated. Use This header is deprecated. Please use instead. instead. ld: warning: libf95.so.0, needed by ../src/libeigen-quadprog.so, not found (try using -rpath or -rpath-link) ../src/libeigen-quadprog.so: undefined reference to `_g95_sign_r8' gmake[2]: *** [tests/CMakeFiles/QPTest.dir/build.make:89: tests/QPTest] Error 1 gmake[1]: *** [CMakeFiles/Makefile2:397: tests/CMakeFiles/QPTest.dir/all] Error 2 gmake: *** [Makefile:144: all] Error 2 An unexpected error occured. The last 10 log lines are shown below. | [100%] Linking CXX executable QPTest | cd /local/robotpkg/var/tmp/robotpkg/wip/eigen-quadprog/work/eigen-quadprog-1.0.0/tests && /usr/pkg/bin/cmake -E cmake_link_script CMakeFiles/QPTest.dir/link.txt --verbose=1 => Marking eigen-quadprog-1.0.0 as broken | /usr/bin/g++ -pipe -O3 -DNDEBUG -pedantic -Wno-long-long -Wall -Wextra -Wcast-align -Wcast-qual -Wformat -Wwrite-strings -Wconversion -std=c++0x -Wall -Wextra -pedantic CMakeFiles/QPTest.dir/QPTest.cpp.o -o QPTest -Wl,-rpath,/usr/pkg/lib:/local/robotpkg/var/tmp/robotpkg/wip/eigen-quadprog/work/eigen-quadprog-1.0.0/src /usr/pkg/lib/libboost_unit_test_framework.so ../src/libeigen-quadprog.so | ld: warning: libf95.so.0, needed by ../src/libeigen-quadprog.so, not found (try using -rpath or -rpath-link) | ../src/libeigen-quadprog.so: undefined reference to `_g95_sign_r8' | gmake[2]: *** [tests/CMakeFiles/QPTest.dir/build.make:89: tests/QPTest] Error 1 | gmake[2]: Leaving directory '/local/robotpkg/var/tmp/robotpkg/wip/eigen-quadprog/work/eigen-quadprog-1.0.0' | gmake[1]: *** [CMakeFiles/Makefile2:397: tests/CMakeFiles/QPTest.dir/all] Error 2 | gmake[1]: Leaving directory '/local/robotpkg/var/tmp/robotpkg/wip/eigen-quadprog/work/eigen-quadprog-1.0.0' | gmake: *** [Makefile:144: all] Error 2 For details or bug reports, check the complete log file in: /local/robotpkg/var/tmp/robotpkg/wip/eigen-quadprog/work/build.log gmake[3]: *** [/local/robotpkg/var/lib/robotpkg/mk/build/build.mk:199: do-build] Error 2 gmake[2]: *** [/local/robotpkg/var/lib/robotpkg/mk/pkg/package.mk:42: pkg-check-installed] Error 2 ERROR: /usr/pkg/bin/gmake: *** [package] Error 2 ===> Deinstalling for eigen-quadprog Removed digest-20080510 Removed tnftp-20130505~ssl