robotpkg/wip/eigen-quadprog bulk build results

Log for eigen-quadprog-1.0.0 on NetBSD-8.0-x86_64: build.log (Back)

--- Environment --- _override_vars_pkgtools_pkg_config=PKGREQD PKGREQD PKGREQD PYTHON=/usr/pkg/bin/python2.7 _overrides_devel_boost_headers_PKGREQD=boost-headers>=1.34.1 boost-headers>=1.34.1 boost-headers>=1.34.1 LC_MONETARY=C _overrides_pkgtools_pkg_install_PKGREQD=pkg_install>=20110805.9 pkg_install>=20110805.9 pkg_install>=20110805.9 CXX=/usr/bin/g++ PAX=/bin/pax MFLAGS=--no-print-directory OS_KERNEL_VERSION=8.0 MAKEFLAGS= --no-print-directory -- PKGREQD.cmdline=eigen-quadprog-1.0.0~!doc RECURSIVE_PKGPATH=wip/eigen-quadprog\ tag=NetBSD-8.0-x86_64 BULK_LOGDIR=/local/robotpkg/var/log/bulk BULKBASE=/opt/openrobots LOCALBASE=/opt/openrobots PKG_DBDIR=/opt/openrobots/var/db/robotpkg EXPECT_TARGETS=fetch\ install\ package MAKEOVERRIDES=PKGREQD.cmdline=eigen-quadprog-1.0.0~!doc RECURSIVE_PKGPATH=wip/eigen-quadprog\ tag=NetBSD-8.0-x86_64 BULK_LOGDIR=/local/robotpkg/var/log/bulk BULKBASE=/opt/openrobots LOCALBASE=/opt/openrobots PKG_DBDIR=/opt/openrobots/var/db/robotpkg EXPECT_TARGETS=fetch\ install\ package TAR=/usr/bin/tar GXX=/usr/bin/g++ BULK_LOGDIR=/local/robotpkg/var/log/bulk PWD=/local/robotpkg/var/lib/robotpkg/wip/eigen-quadprog LANG=C GZIP_CMD=/usr/bin/gzip _overrides_math_eigen3_PKGREQD=eigen3>=3.0.0 eigen3>=3.0.0 eigen3>=3.0.0 HOME=/ _override_vars_devel_boost_headers=PKGREQD PKGREQD PKGREQD CMAKE=/usr/pkg/bin/cmake PATH=/sbin:/bin:/usr/sbin:/usr/bin CXXCPP=/usr/bin/g++ -E LC_MESSAGES=C _overrides_archivers_pax_PKGREQD=pax pax PYTHON27_INCLUDE=/usr/pkg/include/python2.7/ _override_vars_pkgtools_pkg_install=PKGREQD PKGREQD PKGREQD MAKELEVEL=4 _override_vars_pkgtools_tnftp=PKGREQD PKGREQD LOWER_OS_VERSION=8.0 hline="$bf======================================================================$rm" ZCAT=/usr/bin/zcat MACHINE_PLATFORM=NetBSD-8.0-x86_64 _override_vars_pkgtools_digest=PKGREQD PKGREQD LC_NUMERIC=C PYTHON27=/usr/pkg/bin/python2.7 OLDPWD=/local/robotpkg/var/lib/robotpkg/wip/example-adder CC=/usr/bin/gcc FC=/usr/pkg/bin/g95 _overrides_pkgtools_tnftp_PKGREQD=tnftp>=20091122 tnftp>=20091122 PKG_CONFIG=/usr/pkg/bin/pkg-config PYTHON_INCLUDE_CONFIG=/usr/pkg/include/python2.7/ tag=NetBSD-8.0-x86_64 _override_vars_wip_eigen_quadprog=PKGREQD OS_KERNEL=NetBSD ROBOTPKG_TRUSTED_ENV=robotpkg LC_CTYPE=C PYTHON27_LIB=/usr/pkg/lib/libpython2.7.so _override_vars_devel_boost_libs=PKGREQD PKGREQD PKGREQD PKGREQD PKGREQD PKGREQD PKGREQD PKGREQD PKGREQD PKGREQD PKGREQD PKGREQD PYTHONPATH= _override_vars_math_eigen3=PKGREQD PKGREQD PKGREQD _ROBOTPKG_NOW=0125232634 LOWER_ARCH=x86_64 OWNER_GID=robots ROBOTPKG_BASE=/local/robotpkg _overrides_devel_boost_libs_PKGREQD=boost-libs>=1.34.1 boost-libs>=1.34.1 boost-libs>=1.34.1 boost-libs>=1.34.1 boost-libs>=1.34.1 boost-libs>=1.34.1 boost-libs>=1.34.1 boost-libs>=1.34.1 boost-libs>=1.34.1 boost-libs>=1.34.1 boost-libs>=1.34.1 boost-libs>=1.34.1 NODENAME=fluffy64-netbsd8 bf= DIGEST=/opt/openrobots/sbin/robotpkg_digest ECHO_N=echo -n OS_VERSION=8.0 EXPECT_TARGETS=fetch install package LC_COLLATE=C PYTHON_INCLUDE=/usr/pkg/include/python2.7/ rm= _overrides_pkgtools_digest_PKGREQD=digest>=20080510 digest>=20080510 OWNER_UID=rbulk RECURSIVE_PKGPATH=wip/eigen-quadprog MACHINE_ARCH=x86_64 _overrides_wip_eigen_quadprog_PKGREQD=eigen-quadprog-1.0.0~!doc ROBOTPKG_DIR=/local/robotpkg/var/lib/robotpkg _override_vars_archivers_pax=PKGREQD PKGREQD PYTHON_LIB=/usr/pkg/lib/libpython2.7.so LOWER_OPSYS=netbsd LC_TIME=C PYTHONDONTWRITEBYTECODE=1 TNFTP=/opt/openrobots/sbin/tnftp OPSYS=NetBSD LOCALBASE=/opt/openrobots LOWER_OS_KERNEL=netbsd PKGTOOLS_VERSION=20110805.9 BULKBASE=/opt/openrobots G95=/usr/pkg/bin/g95 PKG_CONFIG_LIBDIR=/usr/lib/pkgconfig MACHINE_KERNEL=NetBSD-8.0-x86_64 _overrides_pkgtools_pkg_config_PKGREQD=pkg-config>=0.22 pkg-config>=0.22 pkg-config>=0.22 PKG_CONFIG_PATH=/usr/pkg/lib/pkgconfig GCC=/usr/bin/gcc PKG_DBDIR=/opt/openrobots/var/db/robotpkg MAKECONF=/opt/robotpkg/etc/robotpkg-wip.conf CPP=/usr/bin/gcc -E --- Running set -e; \ cd /local/robotpkg/var/tmp/robotpkg/wip/eigen-quadprog/work/eigen-quadprog-1.0.0 && cd /local/robotpkg/var/tmp/robotpkg/wip/eigen-quadprog/work/eigen-quadprog-1.0.0 && /usr/bin/env MAKELEVEL= MAKEOVERRIDES= MAKEFLAGS= MFLAGS= 'CPPFLAGS=' 'CFLAGS=-pipe -O3 -DNDEBUG' 'LDFLAGS=' 'CXXFLAGS=-pipe -O3 -DNDEBUG' PREFIX='/opt/openrobots' HOME=/local/robotpkg/var/tmp/robotpkg/wip/eigen-quadprog/work PATH='/opt/openrobots/sbin:/sbin:/bin:/usr/sbin:/usr/bin' LD_LIBRARY_PATH='' LOCALBASE=/opt/openrobots PKGMANDIR=man /usr/pkg/bin/gmake -j4 -f Makefile all; /usr/pkg/bin/cmake -S/local/robotpkg/var/tmp/robotpkg/wip/eigen-quadprog/work/eigen-quadprog-1.0.0 -B/local/robotpkg/var/tmp/robotpkg/wip/eigen-quadprog/work/eigen-quadprog-1.0.0 --check-build-system CMakeFiles/Makefile.cmake 0 /usr/pkg/bin/cmake -E cmake_progress_start /local/robotpkg/var/tmp/robotpkg/wip/eigen-quadprog/work/eigen-quadprog-1.0.0/CMakeFiles /local/robotpkg/var/tmp/robotpkg/wip/eigen-quadprog/work/eigen-quadprog-1.0.0/CMakeFiles/progress.marks /usr/pkg/bin/gmake -f CMakeFiles/Makefile2 all gmake[1]: Entering directory '/local/robotpkg/var/tmp/robotpkg/wip/eigen-quadprog/work/eigen-quadprog-1.0.0' /usr/pkg/bin/gmake -f src/CMakeFiles/eigen-quadprog.dir/build.make src/CMakeFiles/eigen-quadprog.dir/depend gmake[2]: Entering directory '/local/robotpkg/var/tmp/robotpkg/wip/eigen-quadprog/work/eigen-quadprog-1.0.0' cd /local/robotpkg/var/tmp/robotpkg/wip/eigen-quadprog/work/eigen-quadprog-1.0.0 && /usr/pkg/bin/cmake -E cmake_depends "Unix Makefiles" /local/robotpkg/var/tmp/robotpkg/wip/eigen-quadprog/work/eigen-quadprog-1.0.0 /local/robotpkg/var/tmp/robotpkg/wip/eigen-quadprog/work/eigen-quadprog-1.0.0/src /local/robotpkg/var/tmp/robotpkg/wip/eigen-quadprog/work/eigen-quadprog-1.0.0 /local/robotpkg/var/tmp/robotpkg/wip/eigen-quadprog/work/eigen-quadprog-1.0.0/src /local/robotpkg/var/tmp/robotpkg/wip/eigen-quadprog/work/eigen-quadprog-1.0.0/src/CMakeFiles/eigen-quadprog.dir/DependInfo.cmake --color= Scanning dependencies of target eigen-quadprog gmake[2]: Leaving directory '/local/robotpkg/var/tmp/robotpkg/wip/eigen-quadprog/work/eigen-quadprog-1.0.0' /usr/pkg/bin/gmake -f src/CMakeFiles/eigen-quadprog.dir/build.make src/CMakeFiles/eigen-quadprog.dir/build gmake[2]: Entering directory '/local/robotpkg/var/tmp/robotpkg/wip/eigen-quadprog/work/eigen-quadprog-1.0.0' [ 12%] Building Fortran object src/CMakeFiles/eigen-quadprog.dir/QuadProg/f/solve.QP.f.o cd /local/robotpkg/var/tmp/robotpkg/wip/eigen-quadprog/work/eigen-quadprog-1.0.0/src && /usr/pkg/bin/g95 -DEIGEN_QUADPROG_EXPORT -Deigen_quadprog_EXPORTS -I/local/robotpkg/var/tmp/robotpkg/wip/eigen-quadprog/work/eigen-quadprog-1.0.0 -I/local/robotpkg/var/tmp/robotpkg/wip/eigen-quadprog/work/eigen-quadprog-1.0.0/include -I/usr/pkg/include/eigen3 -O3 -fPIC -c /local/robotpkg/var/tmp/robotpkg/wip/eigen-quadprog/work/eigen-quadprog-1.0.0/src/QuadProg/f/solve.QP.f -o CMakeFiles/eigen-quadprog.dir/QuadProg/f/solve.QP.f.o [ 25%] Building Fortran object src/CMakeFiles/eigen-quadprog.dir/QuadProg/f/util.f.o cd /local/robotpkg/var/tmp/robotpkg/wip/eigen-quadprog/work/eigen-quadprog-1.0.0/src && /usr/pkg/bin/g95 -DEIGEN_QUADPROG_EXPORT -Deigen_quadprog_EXPORTS -I/local/robotpkg/var/tmp/robotpkg/wip/eigen-quadprog/work/eigen-quadprog-1.0.0 -I/local/robotpkg/var/tmp/robotpkg/wip/eigen-quadprog/work/eigen-quadprog-1.0.0/include -I/usr/pkg/include/eigen3 -O3 -fPIC -c /local/robotpkg/var/tmp/robotpkg/wip/eigen-quadprog/work/eigen-quadprog-1.0.0/src/QuadProg/f/util.f -o CMakeFiles/eigen-quadprog.dir/QuadProg/f/util.f.o [ 50%] Building Fortran object src/CMakeFiles/eigen-quadprog.dir/QuadProg/f/solve.QP.compact.f.o [ 50%] Building CXX object src/CMakeFiles/eigen-quadprog.dir/QuadProg.cpp.o cd /local/robotpkg/var/tmp/robotpkg/wip/eigen-quadprog/work/eigen-quadprog-1.0.0/src && /usr/pkg/bin/g95 -DEIGEN_QUADPROG_EXPORT -Deigen_quadprog_EXPORTS -I/local/robotpkg/var/tmp/robotpkg/wip/eigen-quadprog/work/eigen-quadprog-1.0.0 -I/local/robotpkg/var/tmp/robotpkg/wip/eigen-quadprog/work/eigen-quadprog-1.0.0/include -I/usr/pkg/include/eigen3 -O3 -fPIC -c /local/robotpkg/var/tmp/robotpkg/wip/eigen-quadprog/work/eigen-quadprog-1.0.0/src/QuadProg/f/solve.QP.compact.f -o CMakeFiles/eigen-quadprog.dir/QuadProg/f/solve.QP.compact.f.o cd /local/robotpkg/var/tmp/robotpkg/wip/eigen-quadprog/work/eigen-quadprog-1.0.0/src && /usr/bin/g++ -DEIGEN_QUADPROG_EXPORT -Deigen_quadprog_EXPORTS -I/local/robotpkg/var/tmp/robotpkg/wip/eigen-quadprog/work/eigen-quadprog-1.0.0 -I/local/robotpkg/var/tmp/robotpkg/wip/eigen-quadprog/work/eigen-quadprog-1.0.0/include -isystem /usr/pkg/include/eigen3 -pipe -O3 -DNDEBUG -pedantic -Wno-long-long -Wall -Wextra -Wcast-align -Wcast-qual -Wformat -Wwrite-strings -Wconversion -std=c++0x -Wall -Wextra -pedantic -fPIC -o CMakeFiles/eigen-quadprog.dir/QuadProg.cpp.o -c /local/robotpkg/var/tmp/robotpkg/wip/eigen-quadprog/work/eigen-quadprog-1.0.0/src/QuadProg.cpp /local/robotpkg/var/tmp/robotpkg/wip/eigen-quadprog/work/eigen-quadprog-1.0.0/src/QuadProg/f/solve.QP.f: In function 'qpgen2_': /local/robotpkg/var/tmp/robotpkg/wip/eigen-quadprog/work/eigen-quadprog-1.0.0/src/QuadProg/f/solve.QP.f:503: warning: will never be executed /local/robotpkg/var/tmp/robotpkg/wip/eigen-quadprog/work/eigen-quadprog-1.0.0/src/QuadProg/f/solve.QP.f:411: warning: will never be executed /local/robotpkg/var/tmp/robotpkg/wip/eigen-quadprog/work/eigen-quadprog-1.0.0/src/QuadProg/f/solve.QP.compact.f: In function 'qpgen1_': /local/robotpkg/var/tmp/robotpkg/wip/eigen-quadprog/work/eigen-quadprog-1.0.0/src/QuadProg/f/solve.QP.compact.f:512: warning: will never be executed /local/robotpkg/var/tmp/robotpkg/wip/eigen-quadprog/work/eigen-quadprog-1.0.0/src/QuadProg/f/solve.QP.compact.f:420: warning: will never be executed /local/robotpkg/var/tmp/robotpkg/wip/eigen-quadprog/work/eigen-quadprog-1.0.0/src/QuadProg/f/solve.QP.f:237: warning: will never be executed /local/robotpkg/var/tmp/robotpkg/wip/eigen-quadprog/work/eigen-quadprog-1.0.0/src/QuadProg/f/solve.QP.f:208: warning: will never be executed /local/robotpkg/var/tmp/robotpkg/wip/eigen-quadprog/work/eigen-quadprog-1.0.0/src/QuadProg/f/solve.QP.f:124: warning: will never be executed /local/robotpkg/var/tmp/robotpkg/wip/eigen-quadprog/work/eigen-quadprog-1.0.0/src/QuadProg/f/solve.QP.compact.f:246: warning: will never be executed /local/robotpkg/var/tmp/robotpkg/wip/eigen-quadprog/work/eigen-quadprog-1.0.0/src/QuadProg/f/solve.QP.compact.f:217: warning: will never be executed /local/robotpkg/var/tmp/robotpkg/wip/eigen-quadprog/work/eigen-quadprog-1.0.0/src/QuadProg/f/solve.QP.compact.f:133: warning: will never be executed [ 62%] Building Fortran object src/CMakeFiles/eigen-quadprog.dir/BLAS/f/blas.f.o cd /local/robotpkg/var/tmp/robotpkg/wip/eigen-quadprog/work/eigen-quadprog-1.0.0/src && /usr/pkg/bin/g95 -DEIGEN_QUADPROG_EXPORT -Deigen_quadprog_EXPORTS -I/local/robotpkg/var/tmp/robotpkg/wip/eigen-quadprog/work/eigen-quadprog-1.0.0 -I/local/robotpkg/var/tmp/robotpkg/wip/eigen-quadprog/work/eigen-quadprog-1.0.0/include -I/usr/pkg/include/eigen3 -O3 -fPIC -c /local/robotpkg/var/tmp/robotpkg/wip/eigen-quadprog/work/eigen-quadprog-1.0.0/src/BLAS/f/blas.f -o CMakeFiles/eigen-quadprog.dir/BLAS/f/blas.f.o /local/robotpkg/var/tmp/robotpkg/wip/eigen-quadprog/work/eigen-quadprog-1.0.0/src/BLAS/f/blas.f: In function 'dscal_': /local/robotpkg/var/tmp/robotpkg/wip/eigen-quadprog/work/eigen-quadprog-1.0.0/src/BLAS/f/blas.f:260: warning: will never be executed /local/robotpkg/var/tmp/robotpkg/wip/eigen-quadprog/work/eigen-quadprog-1.0.0/src/BLAS/f/blas.f: In function 'ddot_': /local/robotpkg/var/tmp/robotpkg/wip/eigen-quadprog/work/eigen-quadprog-1.0.0/src/BLAS/f/blas.f:120: warning: will never be executed /local/robotpkg/var/tmp/robotpkg/wip/eigen-quadprog/work/eigen-quadprog-1.0.0/src/BLAS/f/blas.f: In function 'daxpy_': /local/robotpkg/var/tmp/robotpkg/wip/eigen-quadprog/work/eigen-quadprog-1.0.0/src/BLAS/f/blas.f:47: warning: will never be executed /local/robotpkg/var/tmp/robotpkg/wip/eigen-quadprog/work/eigen-quadprog-1.0.0/src/BLAS/f/blas.f: In function 'ddot_': /local/robotpkg/var/tmp/robotpkg/wip/eigen-quadprog/work/eigen-quadprog-1.0.0/src/BLAS/f/blas.f:133: warning: will never be executed /local/robotpkg/var/tmp/robotpkg/wip/eigen-quadprog/work/eigen-quadprog-1.0.0/src/BLAS/f/blas.f: In function 'dscal_': /local/robotpkg/var/tmp/robotpkg/wip/eigen-quadprog/work/eigen-quadprog-1.0.0/src/BLAS/f/blas.f:272: warning: will never be executed /local/robotpkg/var/tmp/robotpkg/wip/eigen-quadprog/work/eigen-quadprog-1.0.0/src/QuadProg.cpp: In member function 'bool Eigen::QuadProgSparse::solve(const MatrixXd&, const VectorXd&, const Eigen::SparseMatrix&, const VectorXd&, const Eigen::SparseMatrix&, const VectorXd&, bool)': /local/robotpkg/var/tmp/robotpkg/wip/eigen-quadprog/work/eigen-quadprog-1.0.0/src/QuadProg.cpp:206:27: warning: conversion to 'Eigen::DenseCoeffsBase, 1>::Scalar {aka int}' from 'Eigen::Index {aka long int}' may alter its value [-Wconversion] iA_(nrValCi, it.row()) = it.col() + 1; ^ /local/robotpkg/var/tmp/robotpkg/wip/eigen-quadprog/work/eigen-quadprog-1.0.0/src/QuadProg.cpp:216:34: warning: conversion to 'Eigen::DenseCoeffsBase, 1>::Scalar {aka int}' from 'Eigen::Index {aka long int}' may alter its value [-Wconversion] iA_(nrValCi, it.row() + nreq) = it.col() + 1; ^ [ 75%] Linking CXX shared library libeigen-quadprog.so cd /local/robotpkg/var/tmp/robotpkg/wip/eigen-quadprog/work/eigen-quadprog-1.0.0/src && /usr/pkg/bin/cmake -E cmake_link_script CMakeFiles/eigen-quadprog.dir/link.txt --verbose=1 /usr/bin/g++ -fPIC -pipe -O3 -DNDEBUG -pedantic -Wno-long-long -Wall -Wextra -Wcast-align -Wcast-qual -Wformat -Wwrite-strings -Wconversion -std=c++0x -Wall -Wextra -pedantic -shared -Wl,-soname,libeigen-quadprog.so -o libeigen-quadprog.so CMakeFiles/eigen-quadprog.dir/QuadProg.cpp.o CMakeFiles/eigen-quadprog.dir/QuadProg/f/solve.QP.f.o CMakeFiles/eigen-quadprog.dir/QuadProg/f/solve.QP.compact.f.o CMakeFiles/eigen-quadprog.dir/QuadProg/f/util.f.o CMakeFiles/eigen-quadprog.dir/BLAS/f/blas.f.o -L/usr/pkg/lib/gcc-lib/x86_64--netbsd/4.1.2 -Wl,-rpath,::::::::::::::::::: -lf95 gmake[2]: Leaving directory '/local/robotpkg/var/tmp/robotpkg/wip/eigen-quadprog/work/eigen-quadprog-1.0.0' [ 75%] Built target eigen-quadprog /usr/pkg/bin/gmake -f tests/CMakeFiles/QPTest.dir/build.make tests/CMakeFiles/QPTest.dir/depend gmake[2]: Entering directory '/local/robotpkg/var/tmp/robotpkg/wip/eigen-quadprog/work/eigen-quadprog-1.0.0' cd /local/robotpkg/var/tmp/robotpkg/wip/eigen-quadprog/work/eigen-quadprog-1.0.0 && /usr/pkg/bin/cmake -E cmake_depends "Unix Makefiles" /local/robotpkg/var/tmp/robotpkg/wip/eigen-quadprog/work/eigen-quadprog-1.0.0 /local/robotpkg/var/tmp/robotpkg/wip/eigen-quadprog/work/eigen-quadprog-1.0.0/tests /local/robotpkg/var/tmp/robotpkg/wip/eigen-quadprog/work/eigen-quadprog-1.0.0 /local/robotpkg/var/tmp/robotpkg/wip/eigen-quadprog/work/eigen-quadprog-1.0.0/tests /local/robotpkg/var/tmp/robotpkg/wip/eigen-quadprog/work/eigen-quadprog-1.0.0/tests/CMakeFiles/QPTest.dir/DependInfo.cmake --color= Scanning dependencies of target QPTest gmake[2]: Leaving directory '/local/robotpkg/var/tmp/robotpkg/wip/eigen-quadprog/work/eigen-quadprog-1.0.0' /usr/pkg/bin/gmake -f tests/CMakeFiles/QPTest.dir/build.make tests/CMakeFiles/QPTest.dir/build gmake[2]: Entering directory '/local/robotpkg/var/tmp/robotpkg/wip/eigen-quadprog/work/eigen-quadprog-1.0.0' [ 87%] Building CXX object tests/CMakeFiles/QPTest.dir/QPTest.cpp.o cd /local/robotpkg/var/tmp/robotpkg/wip/eigen-quadprog/work/eigen-quadprog-1.0.0/tests && /usr/bin/g++ -DEIGEN_QUADPROG_EXPORT -I/local/robotpkg/var/tmp/robotpkg/wip/eigen-quadprog/work/eigen-quadprog-1.0.0 -I/local/robotpkg/var/tmp/robotpkg/wip/eigen-quadprog/work/eigen-quadprog-1.0.0/include -I/local/robotpkg/var/tmp/robotpkg/wip/eigen-quadprog/work/eigen-quadprog-1.0.0/src -I/usr/pkg/include -isystem /usr/pkg/include/eigen3 -pipe -O3 -DNDEBUG -pedantic -Wno-long-long -Wall -Wextra -Wcast-align -Wcast-qual -Wformat -Wwrite-strings -Wconversion -std=c++0x -Wall -Wextra -pedantic -o CMakeFiles/QPTest.dir/QPTest.cpp.o -c /local/robotpkg/var/tmp/robotpkg/wip/eigen-quadprog/work/eigen-quadprog-1.0.0/tests/QPTest.cpp In file included from /local/robotpkg/var/tmp/robotpkg/wip/eigen-quadprog/work/eigen-quadprog-1.0.0/tests/QPTest.cpp:25:0: /usr/pkg/include/boost/test/floating_point_comparison.hpp:14:152: note: #pragma message: This header is deprecated. Use This header is deprecated. Please use instead. instead. [100%] Linking CXX executable QPTest cd /local/robotpkg/var/tmp/robotpkg/wip/eigen-quadprog/work/eigen-quadprog-1.0.0/tests && /usr/pkg/bin/cmake -E cmake_link_script CMakeFiles/QPTest.dir/link.txt --verbose=1 /usr/bin/g++ -pipe -O3 -DNDEBUG -pedantic -Wno-long-long -Wall -Wextra -Wcast-align -Wcast-qual -Wformat -Wwrite-strings -Wconversion -std=c++0x -Wall -Wextra -pedantic CMakeFiles/QPTest.dir/QPTest.cpp.o -o QPTest -Wl,-rpath,/usr/pkg/lib:/local/robotpkg/var/tmp/robotpkg/wip/eigen-quadprog/work/eigen-quadprog-1.0.0/src /usr/pkg/lib/libboost_unit_test_framework.so ../src/libeigen-quadprog.so ld: warning: libf95.so.0, needed by ../src/libeigen-quadprog.so, not found (try using -rpath or -rpath-link) ../src/libeigen-quadprog.so: undefined reference to `_g95_sign_r8' gmake[2]: *** [tests/CMakeFiles/QPTest.dir/build.make:89: tests/QPTest] Error 1 gmake[2]: Leaving directory '/local/robotpkg/var/tmp/robotpkg/wip/eigen-quadprog/work/eigen-quadprog-1.0.0' gmake[1]: *** [CMakeFiles/Makefile2:397: tests/CMakeFiles/QPTest.dir/all] Error 2 gmake[1]: Leaving directory '/local/robotpkg/var/tmp/robotpkg/wip/eigen-quadprog/work/eigen-quadprog-1.0.0' gmake: *** [Makefile:144: all] Error 2