robotpkg/wip/dynamic-introspection bulk build results

Log for dynamic-introspection-1.0.12 on Fedora-31-x86_64: bulk.log (Back)

=> Checking for clear installation ===> Installing bootstrap dependencies for dynamic-introspection-1.0.12 Warning: the LICENSE of wip/dynamic-introspection is undefined. => Installing /opt/robotpkg/var/lib/robotpkg/packages/bsd/Fedora-31-x86_64/All/digest-20080510.tgz => Installing /opt/robotpkg/var/lib/robotpkg/packages/bsd/Fedora-31-x86_64/All/tnftp-20130505~ssl.tgz Warning: the LICENSE of wip/dynamic-introspection is undefined. ===> Checking bootstrap dependencies for dynamic-introspection-1.0.12 => Required robotpkg package digest>=20080510: digest-20080510 found => Required robotpkg package tnftp>=20130505~ssl: tnftp-20130505~ssl found => Required system package gzip: gzip-1.10 found => Required system package pax and tar archivers: pax found => Required system package pkg_install>=20110805.9: pkg_install-20110805.9 found ===> Done bootstrap-depends for dynamic-introspection-1.0.12 Warning: the LICENSE of wip/dynamic-introspection is undefined. ===> Installing full dependencies for dynamic-introspection-1.0.12 Warning: the LICENSE of wip/dynamic-introspection is undefined. => Installing /opt/robotpkg/var/lib/robotpkg/wip/packages/bsd/Fedora-31-x86_64/All/backward-ros-0.1.7.tgz To use ros, the following environment variables must contain those values: ROS_MASTER_URI http://localhost:11311 ROS_PACKAGE_PATH /opt/openrobots/share PYTHONPATH /opt/openrobots/lib/python3.7/site-packages PATH /opt/openrobots/bin As an alternative to the above configuration, commands can be executed by using the `env.sh' wrapper. For instance, roscore can be started like so: /opt/openrobots/etc/ros/env.sh roscore In Bourne shell scripts, the following file can be sourced instead: /opt/openrobots/etc/ros/setup.sh => Dependency digest-20080510 already installed => Dependency py37-catkin-pkg-0.4.8 already installed => Installing /opt/robotpkg/var/lib/robotpkg/wip/packages/bsd/Fedora-31-x86_64/All/py37-pal-statistics-1.3.1r4.tgz => Dependency py37-ros-catkin-0.7.16r1 already installed => Installing /opt/robotpkg/var/lib/robotpkg/packages/bsd/Fedora-31-x86_64/All/ros-cmake-modules-0.4.1.tgz => Dependency ros-genmsg-0.5.11 already installed => Dependency ros-genpy-0.6.7 already installed => Installing /opt/robotpkg/var/lib/robotpkg/packages/bsd/Fedora-31-x86_64/All/ros-geometry-1.12.0.tgz => Dependency ros-message-generation-0.4.0 already installed => Dependency ros-message-runtime-0.4.12 already installed => Dependency tnftp-20130505~ssl already installed Warning: the LICENSE of wip/dynamic-introspection is undefined. ===> Checking build options for dynamic-introspection-1.0.12 => Building with no option. ===> Checking alternatives for dynamic-introspection-1.0.12 => Use the GNU C++ compiler: c++-compiler provided by g++>=4.8 => Use the GNU C compiler: c-compiler provided by gcc>=3 => Use python-3.7: python>=2.5<3.9 provided by python37>=3.7<3.8 => Use ros melodic: ros>=groovy provided by ros-melodic ===> Checking dependencies for dynamic-introspection-1.0.12 => Required system package cmake>=2.8.3: cmake-3.17.4 found => Required system package eigen3>=3.0.0: eigen3-3.3.7 found => Required system package g++>=4.8: g++-9 found => Required system package gcc>=3: gcc-9 found => Required system package googletest: googletest found => Required system package libstdc++: libstdc++ found => Required system package pkg-config>=0.22: pkg-config-1.6.3 found => Required system package py37-empy>=3: py37-empy-3.3.4 found => Required system package py37-nose>=0.10: py37-nose-1.3.7 found => Required system package py37-pyparsing>=1: py37-pyparsing-2.4.0 found => Required system package python37>=3.7<3.8: python37-3.7.8 found => Required robotpkg package backward-ros>=0.1.4: backward-ros-0.1.7 found => Required robotpkg package py37-catkin-pkg>=0.2: py37-catkin-pkg-0.4.8 found => Required robotpkg package py37-pal-statistics>=1.1.0: py37-pal-statistics-1.3.1r4 found => Required robotpkg package py37-ros-catkin>=0.7<0.8: py37-ros-catkin-0.7.16r1 found => Required robotpkg package ros-cmake-modules>=0.3: ros-cmake-modules-0.4.1 found => Required robotpkg package ros-genmsg>=0.5<0.6: ros-genmsg-0.5.11 found => Required robotpkg package ros-genpy>=0.6<0.7: ros-genpy-0.6.7 found => Required robotpkg package ros-geometry>=1.12<1.13: ros-geometry-1.12.0 found => Required robotpkg package ros-message-generation>=0.4<0.5: ros-message-generation-0.4.0 found => Required robotpkg package ros-message-runtime>=0.4<0.5: ros-message-runtime-0.4.12 found ===> Done depends for dynamic-introspection-1.0.12 Warning: the LICENSE of wip/dynamic-introspection is undefined. Warning: the LICENSE of wip/dynamic-introspection is undefined. Warning: the LICENSE of wip/dynamic-introspection is undefined. ===> Extracting for dynamic-introspection-1.0.12 => SHA1 checksums OK => RMD160 checksums OK ===> Configuring for dynamic-introspection-1.0.12 CMake Warning (dev) at /usr/share/cmake/Modules/FindPackageHandleStandardArgs.cmake:272 (message): The package name passed to `find_package_handle_standard_args` (PY_em) does not match the name of the calling package (catkin). This can lead to problems in calling code that expects `find_package` result variables (e.g., `_FOUND`) to follow a certain pattern. Call Stack (most recent call first): /opt/openrobots/share/catkin/cmake/empy.cmake:20 (find_package_handle_standard_args) /opt/openrobots/share/catkin/cmake/empy.cmake:27 (find_python_module) /opt/openrobots/share/catkin/cmake/all.cmake:163 (include) /opt/openrobots/share/catkin/cmake/catkinConfig.cmake:20 (include) CMakeLists.txt:16 (find_package) This warning is for project developers. Use -Wno-dev to suppress it. CMake Warning (dev) at /usr/share/cmake/Modules/FindPackageHandleStandardArgs.cmake:272 (message): The package name passed to `find_package_handle_standard_args` (libdw) does not match the name of the calling package (backward_ros). This can lead to problems in calling code that expects `find_package` result variables (e.g., `_FOUND`) to follow a certain pattern. Call Stack (most recent call first): /opt/openrobots/share/backward_ros/cmake/BackwardConfig.cmake:55 (find_package_handle_standard_args) /opt/openrobots/share/backward_ros/cmake/backward_rosConfig.cmake:199 (include) /opt/openrobots/share/catkin/cmake/catkinConfig.cmake:76 (find_package) CMakeLists.txt:16 (find_package) This warning is for project developers. Use -Wno-dev to suppress it. CMake Warning (dev) at /usr/share/cmake/Modules/FindPackageHandleStandardArgs.cmake:272 (message): The package name passed to `find_package_handle_standard_args` (libbfd) does not match the name of the calling package (backward_ros). This can lead to problems in calling code that expects `find_package` result variables (e.g., `_FOUND`) to follow a certain pattern. Call Stack (most recent call first): /opt/openrobots/share/backward_ros/cmake/BackwardConfig.cmake:66 (find_package_handle_standard_args) /opt/openrobots/share/backward_ros/cmake/backward_rosConfig.cmake:199 (include) /opt/openrobots/share/catkin/cmake/catkinConfig.cmake:76 (find_package) CMakeLists.txt:16 (find_package) This warning is for project developers. Use -Wno-dev to suppress it. CMake Warning (dev) at /usr/share/cmake/Modules/FindPackageHandleStandardArgs.cmake:272 (message): The package name passed to `find_package_handle_standard_args` (Backward) does not match the name of the calling package (backward_ros). This can lead to problems in calling code that expects `find_package` result variables (e.g., `_FOUND`) to follow a certain pattern. Call Stack (most recent call first): /opt/openrobots/share/backward_ros/cmake/BackwardConfig.cmake:128 (find_package_handle_standard_args) /opt/openrobots/share/backward_ros/cmake/backward_rosConfig.cmake:199 (include) /opt/openrobots/share/catkin/cmake/catkinConfig.cmake:76 (find_package) CMakeLists.txt:16 (find_package) This warning is for project developers. Use -Wno-dev to suppress it. CMake Warning at /opt/openrobots/share/catkin/cmake/catkin_package.cmake:166 (message): catkin_package() DEPENDS on 'EIGEN3' but neither 'EIGEN3_INCLUDE_DIRS' nor 'EIGEN3_LIBRARIES' is defined. Call Stack (most recent call first): /opt/openrobots/share/catkin/cmake/catkin_package.cmake:102 (_catkin_package) CMakeLists.txt:29 (catkin_package) ===> Building for dynamic-introspection-1.0.12 In file included from /local/robotpkg/var/tmp/robotpkg/wip/dynamic-introspection/work/dynamic_introspection-1.0.12/include/dynamic_introspection/introspection_online_utils.h:13, from /local/robotpkg/var/tmp/robotpkg/wip/dynamic-introspection/work/dynamic_introspection-1.0.12/src/introspection_online_utils.cpp:1: /local/robotpkg/var/tmp/robotpkg/wip/dynamic-introspection/work/dynamic_introspection-1.0.12/include/dynamic_introspection/dynamic_introspection_utils.h:15:10: fatal error: Eigen/Dense: No such file or directory 15 | #include | ^~~~~~~~~~~~~ compilation terminated. In file included from /local/robotpkg/var/tmp/robotpkg/wip/dynamic-introspection/work/dynamic_introspection-1.0.12/src/dynamic_introspection_utils.cpp:1: /local/robotpkg/var/tmp/robotpkg/wip/dynamic-introspection/work/dynamic_introspection-1.0.12/include/dynamic_introspection/dynamic_introspection_utils.h:15:10: fatal error: Eigen/Dense: No such file or directory 15 | #include | ^~~~~~~~~~~~~ compilation terminated. make[2]: *** [CMakeFiles/dynamic_introspection.dir/build.make:99: CMakeFiles/dynamic_introspection.dir/src/introspection_online_utils.cpp.o] Error 1 make[2]: *** Waiting for unfinished jobs.... make[2]: *** [CMakeFiles/dynamic_introspection.dir/build.make:86: CMakeFiles/dynamic_introspection.dir/src/dynamic_introspection_utils.cpp.o] Error 1 make[1]: *** [CMakeFiles/Makefile2:437: CMakeFiles/dynamic_introspection.dir/all] Error 2 make: *** [Makefile:153: all] Error 2 An unexpected error occured. The last 10 log lines are shown below. | 15 | #include | | ^~~~~~~~~~~~~ | compilation terminated. | make[2]: *** [CMakeFiles/dynamic_introspection.dir/build.make:99: CMakeFiles/dynamic_introspection.dir/src/introspection_online_utils.cpp.o] Error 1 | make[2]: Leaving directory '/local/robotpkg/var/tmp/robotpkg/wip/dynamic-introspection/work/dynamic_introspection-1.0.12' | make[2]: *** Waiting for unfinished jobs.... | make[2]: *** [CMakeFiles/dynamic_introspection.dir/build.make:86: CMakeFiles/dynamic_introspection.dir/src/dynamic_introspection_utils.cpp.o] Error 1 | make[1]: *** [CMakeFiles/Makefile2:437: CMakeFiles/dynamic_introspection.dir/all] Error 2 | make[1]: Leaving directory '/local/robotpkg/var/tmp/robotpkg/wip/dynamic-introspection/work/dynamic_introspection-1.0.12' | make: *** [Makefile:153: all] Error 2 For details or bug reports, check the complete log file in: /local/robotpkg/var/tmp/robotpkg/wip/dynamic-introspection/work/build.log make[3]: *** [/local/robotpkg/var/lib/robotpkg/mk/build/build.mk:199: do-build] Error 2 make[2]: *** [/local/robotpkg/var/lib/robotpkg/mk/pkg/package.mk:42: pkg-check-installed] Error 2 => Marking dynamic-introspection-1.0.12 as broken ERROR: make: *** [package] Error 2 Warning: the LICENSE of wip/dynamic-introspection is undefined. ===> Deinstalling for dynamic-introspection Removing dependency py37-catkin-pkg-0.4.8 Removing dependency py37-ros-catkin-0.7.16r1 Removing dependency ros-comm-1.14.4 Removing dependency Removed backward-ros-0.1.7 Removed digest-20080510 Removing dependency py37-rosdistro-0.3.5 Removing dependency py37-rosdep-0.10.30 Removing dependency py37-ros-catkin-0.7.16r1 Removing dependency ros-orocos-kinematics-dynamics-1.4.0 Removing dependency ros-angles-1.9.11 Removing dependency ros-cmake-modules-0.4.1 Removing dependency ros-rospack-2.5.1 Removing dependency ros-roscpp-core-0.6.11 Removing dependency ros-genmsg-0.5.11 Removing dependency ros-ros-1.14.4r1 Removing dependency ros-console-1.13.7 Removing dependency ros-gennodejs-2.0.1 Removing dependency ros-genlisp-0.4.16 Removing dependency ros-geneus-2.2.6 Removing dependency ros-gencpp-0.6.0 Removing dependency ros-genpy-0.6.7 Removing dependency ros-message-runtime-0.4.12 Removing dependency ros-message-generation-0.4.0 Removing dependency ros-std-msgs-0.5.11 Removing dependency ros-common-msgs-1.12.6 Removing dependency ros-comm-msgs-1.11.2r1 Removing dependency ros-class-loader-0.4.1 Removing dependency ros-pluginlib-1.12.1 Removing dependency ros-comm-1.14.4 Removing dependency ros-actionlib-1.12.0 Removing dependency ros-geometry2-0.6.5r1 Removing dependency ros-geometry-1.12.0 Removing dependency py37-pal-statistics-1.3.1r4 Removed py37-catkin-pkg-0.4.8 Removed tnftp-20130505~ssl