robotpkg/wip/dptu-genom3 bulk build results

Log for dptu-genom3-0.2~codels+openprs+ros-client-c+ros-client-ros+ros-server on NetBSD-8.0-x86_64: bulk.log (Back)

=> Checking for clear installation ===> Installing bootstrap dependencies for dptu-genom3-0.2~codels+openprs+ros-client-c+ros-client-ros+ros-server => Installing /opt/robotpkg/var/lib/robotpkg/packages/bsd/NetBSD-8.0-x86_64/All/digest-20080510.tgz => Installing /opt/robotpkg/var/lib/robotpkg/packages/bsd/NetBSD-8.0-x86_64/All/tnftp-20130505~ssl.tgz ===> Checking bootstrap dependencies for dptu-genom3-0.2~codels+openprs+ros-client-c+ros-client-ros+ros-server => Required robotpkg package digest>=20080510: digest-20080510 found => Required robotpkg package tnftp>=20130505~ssl: tnftp-20130505~ssl found => Required system package gzip: gzip-20150113 found => Required system package pax and tar archivers: pax found => Required system package pkg_install>=20110805.9: pkg_install-20110805.9 found ===> Done bootstrap-depends for dptu-genom3-0.2~codels+openprs+ros-client-c+ros-client-ros+ros-server ===> Installing full dependencies for dptu-genom3-0.2~codels+openprs+ros-client-c+ros-client-ros+ros-server => Dependency digest-20080510 already installed => Installing /opt/robotpkg/var/lib/robotpkg/packages/bsd/NetBSD-8.0-x86_64/All/genom3-2.99.38.tgz => Installing /opt/robotpkg/var/lib/robotpkg/packages/bsd/NetBSD-8.0-x86_64/All/genom3-openprs-1.0.9r5.tgz => Installing /opt/robotpkg/var/lib/robotpkg/packages/bsd/NetBSD-8.0-x86_64/All/genom3-ros-1.27.tgz To use ros, the following environment variables must contain those values: ROS_MASTER_URI http://localhost:11311 ROS_PACKAGE_PATH /opt/openrobots/share PYTHONPATH /opt/openrobots/lib/python2.7/site-packages PATH /opt/openrobots/bin As an alternative to the above configuration, commands can be executed by using the `env.sh' wrapper. For instance, roscore can be started like so: /opt/openrobots/etc/ros/env.sh roscore In Bourne shell scripts, the following file can be sourced instead: /opt/openrobots/etc/ros/setup.sh => Dependency openprs-1.1b10 already installed => Installing /opt/robotpkg/var/lib/robotpkg/packages/bsd/NetBSD-8.0-x86_64/All/openrobots-idl-1.6.tgz => Dependency ros-actionlib-1.12.0 already installed => Dependency ros-comm-1.14.4 already installed => Dependency ros-common-msgs-1.12.6 already installed => Dependency ros-genmsg-0.5.11 already installed => Dependency ros-genpy-0.6.7 already installed => Dependency ros-message-generation-0.4.0 already installed => Dependency ros-ros-1.14.4r1 already installed => Dependency ros-rospack-2.5.1 already installed => Dependency tnftp-20130505~ssl already installed => Dependency transgen3-1.0b5 already installed ===> Checking build options for dptu-genom3-0.2~codels+openprs+ros-client-c+ros-client-ros+ros-server => Building with the following options: codels Build server codels openprs Build an OpenPRS client ros-client-c Build a ROS C client ros-client-ros Build a ROS client ros-server Build a ROS server ===> Checking alternatives for dptu-genom3-0.2~codels+openprs+ros-client-c+ros-client-ros+ros-server => Use the GNU C++ compiler: c++-compiler provided by g++>=3 => Use the GNU C compiler: c-compiler provided by gcc>=4.9 => Use python-2.7: python>=2.5<3.9 provided by python27>=2.7<2.8 => Use ros melodic: ros>=groovy provided by ros-melodic ===> Checking dependencies for dptu-genom3-0.2~codels+openprs+ros-client-c+ros-client-ros+ros-server => Required system package autoconf>=2.59: autoconf-2.69 found => Required system package automake>=1.8: automake-1.16.1 found => Required system package boost-headers>=1.34.1: boost-headers-1.71 found => Required system package boostlib-thread>=1.34.1: boost-libs-1.71 found => Required system package g++>=3: g++-5.5.0 found => Required system package gcc>=4.9: gcc-5.5.0 found => Required system package GNU m4>=1.4: gm4-1.4.18 found => Required system package libstdc++: libstdc++ found => Required system package libtool>=1.5.22: libtool-2.4.6 found => Required system package pkg-config>=0.22: pkg-config-1.6.0 found => Required system package python27>=2.7<2.8: python27-2.7.16 found => Required robotpkg package genom3>=2.99.38: genom3-2.99.38 found => Required robotpkg package genom3-openprs>=1.0: genom3-openprs-1.0.9r5 found => Required robotpkg package genom3-ros>=1.24: genom3-ros-1.27 found => Required robotpkg package openprs>=1.1b7: openprs-1.1b10 found => Required robotpkg package openrobots-idl>=1.6: openrobots-idl-1.6 found => Required robotpkg package ros-actionlib>=1.11<1.13: ros-actionlib-1.12.0 found => Required robotpkg package ros-comm>=1.13<1.15: ros-comm-1.14.4 found => Required robotpkg package ros-common-msgs>=1.12<1.13: ros-common-msgs-1.12.6 found => Required robotpkg package ros-genmsg>=0.5<0.6: ros-genmsg-0.5.11 found => Required robotpkg package ros-genpy>=0.6<0.7: ros-genpy-0.6.7 found => Required robotpkg package ros-message-generation>=0.4<0.5: ros-message-generation-0.4.0 found => Required robotpkg package ros-ros>=1.14<1.15: ros-ros-1.14.4r1 found => Required robotpkg package ros-rospack>=2.5<2.6: ros-rospack-2.5.1 found => Required robotpkg package transgen3>=1.0b2: transgen3-1.0b5 found ===> Done depends for dptu-genom3-0.2~codels+openprs+ros-client-c+ros-client-ros+ros-server ===> Extracting for dptu-genom3-0.2~codels+openprs+ros-client-c+ros-client-ros+ros-server => SHA1 checksums OK => RMD160 checksums OK tar: tar vol 1, 36 files, 1587200 bytes read, 0 bytes written in 1 secs (1587200 bytes/sec) ===> Configuring for dptu-genom3-0.2~codels+openprs+ros-client-c+ros-client-ros+ros-server => Generating openprs/client => Running autoreconf for openprs/client autoreconf: Entering directory `.' autoreconf: configure.ac: not using Gettext autoreconf: running: /usr/pkg/bin/aclocal --force -I autoconf autoreconf: configure.ac: tracing autoreconf: running: /usr/pkg/bin/libtoolize --copy --force autoreconf: running: /usr/pkg/bin/autoconf --force autoreconf: running: /usr/pkg/bin/autoheader --force autoreconf: running: /usr/pkg/bin/automake --add-missing --copy --force-missing configure.ac:13: installing 'autoconf/compile' configure.ac:13: installing 'autoconf/config.guess' configure.ac:13: installing 'autoconf/config.sub' configure.ac:10: installing 'autoconf/install-sh' configure.ac:10: installing 'autoconf/missing' Makefile.am: installing 'autoconf/depcomp' autoreconf: Leaving directory `.' => Generating ros/client/c => Running autoreconf for ros/client/c autoreconf: Entering directory `.' autoreconf: configure.ac: not using Gettext autoreconf: running: /usr/pkg/bin/aclocal --force -I autoconf autoreconf: configure.ac: tracing autoreconf: running: /usr/pkg/bin/libtoolize --copy --force autoreconf: running: /usr/pkg/bin/autoconf --force autoreconf: running: /usr/pkg/bin/autoheader --force autoreconf: running: /usr/pkg/bin/automake --add-missing --copy --force-missing configure.ac:13: installing 'autoconf/compile' configure.ac:13: installing 'autoconf/config.guess' configure.ac:13: installing 'autoconf/config.sub' configure.ac:10: installing 'autoconf/install-sh' configure.ac:10: installing 'autoconf/missing' Makefile.am: installing 'autoconf/depcomp' autoreconf: Leaving directory `.' => Generating ros/client/ros => Running autoreconf for ros/client/ros autoreconf: Entering directory `.' autoreconf: configure.ac: not using Gettext autoreconf: running: /usr/pkg/bin/aclocal --force -I autoconf autoreconf: configure.ac: tracing autoreconf: configure.ac: not using Libtool autoreconf: running: /usr/pkg/bin/autoconf --force autoreconf: configure.ac: not using Autoheader autoreconf: running: /usr/pkg/bin/automake --add-missing --copy --force-missing configure.ac:9: installing './install-sh' configure.ac:9: installing './missing' autoreconf: Leaving directory `.' => Generating ros/server => Running autoreconf for ros/server autoreconf: Entering directory `.' autoreconf: configure.ac: not using Gettext autoreconf: running: /usr/pkg/bin/aclocal --force -I autoconf autoreconf: configure.ac: tracing autoreconf: running: /usr/pkg/bin/libtoolize --copy --force autoreconf: running: /usr/pkg/bin/autoconf --force autoreconf: running: /usr/pkg/bin/autoheader --force autoreconf: running: /usr/pkg/bin/automake --add-missing --copy --force-missing configure.ac:12: installing 'autoconf/compile' configure.ac:12: installing 'autoconf/config.guess' configure.ac:12: installing 'autoconf/config.sub' configure.ac:11: installing 'autoconf/install-sh' configure.ac:11: installing 'autoconf/missing' Makefile.am: installing 'autoconf/depcomp' autoreconf: Leaving directory `.' => Modifying GNU configure scripts to avoid --recheck ===> Building for dptu-genom3-0.2~codels+openprs+ros-client-c+ros-client-ros+ros-server dptu_driver.c:13:19: fatal error: error.h: No such file or directory compilation terminated. gmake[2]: *** [Makefile:478: libdptu_codels_la-dptu_driver.lo] Error 1 gmake[2]: *** Waiting for unfinished jobs.... gmake[1]: *** [Makefile:352: all] Error 2 gmake: *** [Makefile:508: all-recursive] Error 1 An unexpected error occured. The last 10 log lines are shown below. | gmake[2]: *** Waiting for unfinished jobs.... | libtool: compile: /usr/bin/gcc -DHAVE_CONFIG_H -I. -I../autoconf -I/opt/openrobots/share/idl/openrobots1-idl -I/opt/openrobots/include -pipe -O3 -DNDEBUG -MT libdptu_codels_la-dptu_pos_pub_codels.lo -MD -MP -MF .deps/libdptu_codels_la-dptu_pos_pub_codels.Tpo -c dptu_pos_pub_codels.c -o libdptu_codels_la-dptu_pos_pub_codels.o >/dev/null 2>&1 | libtool: compile: /usr/bin/gcc -DHAVE_CONFIG_H -I. -I../autoconf -I/opt/openrobots/share/idl/openrobots1-idl -I/opt/openrobots/include -pipe -O3 -DNDEBUG -MT libdptu_codels_la-dptu_cmd_codels.lo -MD -MP -MF .deps/libdptu_codels_la-dptu_cmd_codels.Tpo -c dptu_cmd_codels.c -o libdptu_codels_la-dptu_cmd_codels.o >/dev/null 2>&1 | mv -f .deps/libdptu_codels_la-dptu_codels.Tpo .deps/libdptu_codels_la-dptu_codels.Plo | mv -f .deps/libdptu_codels_la-dptu_pos_pub_codels.Tpo .deps/libdptu_codels_la-dptu_pos_pub_codels.Plo | mv -f .deps/libdptu_codels_la-dptu_cmd_codels.Tpo .deps/libdptu_codels_la-dptu_cmd_codels.Plo | gmake[2]: Leaving directory '/local/robotpkg/var/tmp/robotpkg/wip/dptu-genom3/work/dptu-genom3-0.2/codels' | gmake[1]: *** [Makefile:352: all] Error 2 | gmake[1]: Leaving directory '/local/robotpkg/var/tmp/robotpkg/wip/dptu-genom3/work/dptu-genom3-0.2/codels' | gmake: *** [Makefile:508: all-recursive] Error 1 For details or bug reports, check the complete log file in: /local/robotpkg/var/tmp/robotpkg/wip/dptu-genom3/work/build.log gmake[3]: *** [/local/robotpkg/var/lib/robotpkg/mk/build/build.mk:199: do-build] Error 2 gmake[2]: *** [/local/robotpkg/var/lib/robotpkg/mk/pkg/package.mk:42: pkg-check-installed] Error 2 ERROR: /usr/pkg/bin/gmake: *** [package] Error 2 => Marking dptu-genom3-0.2~codels+openprs+ros-client-c+ros-client-ros+ros-server as broken ===> Deinstalling for dptu-genom3 Removed digest-20080510 Removing dependency eltclsh-1.17 Removing dependency Removing dependency genom3-ros-1.27 Removing dependency transgen3-1.0b5 Removing dependency genom3-openprs-1.0.9r5 Removed genom3-2.99.38 Removed openrobots-idl-1.6 Removed tnftp-20130505~ssl