robotpkg/wip/dptu-genom3 bulk build results

Log for dptu-genom3-0.2~codels+openprs+pocolibs-client-c+pocolibs-server on NetBSD-8.0-x86_64: bulk.log (Back)

=> Checking for clear installation ===> Installing bootstrap dependencies for dptu-genom3-0.2~codels+openprs+pocolibs-client-c+pocolibs-server => Installing /opt/robotpkg/var/lib/robotpkg/packages/bsd/NetBSD-8.0-x86_64/All/digest-20080510.tgz => Installing /opt/robotpkg/var/lib/robotpkg/packages/bsd/NetBSD-8.0-x86_64/All/tnftp-20130505~ssl.tgz ===> Checking bootstrap dependencies for dptu-genom3-0.2~codels+openprs+pocolibs-client-c+pocolibs-server => Required robotpkg package digest>=20080510: digest-20080510 found => Required robotpkg package tnftp>=20130505~ssl: tnftp-20130505~ssl found => Required system package gzip: gzip-20150113 found => Required system package pax and tar archivers: pax found => Required system package pkg_install>=20110805.9: pkg_install-20110805.9 found ===> Done bootstrap-depends for dptu-genom3-0.2~codels+openprs+pocolibs-client-c+pocolibs-server ===> Installing full dependencies for dptu-genom3-0.2~codels+openprs+pocolibs-client-c+pocolibs-server => Dependency digest-20080510 already installed => Installing /opt/robotpkg/var/lib/robotpkg/packages/bsd/NetBSD-8.0-x86_64/All/genom3-2.99.35.tgz => Installing /opt/robotpkg/var/lib/robotpkg/packages/bsd/NetBSD-8.0-x86_64/All/genom3-openprs-1.0.9r5.tgz => Installing /opt/robotpkg/var/lib/robotpkg/packages/bsd/NetBSD-8.0-x86_64/All/genom3-pocolibs-1.16.tgz => Dependency openprs-1.1b10 already installed => Installing /opt/robotpkg/var/lib/robotpkg/packages/bsd/NetBSD-8.0-x86_64/All/openrobots-idl-1.6.tgz => Dependency pocolibs-3.0 already installed => Dependency tnftp-20130505~ssl already installed => Dependency transgen3-1.0b5 already installed ===> Checking build options for dptu-genom3-0.2~codels+openprs+pocolibs-client-c+pocolibs-server => Building with the following options: codels Build server codels openprs Build an OpenPRS client pocolibs-client-c Build a pocolibs C client pocolibs-server Build a pocolibs server ===> Checking alternatives for dptu-genom3-0.2~codels+openprs+pocolibs-client-c+pocolibs-server => Use the GNU C compiler: c-compiler provided by gcc>=3 ===> Checking dependencies for dptu-genom3-0.2~codels+openprs+pocolibs-client-c+pocolibs-server => Required system package autoconf>=2.59: autoconf-2.69 found => Required system package automake>=1.8: automake-1.16.1 found => Required system package gcc>=3: gcc-5.5.0 found => Required system package GNU m4>=1.4: gm4-1.4.18 found => Required system package libtool>=1.5.22: libtool-2.4.6 found => Required system package pkg-config>=0.22: pkg-config-1.6.0 found => Required robotpkg package genom3>=2.99.33: genom3-2.99.35 found => Required robotpkg package genom3-openprs>=1.0: genom3-openprs-1.0.9r5 found => Required robotpkg package genom3-pocolibs>=1.13: genom3-pocolibs-1.16 found => Required robotpkg package openprs>=1.1b7: openprs-1.1b10 found => Required robotpkg package openrobots-idl>=1.6: openrobots-idl-1.6 found => Required robotpkg package pocolibs>=3.0: pocolibs-3.0 found => Required robotpkg package transgen3>=1.0b2: transgen3-1.0b5 found ===> Done depends for dptu-genom3-0.2~codels+openprs+pocolibs-client-c+pocolibs-server ===> Extracting for dptu-genom3-0.2~codels+openprs+pocolibs-client-c+pocolibs-server => SHA1 checksums OK => RMD160 checksums OK tar: tar vol 1, 36 files, 1587200 bytes read, 0 bytes written in 1 secs (1587200 bytes/sec) ===> Configuring for dptu-genom3-0.2~codels+openprs+pocolibs-client-c+pocolibs-server => Generating openprs/client => Running autoreconf for openprs/client autoreconf: Entering directory `.' autoreconf: configure.ac: not using Gettext autoreconf: running: /usr/pkg/bin/aclocal --force -I autoconf autoreconf: configure.ac: tracing autoreconf: running: /usr/pkg/bin/libtoolize --copy --force autoreconf: running: /usr/pkg/bin/autoconf --force autoreconf: running: /usr/pkg/bin/autoheader --force autoreconf: running: /usr/pkg/bin/automake --add-missing --copy --force-missing configure.ac:12: installing 'autoconf/compile' configure.ac:12: installing 'autoconf/config.guess' configure.ac:12: installing 'autoconf/config.sub' configure.ac:9: installing 'autoconf/install-sh' configure.ac:9: installing 'autoconf/missing' Makefile.am: installing 'autoconf/depcomp' autoreconf: Leaving directory `.' => Generating pocolibs/client/c => Running autoreconf for pocolibs/client/c autoreconf: Entering directory `.' autoreconf: configure.ac: not using Gettext autoreconf: running: /usr/pkg/bin/aclocal --force -I autoconf autoreconf: configure.ac: tracing autoreconf: running: /usr/pkg/bin/libtoolize --copy --force autoreconf: running: /usr/pkg/bin/autoconf --force autoreconf: running: /usr/pkg/bin/autoheader --force autoreconf: running: /usr/pkg/bin/automake --add-missing --copy --force-missing configure.ac:12: installing 'autoconf/compile' configure.ac:12: installing 'autoconf/config.guess' configure.ac:12: installing 'autoconf/config.sub' configure.ac:9: installing 'autoconf/install-sh' configure.ac:9: installing 'autoconf/missing' Makefile.am: installing 'autoconf/depcomp' autoreconf: Leaving directory `.' => Generating pocolibs/server => Running autoreconf for pocolibs/server autoreconf: Entering directory `.' autoreconf: configure.ac: not using Gettext autoreconf: running: /usr/pkg/bin/aclocal --force -I autoconf autoreconf: configure.ac: tracing autoreconf: running: /usr/pkg/bin/libtoolize --copy --force autoreconf: running: /usr/pkg/bin/autoconf --force autoreconf: running: /usr/pkg/bin/autoheader --force autoreconf: running: /usr/pkg/bin/automake --add-missing --copy --force-missing configure.ac:12: installing 'autoconf/compile' configure.ac:12: installing 'autoconf/config.guess' configure.ac:12: installing 'autoconf/config.sub' configure.ac:9: installing 'autoconf/install-sh' configure.ac:9: installing 'autoconf/missing' Makefile.am: installing 'autoconf/depcomp' autoreconf: Leaving directory `.' => Modifying GNU configure scripts to avoid --recheck => Disabling fatal errors with C++ preprocessor in GNU configure scripts configure: error: in `/local/robotpkg/var/tmp/robotpkg/wip/dptu-genom3/work/dptu-genom3-0.2': ===> Building for dptu-genom3-0.2~codels+openprs+pocolibs-client-c+pocolibs-server dptu_driver.c:13:19: fatal error: error.h: No such file or directory compilation terminated. gmake[2]: *** [Makefile:478: libdptu_codels_la-dptu_driver.lo] Error 1 gmake[2]: *** Waiting for unfinished jobs.... gmake[1]: *** [Makefile:352: all] Error 2 gmake: *** [Makefile:508: all-recursive] Error 1 An unexpected error occured. The last 10 log lines are shown below. | libtool: compile: /usr/bin/gcc -DHAVE_CONFIG_H -I. -I../autoconf -I/opt/openrobots/share/idl/openrobots1-idl -I/opt/openrobots/include -pipe -O3 -DNDEBUG -MT libdptu_codels_la-dptu_codels.lo -MD -MP -MF .deps/libdptu_codels_la-dptu_codels.Tpo -c dptu_codels.c -o libdptu_codels_la-dptu_codels.o >/dev/null 2>&1 | libtool: compile: /usr/bin/gcc -DHAVE_CONFIG_H -I. -I../autoconf -I/opt/openrobots/share/idl/openrobots1-idl -I/opt/openrobots/include -pipe -O3 -DNDEBUG -MT libdptu_codels_la-dptu_pos_pub_codels.lo -MD -MP -MF .deps/libdptu_codels_la-dptu_pos_pub_codels.Tpo -c dptu_pos_pub_codels.c -o libdptu_codels_la-dptu_pos_pub_codels.o >/dev/null 2>&1 | libtool: compile: /usr/bin/gcc -DHAVE_CONFIG_H -I. -I../autoconf -I/opt/openrobots/share/idl/openrobots1-idl -I/opt/openrobots/include -pipe -O3 -DNDEBUG -MT libdptu_codels_la-dptu_cmd_codels.lo -MD -MP -MF .deps/libdptu_codels_la-dptu_cmd_codels.Tpo -c dptu_cmd_codels.c -o libdptu_codels_la-dptu_cmd_codels.o >/dev/null 2>&1 | mv -f .deps/libdptu_codels_la-dptu_codels.Tpo .deps/libdptu_codels_la-dptu_codels.Plo | mv -f .deps/libdptu_codels_la-dptu_pos_pub_codels.Tpo .deps/libdptu_codels_la-dptu_pos_pub_codels.Plo | mv -f .deps/libdptu_codels_la-dptu_cmd_codels.Tpo .deps/libdptu_codels_la-dptu_cmd_codels.Plo | gmake[2]: Leaving directory '/local/robotpkg/var/tmp/robotpkg/wip/dptu-genom3/work/dptu-genom3-0.2/codels' | gmake[1]: Leaving directory '/local/robotpkg/var/tmp/robotpkg/wip/dptu-genom3/work/dptu-genom3-0.2/codels' | gmake[1]: *** [Makefile:352: all] Error 2 | gmake: *** [Makefile:508: all-recursive] Error 1 => Marking dptu-genom3-0.2~codels+openprs+pocolibs-client-c+pocolibs-server as broken For details or bug reports, check the complete log file in: /local/robotpkg/var/tmp/robotpkg/wip/dptu-genom3/work/build.log gmake[3]: *** [/local/robotpkg/var/lib/robotpkg/mk/build/build.mk:199: do-build] Error 2 gmake[2]: *** [/local/robotpkg/var/lib/robotpkg/mk/pkg/package.mk:42: pkg-check-installed] Error 2 ERROR: /usr/pkg/bin/gmake: *** [package] Error 2 ===> Deinstalling for dptu-genom3 Removed digest-20080510 Removing dependency eltclsh-1.17 Removing dependency Removing dependency genom3-pocolibs-1.16 Removing dependency transgen3-1.0b5 Removing dependency genom3-openprs-1.0.9r5 Removed genom3-2.99.35 Removed openrobots-idl-1.6 Removed tnftp-20130505~ssl