robotpkg/wip/dptu-genom3 bulk build results

Log for dptu-genom3-0.2~codels+openprs+pocolibs-client-c+pocolibs-server on NetBSD-8.0-x86_64: build.log (Back)

--- Environment --- _overrides_supervision_transgen3_PKGREQD=transgen3>=1.0b2 transgen3>=1.0b2 transgen3>=1.0b2 _override_vars_pkgtools_pkg_config=PKGREQD PKGREQD PKGREQD LC_MONETARY=C _override_vars_architecture_genom3=PKGREQD PKGREQD PKGREQD _overrides_pkgtools_pkg_install_PKGREQD=pkg_install>=20110805.9 pkg_install>=20110805.9 pkg_install>=20110805.9 CXX=false PAX=/bin/pax MFLAGS=--no-print-directory OS_KERNEL_VERSION=8.0 MAKEFLAGS= --no-print-directory -- PKGREQD.cmdline=dptu-genom3-0.2~pocolibs-server+codels+openprs+pocolibs-client-c+!doc+!* RECURSIVE_PKGPATH=wip/dptu-genom3\ tag=NetBSD-8.0-x86_64 BULK_LOGDIR=/local/robotpkg/var/log/bulk BULKBASE=/opt/openrobots LOCALBASE=/opt/openrobots PKG_DBDIR=/opt/openrobots/var/db/robotpkg EXPECT_TARGETS=fetch\ install\ package MAKEOVERRIDES=PKGREQD.cmdline=dptu-genom3-0.2~pocolibs-server+codels+openprs+pocolibs-client-c+!doc+!* RECURSIVE_PKGPATH=wip/dptu-genom3\ tag=NetBSD-8.0-x86_64 BULK_LOGDIR=/local/robotpkg/var/log/bulk BULKBASE=/opt/openrobots LOCALBASE=/opt/openrobots PKG_DBDIR=/opt/openrobots/var/db/robotpkg EXPECT_TARGETS=fetch\ install\ package TAR=/usr/bin/tar _overrides_middleware_pocolibs_PKGREQD=pocolibs>=3.0 pocolibs>=3.0 pocolibs>=3.0 BULK_LOGDIR=/local/robotpkg/var/log/bulk PWD=/local/robotpkg/var/lib/robotpkg/wip/dptu-genom3 _overrides_wip_dptu_genom3_PKGREQD=dptu-genom3-0.2~pocolibs-server+codels+openprs+pocolibs-client-c+!doc+!* LANG=C _overrides_architecture_genom3_pocolibs_PKGREQD=genom3-pocolibs>=1.13 genom3-pocolibs>=1.13 genom3-pocolibs>=1.13 GZIP_CMD=/usr/bin/gzip _override_vars_supervision_genom3_openprs=PKGREQD PKGREQD PKGREQD HOME=/ _override_vars_interfaces_openrobots_idl=PKGREQD PKGREQD PKGREQD PATH=/sbin:/bin:/usr/sbin:/usr/bin CXXCPP=false LC_MESSAGES=C _overrides_archivers_pax_PKGREQD=pax pax _override_vars_pkgtools_pkg_install=PKGREQD PKGREQD PKGREQD MAKELEVEL=4 _override_vars_pkgtools_tnftp=PKGREQD PKGREQD AUTOM4TE=/usr/pkg/bin/autom4te LOWER_OS_VERSION=8.0 hline="$bf======================================================================$rm" ZCAT=/usr/bin/zcat MACHINE_PLATFORM=NetBSD-8.0-x86_64 AUTORECONF=/usr/pkg/bin/autoreconf LIBTOOL=/usr/pkg/bin/libtool _override_vars_pkgtools_digest=PKGREQD PKGREQD AUTOCONF=/usr/pkg/bin/autoconf _override_vars_wip_dptu_genom3=PKGREQD LC_NUMERIC=C AUTOMAKE=/usr/pkg/bin/automake OLDPWD=/local/robotpkg/var/lib/robotpkg/wip/py-hqp CC=/usr/bin/gcc M4=/usr/pkg/bin/gm4 FC=false _overrides_architecture_genom3_PKGREQD=genom3>=2.99.33 genom3>=2.99.33 genom3>=2.99.33 _overrides_pkgtools_tnftp_PKGREQD=tnftp>=20130505~ssl tnftp>=20130505~ssl PKG_CONFIG=/usr/pkg/bin/pkg-config tag=NetBSD-8.0-x86_64 OS_KERNEL=NetBSD ROBOTPKG_TRUSTED_ENV=robotpkg LC_CTYPE=C _ROBOTPKG_NOW=0701191552 LOWER_ARCH=x86_64 OWNER_GID=robots ROBOTPKG_BASE=/local/robotpkg NODENAME=fluffy64-netbsd8 bf= DIGEST=/opt/openrobots/sbin/robotpkg_digest ECHO_N=echo -n _override_vars_supervision_transgen3=PKGREQD PKGREQD PKGREQD OS_VERSION=8.0 EXPECT_TARGETS=fetch install package _override_vars_pkgtools_libtool=PKGREQD PKGREQD PKGREQD LC_COLLATE=C rm= _overrides_pkgtools_digest_PKGREQD=digest>=20080510 digest>=20080510 OWNER_UID=rbulk ACLOCAL=/usr/pkg/bin/aclocal _override_vars_supervision_openprs=PKGREQD PKGREQD PKGREQD LIBTOOLIZE=/usr/pkg/bin/libtoolize _overrides_supervision_openprs_PKGREQD=openprs>=1.1b7 openprs>=1.1b7 openprs>=1.1b7 RECURSIVE_PKGPATH=wip/dptu-genom3 _overrides_pkgtools_libtool_PKGREQD=libtool>=1.5.22 libtool>=1.5.22 libtool>=1.5.22 GENOM3=/opt/openrobots/bin/genom3 MACHINE_ARCH=x86_64 _overrides_interfaces_openrobots_idl_PKGREQD=openrobots-idl>=1.6 openrobots-idl>=1.6 openrobots-idl>=1.6 ROBOTPKG_DIR=/local/robotpkg/var/lib/robotpkg _override_vars_middleware_pocolibs=PKGREQD PKGREQD PKGREQD _overrides_supervision_genom3_openprs_PKGREQD=genom3-openprs>=1.0 genom3-openprs>=1.0 genom3-openprs>=1.0 _override_vars_archivers_pax=PKGREQD PKGREQD LOWER_OPSYS=netbsd LC_TIME=C TNFTP=/opt/openrobots/sbin/tnftp OPSYS=NetBSD LOCALBASE=/opt/openrobots LOWER_OS_KERNEL=netbsd PKGTOOLS_VERSION=20110805.9 BULKBASE=/opt/openrobots PKG_CONFIG_LIBDIR=/usr/lib/pkgconfig _override_vars_architecture_genom3_pocolibs=PKGREQD PKGREQD PKGREQD MACHINE_KERNEL=NetBSD-8.0-x86_64 _overrides_pkgtools_pkg_config_PKGREQD=pkg-config>=0.22 pkg-config>=0.22 pkg-config>=0.22 PKG_CONFIG_PATH=/local/robotpkg/var/tmp/robotpkg/wip/dptu-genom3/work/dptu-genom3-0.2:/local/robotpkg/var/tmp/robotpkg/wip/dptu-genom3/work/templates/pocolibs/client/c:/local/robotpkg/var/tmp/robotpkg/wip/dptu-genom3/work/templates/pocolibs/server:/local/robotpkg/var/tmp/robotpkg/wip/dptu-genom3/work/templates/openprs/client:/opt/openrobots/lib/pkgconfig GCC=/usr/bin/gcc PKG_DBDIR=/opt/openrobots/var/db/robotpkg MAKECONF=/opt/robotpkg/etc/robotpkg-wip.conf CPP=/usr/bin/gcc -E --- Running set -e; \ cd /local/robotpkg/var/tmp/robotpkg/wip/dptu-genom3/work/dptu-genom3-0.2 && cd . && /usr/bin/env MAKELEVEL= MAKEOVERRIDES= MAKEFLAGS= MFLAGS= 'CPPFLAGS=' 'CFLAGS=-pipe -O3 -DNDEBUG' 'LDFLAGS=' 'CXXFLAGS=-pipe' PREFIX='/opt/openrobots' HOME=/local/robotpkg/var/tmp/robotpkg/wip/dptu-genom3/work PATH='/opt/openrobots/bin:/opt/openrobots/sbin:/sbin:/bin:/usr/sbin:/usr/bin' LD_LIBRARY_PATH='' LOCALBASE=/opt/openrobots PKGMANDIR=man /usr/pkg/bin/gmake -j4 -f Makefile all; cd /local/robotpkg/var/tmp/robotpkg/wip/dptu-genom3/work/dptu-genom3-0.2 && cd /local/robotpkg/var/tmp/robotpkg/wip/dptu-genom3/work/templates/pocolibs/client/c && /usr/bin/env MAKELEVEL= MAKEOVERRIDES= MAKEFLAGS= MFLAGS= 'CPPFLAGS=' 'CFLAGS=-pipe -O3 -DNDEBUG' 'LDFLAGS=' 'CXXFLAGS=-pipe' PREFIX='/opt/openrobots' HOME=/local/robotpkg/var/tmp/robotpkg/wip/dptu-genom3/work PATH='/opt/openrobots/bin:/opt/openrobots/sbin:/sbin:/bin:/usr/sbin:/usr/bin' LD_LIBRARY_PATH='' LOCALBASE=/opt/openrobots PKGMANDIR=man /usr/pkg/bin/gmake -j4 -f Makefile all; cd /local/robotpkg/var/tmp/robotpkg/wip/dptu-genom3/work/dptu-genom3-0.2 && cd /local/robotpkg/var/tmp/robotpkg/wip/dptu-genom3/work/templates/pocolibs/server && /usr/bin/env MAKELEVEL= MAKEOVERRIDES= MAKEFLAGS= MFLAGS= 'CPPFLAGS=' 'CFLAGS=-pipe -O3 -DNDEBUG' 'LDFLAGS=' 'CXXFLAGS=-pipe' PREFIX='/opt/openrobots' HOME=/local/robotpkg/var/tmp/robotpkg/wip/dptu-genom3/work PATH='/opt/openrobots/bin:/opt/openrobots/sbin:/sbin:/bin:/usr/sbin:/usr/bin' LD_LIBRARY_PATH='' LOCALBASE=/opt/openrobots PKGMANDIR=man /usr/pkg/bin/gmake -j4 -f Makefile all; cd /local/robotpkg/var/tmp/robotpkg/wip/dptu-genom3/work/dptu-genom3-0.2 && cd /local/robotpkg/var/tmp/robotpkg/wip/dptu-genom3/work/templates/openprs/client && /usr/bin/env MAKELEVEL= MAKEOVERRIDES= MAKEFLAGS= MFLAGS= 'CPPFLAGS=' 'CFLAGS=-pipe -O3 -DNDEBUG' 'LDFLAGS=' 'CXXFLAGS=-pipe' PREFIX='/opt/openrobots' HOME=/local/robotpkg/var/tmp/robotpkg/wip/dptu-genom3/work PATH='/opt/openrobots/bin:/opt/openrobots/sbin:/sbin:/bin:/usr/sbin:/usr/bin' LD_LIBRARY_PATH='' LOCALBASE=/opt/openrobots PKGMANDIR=man /usr/pkg/bin/gmake -j4 -f Makefile all; Making all in codels gmake[1]: Entering directory '/local/robotpkg/var/tmp/robotpkg/wip/dptu-genom3/work/dptu-genom3-0.2/codels' /usr/pkg/bin/gmake all-am gmake[2]: Entering directory '/local/robotpkg/var/tmp/robotpkg/wip/dptu-genom3/work/dptu-genom3-0.2/codels' /bin/sh ../libtool --tag=CC --mode=compile /usr/bin/gcc -DHAVE_CONFIG_H -I. -I../autoconf -I/opt/openrobots/share/idl/openrobots1-idl -I/opt/openrobots/include -pipe -O3 -DNDEBUG -MT libdptu_codels_la-dptu_codels.lo -MD -MP -MF .deps/libdptu_codels_la-dptu_codels.Tpo -c -o libdptu_codels_la-dptu_codels.lo `test -f 'dptu_codels.c' || echo './'`dptu_codels.c /bin/sh ../libtool --tag=CC --mode=compile /usr/bin/gcc -DHAVE_CONFIG_H -I. -I../autoconf -I/opt/openrobots/share/idl/openrobots1-idl -I/opt/openrobots/include -pipe -O3 -DNDEBUG -MT libdptu_codels_la-dptu_pos_pub_codels.lo -MD -MP -MF .deps/libdptu_codels_la-dptu_pos_pub_codels.Tpo -c -o libdptu_codels_la-dptu_pos_pub_codels.lo `test -f 'dptu_pos_pub_codels.c' || echo './'`dptu_pos_pub_codels.c /bin/sh ../libtool --tag=CC --mode=compile /usr/bin/gcc -DHAVE_CONFIG_H -I. -I../autoconf -I/opt/openrobots/share/idl/openrobots1-idl -I/opt/openrobots/include -pipe -O3 -DNDEBUG -MT libdptu_codels_la-dptu_cmd_codels.lo -MD -MP -MF .deps/libdptu_codels_la-dptu_cmd_codels.Tpo -c -o libdptu_codels_la-dptu_cmd_codels.lo `test -f 'dptu_cmd_codels.c' || echo './'`dptu_cmd_codels.c /bin/sh ../libtool --tag=CC --mode=compile /usr/bin/gcc -DHAVE_CONFIG_H -I. -I../autoconf -I/opt/openrobots/share/idl/openrobots1-idl -I/opt/openrobots/include -pipe -O3 -DNDEBUG -MT libdptu_codels_la-dptu_driver.lo -MD -MP -MF .deps/libdptu_codels_la-dptu_driver.Tpo -c -o libdptu_codels_la-dptu_driver.lo `test -f 'dptu_driver.c' || echo './'`dptu_driver.c libtool: compile: /usr/bin/gcc -DHAVE_CONFIG_H -I. -I../autoconf -I/opt/openrobots/share/idl/openrobots1-idl -I/opt/openrobots/include -pipe -O3 -DNDEBUG -MT libdptu_codels_la-dptu_pos_pub_codels.lo -MD -MP -MF .deps/libdptu_codels_la-dptu_pos_pub_codels.Tpo -c dptu_pos_pub_codels.c -fPIC -DPIC -o .libs/libdptu_codels_la-dptu_pos_pub_codels.o libtool: compile: /usr/bin/gcc -DHAVE_CONFIG_H -I. -I../autoconf -I/opt/openrobots/share/idl/openrobots1-idl -I/opt/openrobots/include -pipe -O3 -DNDEBUG -MT libdptu_codels_la-dptu_codels.lo -MD -MP -MF .deps/libdptu_codels_la-dptu_codels.Tpo -c dptu_codels.c -fPIC -DPIC -o .libs/libdptu_codels_la-dptu_codels.o libtool: compile: /usr/bin/gcc -DHAVE_CONFIG_H -I. -I../autoconf -I/opt/openrobots/share/idl/openrobots1-idl -I/opt/openrobots/include -pipe -O3 -DNDEBUG -MT libdptu_codels_la-dptu_cmd_codels.lo -MD -MP -MF .deps/libdptu_codels_la-dptu_cmd_codels.Tpo -c dptu_cmd_codels.c -fPIC -DPIC -o .libs/libdptu_codels_la-dptu_cmd_codels.o libtool: compile: /usr/bin/gcc -DHAVE_CONFIG_H -I. -I../autoconf -I/opt/openrobots/share/idl/openrobots1-idl -I/opt/openrobots/include -pipe -O3 -DNDEBUG -MT libdptu_codels_la-dptu_driver.lo -MD -MP -MF .deps/libdptu_codels_la-dptu_driver.Tpo -c dptu_driver.c -fPIC -DPIC -o .libs/libdptu_codels_la-dptu_driver.o dptu_driver.c:13:19: fatal error: error.h: No such file or directory libtool: compile: /usr/bin/gcc -DHAVE_CONFIG_H -I. -I../autoconf -I/opt/openrobots/share/idl/openrobots1-idl -I/opt/openrobots/include -pipe -O3 -DNDEBUG -MT libdptu_codels_la-dptu_codels.lo -MD -MP -MF .deps/libdptu_codels_la-dptu_codels.Tpo -c dptu_codels.c -o libdptu_codels_la-dptu_codels.o >/dev/null 2>&1 compilation terminated. gmake[2]: *** [Makefile:478: libdptu_codels_la-dptu_driver.lo] Error 1 gmake[2]: *** Waiting for unfinished jobs.... libtool: compile: /usr/bin/gcc -DHAVE_CONFIG_H -I. -I../autoconf -I/opt/openrobots/share/idl/openrobots1-idl -I/opt/openrobots/include -pipe -O3 -DNDEBUG -MT libdptu_codels_la-dptu_pos_pub_codels.lo -MD -MP -MF .deps/libdptu_codels_la-dptu_pos_pub_codels.Tpo -c dptu_pos_pub_codels.c -o libdptu_codels_la-dptu_pos_pub_codels.o >/dev/null 2>&1 mv -f .deps/libdptu_codels_la-dptu_codels.Tpo .deps/libdptu_codels_la-dptu_codels.Plo libtool: compile: /usr/bin/gcc -DHAVE_CONFIG_H -I. -I../autoconf -I/opt/openrobots/share/idl/openrobots1-idl -I/opt/openrobots/include -pipe -O3 -DNDEBUG -MT libdptu_codels_la-dptu_cmd_codels.lo -MD -MP -MF .deps/libdptu_codels_la-dptu_cmd_codels.Tpo -c dptu_cmd_codels.c -o libdptu_codels_la-dptu_cmd_codels.o >/dev/null 2>&1 mv -f .deps/libdptu_codels_la-dptu_pos_pub_codels.Tpo .deps/libdptu_codels_la-dptu_pos_pub_codels.Plo mv -f .deps/libdptu_codels_la-dptu_cmd_codels.Tpo .deps/libdptu_codels_la-dptu_cmd_codels.Plo gmake[2]: Leaving directory '/local/robotpkg/var/tmp/robotpkg/wip/dptu-genom3/work/dptu-genom3-0.2/codels' gmake[1]: Leaving directory '/local/robotpkg/var/tmp/robotpkg/wip/dptu-genom3/work/dptu-genom3-0.2/codels' gmake[1]: *** [Makefile:352: all] Error 2 gmake: *** [Makefile:508: all-recursive] Error 1