robotpkg/wip/ddp-actuator-solver bulk build results

Log for ddp-actuator-solver-1.0.0 on NetBSD-8.0-x86_64: bulk.log (Back)

=> Checking for clear installation ===> Installing bootstrap dependencies for ddp-actuator-solver-1.0.0 => Installing /opt/robotpkg/var/lib/robotpkg/packages/bsd/NetBSD-8.0-x86_64/All/digest-20080510.tgz => Installing /opt/robotpkg/var/lib/robotpkg/packages/bsd/NetBSD-8.0-x86_64/All/tnftp-20130505~ssl.tgz ===> Checking bootstrap dependencies for ddp-actuator-solver-1.0.0 => Required robotpkg package digest>=20080510: digest-20080510 found => Required robotpkg package tnftp>=20091122: tnftp-20130505~ssl found => Required system package gzip: gzip-20150113 found => Required system package patch>=2.0: patch-2.0128 found => Required system package pax and tar archivers: pax found => Required system package pkg_install>=20110805.9: pkg_install-20110805.9 found ===> Done bootstrap-depends for ddp-actuator-solver-1.0.0 ===> Installing full dependencies for ddp-actuator-solver-1.0.0 => Dependency digest-20080510 already installed => Installing /opt/robotpkg/var/lib/robotpkg/packages/bsd/NetBSD-8.0-x86_64/All/octomap-1.9.0.tgz => Installing /opt/robotpkg/var/lib/robotpkg/packages/bsd/NetBSD-8.0-x86_64/All/qpoases-3.2.1~doc.tgz => Dependency tnftp-20130505~ssl already installed ===> Checking build options for ddp-actuator-solver-1.0.0 => Building with no option. ===> Checking alternatives for ddp-actuator-solver-1.0.0 => Use the GNU C++ compiler: c++-compiler provided by g++>=3 => Use the GNU C compiler: c-compiler provided by gcc>=3 ===> Checking dependencies for ddp-actuator-solver-1.0.0 => Required system package boost-headers>=1.34.1: boost-headers-1.71 found => Required system package boostlib-unit_test_framework>=1.34.1: boost-libs-1.71 found => Required system package cmake>=2.6: cmake-3.15.3 found => Required system package doxygen>=1.5: doxygen-1.8.15 found => Required system package eigen3>=3.0.0: eigen3-3.3.7 found => Required system package g++>=3: g++-5.5.0 found => Required system package gcc>=3: gcc-5.5.0 found => Required system package libstdc++: libstdc++ found => Required system package pkg-config>=0.22: pkg-config-1.6.0 found => Required robotpkg package octomap>=1.6.0: octomap-1.9.0 found => Required robotpkg package qpoases>=3.2: qpoases-3.2.1~doc found ===> Done depends for ddp-actuator-solver-1.0.0 ===> Extracting for ddp-actuator-solver-1.0.0 => SHA1 checksums OK => RMD160 checksums OK tar: ustar vol 1, 497 files, 2795520 bytes read, 0 bytes written in 1 secs (2795520 bytes/sec) ===> Patching for ddp-actuator-solver-1.0.0 => Applying robotpkg patches for ddp-actuator-solver-1.0.0 ===> Configuring for ddp-actuator-solver-1.0.0 CMake Warning (dev) in CMakeLists.txt: No project() command is present. The top-level CMakeLists.txt file must contain a literal, direct call to the project() command. Add a line of code such as project(ProjectName) near the top of the file, but after cmake_minimum_required(). CMake is pretending there is a "project(Project)" command on the first line. This warning is for project developers. Use -Wno-dev to suppress it. ===> Building for ddp-actuator-solver-1.0.0 /local/robotpkg/var/tmp/robotpkg/wip/ddp-actuator-solver/work/ddp-actuator-solver-1.0.0/examples/romeo_actuator/romeosimpleactuator.cpp:2:52: fatal error: eigen3/unsupported/Eigen/MatrixFunctions: No such file or directory compilation terminated. gmake[2]: *** [examples/CMakeFiles/ddp-actuator-solver-examples.dir/build.make:79: examples/CMakeFiles/ddp-actuator-solver-examples.dir/romeo_actuator/romeosimpleactuator.cpp.o] Error 1 gmake[2]: *** Waiting for unfinished jobs.... gmake[1]: *** [CMakeFiles/Makefile2:542: examples/CMakeFiles/ddp-actuator-solver-examples.dir/all] Error 2 gmake: *** [Makefile:144: all] Error 2 An unexpected error occured. The last 10 log lines are shown below. | [ 18%] Building CXX object examples/CMakeFiles/ddp-actuator-solver-examples.dir/romeo_actuator/romeotorqueactuator.cpp.o | cd /local/robotpkg/var/tmp/robotpkg/wip/ddp-actuator-solver/work/ddp-actuator-solver-1.0.0/examples && /usr/bin/g++ -Dddp_actuator_solver_examples_EXPORTS -I/local/robotpkg/var/tmp/robotpkg/wip/ddp-actuator-solver/work/ddp-actuator-solver-1.0.0 -I/local/robotpkg/var/tmp/robotpkg/wip/ddp-actuator-solver/work/ddp-actuator-solver-1.0.0/include -isystem /opt/openrobots/include -isystem /usr/pkg/include/eigen3 -pedantic -Wno-long-long -Wall -Wextra -Wcast-align -Wcast-qual -Wformat -Wwrite-strings -Wconversion -pipe -O3 -DNDEBUG -fPIC -o CMakeFiles/ddp-actuator-solver-examples.dir/romeo_actuator/romeotorqueactuator.cpp.o -c /local/robotpkg/var/tmp/robotpkg/wip/ddp-actuator-solver/work/ddp-actuator-solver-1.0.0/examples/romeo_actuator/romeotorqueactuator.cpp | /local/robotpkg/var/tmp/robotpkg/wip/ddp-actuator-solver/work/ddp-actuator-solver-1.0.0/examples/romeo_actuator/romeosimpleactuator.cpp:2:52: fatal error: eigen3/unsupported/Eigen/MatrixFunctions: No such file or directory | compilation terminated. | gmake[2]: *** [examples/CMakeFiles/ddp-actuator-solver-examples.dir/build.make:79: examples/CMakeFiles/ddp-actuator-solver-examples.dir/romeo_actuator/romeosimpleactuator.cpp.o] Error 1 | gmake[2]: *** Waiting for unfinished jobs.... | gmake[2]: Leaving directory '/local/robotpkg/var/tmp/robotpkg/wip/ddp-actuator-solver/work/ddp-actuator-solver-1.0.0' | gmake[1]: Leaving directory '/local/robotpkg/var/tmp/robotpkg/wip/ddp-actuator-solver/work/ddp-actuator-solver-1.0.0' | gmake[1]: *** [CMakeFiles/Makefile2:542: examples/CMakeFiles/ddp-actuator-solver-examples.dir/all] Error 2 | gmake: *** [Makefile:144: all] Error 2 For details or bug reports, check the complete log file in: /local/robotpkg/var/tmp/robotpkg/wip/ddp-actuator-solver/work/build.log gmake[3]: *** [/local/robotpkg/var/lib/robotpkg/mk/build/build.mk:199: do-build] Error 2 gmake[2]: *** [/local/robotpkg/var/lib/robotpkg/mk/pkg/package.mk:42: pkg-check-installed] Error 2 ERROR: /usr/pkg/bin/gmake: *** [package] Error 2 => Marking ddp-actuator-solver-1.0.0 as broken ===> Deinstalling for ddp-actuator-solver Removed digest-20080510 Removed octomap-1.9.0 Removed qpoases-3.2.1~doc Removed tnftp-20130505~ssl