robotpkg/wip/ddp-actuator-solver bulk build results

Log for ddp-actuator-solver-1.0.0 on NetBSD-8.0-x86_64: build.log (Back)

--- Environment --- _override_vars_pkgtools_pkg_config=PKGREQD PKGREQD PKGREQD _overrides_devel_boost_headers_PKGREQD=boost-headers>=1.34.1 boost-headers>=1.34.1 boost-headers>=1.34.1 LC_MONETARY=C _overrides_pkgtools_pkg_install_PKGREQD=pkg_install>=20110805.9 pkg_install>=20110805.9 pkg_install>=20110805.9 CXX=/usr/bin/g++ PAX=/bin/pax MFLAGS=--no-print-directory OS_KERNEL_VERSION=8.0 MAKEFLAGS= --no-print-directory -- PKGREQD.cmdline=ddp-actuator-solver-1.0.0 RECURSIVE_PKGPATH=wip/ddp-actuator-solver\ tag=NetBSD-8.0-x86_64 BULK_LOGDIR=/local/robotpkg/var/log/bulk BULKBASE=/opt/openrobots LOCALBASE=/opt/openrobots PKG_DBDIR=/opt/openrobots/var/db/robotpkg EXPECT_TARGETS=fetch\ install\ package MAKEOVERRIDES=PKGREQD.cmdline=ddp-actuator-solver-1.0.0 RECURSIVE_PKGPATH=wip/ddp-actuator-solver\ tag=NetBSD-8.0-x86_64 BULK_LOGDIR=/local/robotpkg/var/log/bulk BULKBASE=/opt/openrobots LOCALBASE=/opt/openrobots PKG_DBDIR=/opt/openrobots/var/db/robotpkg EXPECT_TARGETS=fetch\ install\ package TAR=/usr/bin/tar GXX=/usr/bin/g++ BULK_LOGDIR=/local/robotpkg/var/log/bulk PWD=/local/robotpkg/var/lib/robotpkg/wip/ddp-actuator-solver LANG=C GZIP_CMD=/usr/bin/gzip _overrides_math_eigen3_PKGREQD=eigen3>=3.0.0 eigen3>=3.0.0 eigen3>=3.0.0 HOME=/ _override_vars_devel_boost_headers=PKGREQD PKGREQD PKGREQD CMAKE=/usr/pkg/bin/cmake PATH=/sbin:/bin:/usr/sbin:/usr/bin CXXCPP=/usr/bin/g++ -E LC_MESSAGES=C _overrides_archivers_pax_PKGREQD=pax pax _override_vars_pkgtools_pkg_install=PKGREQD PKGREQD PKGREQD MAKELEVEL=4 _override_vars_pkgtools_tnftp=PKGREQD PKGREQD LOWER_OS_VERSION=8.0 hline="$bf======================================================================$rm" ZCAT=/usr/bin/zcat MACHINE_PLATFORM=NetBSD-8.0-x86_64 _override_vars_mapping_octomap=PKGREQD PKGREQD PKGREQD _override_vars_pkgtools_digest=PKGREQD PKGREQD _overrides_optimization_qpoases_PKGREQD=qpoases>=3.2 qpoases>=3.2 qpoases>=3.2 LC_NUMERIC=C DOXYGEN=/usr/pkg/bin/doxygen OLDPWD=/local/robotpkg/var/lib/robotpkg/wip/hpp-affordance CC=/usr/bin/gcc _overrides_wip_ddp_actuator_solver_PKGREQD=ddp-actuator-solver-1.0.0 FC=false _overrides_pkgtools_tnftp_PKGREQD=tnftp>=20091122 tnftp>=20091122 PKG_CONFIG=/usr/pkg/bin/pkg-config tag=NetBSD-8.0-x86_64 OS_KERNEL=NetBSD ROBOTPKG_TRUSTED_ENV=robotpkg LC_CTYPE=C _override_vars_devel_boost_libs=PKGREQD PKGREQD PKGREQD _override_vars_math_eigen3=PKGREQD PKGREQD PKGREQD _ROBOTPKG_NOW=0822144225 LOWER_ARCH=x86_64 PATCH=/usr/bin/patch OWNER_GID=robots ROBOTPKG_BASE=/local/robotpkg _overrides_devel_boost_libs_PKGREQD=boost-libs>=1.34.1 boost-libs>=1.34.1 boost-libs>=1.34.1 NODENAME=fluffy64-netbsd8 bf= DIGEST=/opt/openrobots/sbin/robotpkg_digest ECHO_N=echo -n OS_VERSION=8.0 EXPECT_TARGETS=fetch install package _override_vars_wip_ddp_actuator_solver=PKGREQD LC_COLLATE=C rm= _overrides_mapping_octomap_PKGREQD=octomap>=1.6.0 octomap>=1.6.0 octomap>=1.6.0 _overrides_pkgtools_digest_PKGREQD=digest>=20080510 digest>=20080510 OWNER_UID=rbulk _override_vars_optimization_qpoases=PKGREQD PKGREQD PKGREQD RECURSIVE_PKGPATH=wip/ddp-actuator-solver MACHINE_ARCH=x86_64 ROBOTPKG_DIR=/local/robotpkg/var/lib/robotpkg _override_vars_archivers_pax=PKGREQD PKGREQD LOWER_OPSYS=netbsd LC_TIME=C TNFTP=/opt/openrobots/sbin/tnftp OPSYS=NetBSD LOCALBASE=/opt/openrobots LOWER_OS_KERNEL=netbsd PKGTOOLS_VERSION=20110805.9 BULKBASE=/opt/openrobots PKG_CONFIG_LIBDIR=/usr/lib/pkgconfig MACHINE_KERNEL=NetBSD-8.0-x86_64 _overrides_pkgtools_pkg_config_PKGREQD=pkg-config>=0.22 pkg-config>=0.22 pkg-config>=0.22 PKG_CONFIG_PATH=/opt/openrobots/lib/pkgconfig:/usr/pkg/lib/pkgconfig GCC=/usr/bin/gcc PKG_DBDIR=/opt/openrobots/var/db/robotpkg MAKECONF=/opt/robotpkg/etc/robotpkg-wip.conf CPP=/usr/bin/gcc -E --- Running set -e; \ cd /local/robotpkg/var/tmp/robotpkg/wip/ddp-actuator-solver/work/ddp-actuator-solver-1.0.0 && cd /local/robotpkg/var/tmp/robotpkg/wip/ddp-actuator-solver/work/ddp-actuator-solver-1.0.0 && /usr/bin/env MAKELEVEL= MAKEOVERRIDES= MAKEFLAGS= MFLAGS= 'CPPFLAGS=' 'CFLAGS=-pipe -O3 -DNDEBUG' 'LDFLAGS=' 'CXXFLAGS=-pipe -O3 -DNDEBUG' PREFIX='/opt/openrobots' HOME=/local/robotpkg/var/tmp/robotpkg/wip/ddp-actuator-solver/work PATH='/opt/openrobots/bin:/opt/openrobots/sbin:/sbin:/bin:/usr/sbin:/usr/bin' LD_LIBRARY_PATH='' LOCALBASE=/opt/openrobots PKGMANDIR=man /usr/pkg/bin/gmake -j4 -f Makefile all; /usr/pkg/bin/cmake -H/local/robotpkg/var/tmp/robotpkg/wip/ddp-actuator-solver/work/ddp-actuator-solver-1.0.0 -B/local/robotpkg/var/tmp/robotpkg/wip/ddp-actuator-solver/work/ddp-actuator-solver-1.0.0 --check-build-system CMakeFiles/Makefile.cmake 0 /usr/pkg/bin/cmake -E cmake_progress_start /local/robotpkg/var/tmp/robotpkg/wip/ddp-actuator-solver/work/ddp-actuator-solver-1.0.0/CMakeFiles /local/robotpkg/var/tmp/robotpkg/wip/ddp-actuator-solver/work/ddp-actuator-solver-1.0.0/CMakeFiles/progress.marks /usr/pkg/bin/gmake -f CMakeFiles/Makefile2 all gmake[1]: Entering directory '/local/robotpkg/var/tmp/robotpkg/wip/ddp-actuator-solver/work/ddp-actuator-solver-1.0.0' /usr/pkg/bin/gmake -f examples/CMakeFiles/ddp-actuator-solver-examples.dir/build.make examples/CMakeFiles/ddp-actuator-solver-examples.dir/depend gmake[2]: Entering directory '/local/robotpkg/var/tmp/robotpkg/wip/ddp-actuator-solver/work/ddp-actuator-solver-1.0.0' cd /local/robotpkg/var/tmp/robotpkg/wip/ddp-actuator-solver/work/ddp-actuator-solver-1.0.0 && /usr/pkg/bin/cmake -E cmake_depends "Unix Makefiles" /local/robotpkg/var/tmp/robotpkg/wip/ddp-actuator-solver/work/ddp-actuator-solver-1.0.0 /local/robotpkg/var/tmp/robotpkg/wip/ddp-actuator-solver/work/ddp-actuator-solver-1.0.0/examples /local/robotpkg/var/tmp/robotpkg/wip/ddp-actuator-solver/work/ddp-actuator-solver-1.0.0 /local/robotpkg/var/tmp/robotpkg/wip/ddp-actuator-solver/work/ddp-actuator-solver-1.0.0/examples /local/robotpkg/var/tmp/robotpkg/wip/ddp-actuator-solver/work/ddp-actuator-solver-1.0.0/examples/CMakeFiles/ddp-actuator-solver-examples.dir/DependInfo.cmake --color= Scanning dependencies of target ddp-actuator-solver-examples gmake[2]: Leaving directory '/local/robotpkg/var/tmp/robotpkg/wip/ddp-actuator-solver/work/ddp-actuator-solver-1.0.0' /usr/pkg/bin/gmake -f examples/CMakeFiles/ddp-actuator-solver-examples.dir/build.make examples/CMakeFiles/ddp-actuator-solver-examples.dir/build gmake[2]: Entering directory '/local/robotpkg/var/tmp/robotpkg/wip/ddp-actuator-solver/work/ddp-actuator-solver-1.0.0' [ 4%] Building CXX object examples/CMakeFiles/ddp-actuator-solver-examples.dir/temperature_control/costtemp.cpp.o cd /local/robotpkg/var/tmp/robotpkg/wip/ddp-actuator-solver/work/ddp-actuator-solver-1.0.0/examples && /usr/bin/g++ -Dddp_actuator_solver_examples_EXPORTS -I/local/robotpkg/var/tmp/robotpkg/wip/ddp-actuator-solver/work/ddp-actuator-solver-1.0.0 -I/local/robotpkg/var/tmp/robotpkg/wip/ddp-actuator-solver/work/ddp-actuator-solver-1.0.0/include -isystem /opt/openrobots/include -isystem /usr/pkg/include/eigen3 -pedantic -Wno-long-long -Wall -Wextra -Wcast-align -Wcast-qual -Wformat -Wwrite-strings -Wconversion -pipe -O3 -DNDEBUG -fPIC -o CMakeFiles/ddp-actuator-solver-examples.dir/temperature_control/costtemp.cpp.o -c /local/robotpkg/var/tmp/robotpkg/wip/ddp-actuator-solver/work/ddp-actuator-solver-1.0.0/examples/temperature_control/costtemp.cpp [ 9%] Building CXX object examples/CMakeFiles/ddp-actuator-solver-examples.dir/romeo_actuator/romeosimpleactuator.cpp.o [ 13%] Building CXX object examples/CMakeFiles/ddp-actuator-solver-examples.dir/romeo_actuator/romeotorqueactuator.cpp.o cd /local/robotpkg/var/tmp/robotpkg/wip/ddp-actuator-solver/work/ddp-actuator-solver-1.0.0/examples && /usr/bin/g++ -Dddp_actuator_solver_examples_EXPORTS -I/local/robotpkg/var/tmp/robotpkg/wip/ddp-actuator-solver/work/ddp-actuator-solver-1.0.0 -I/local/robotpkg/var/tmp/robotpkg/wip/ddp-actuator-solver/work/ddp-actuator-solver-1.0.0/include -isystem /opt/openrobots/include -isystem /usr/pkg/include/eigen3 -pedantic -Wno-long-long -Wall -Wextra -Wcast-align -Wcast-qual -Wformat -Wwrite-strings -Wconversion -pipe -O3 -DNDEBUG -fPIC -o CMakeFiles/ddp-actuator-solver-examples.dir/romeo_actuator/romeosimpleactuator.cpp.o -c /local/robotpkg/var/tmp/robotpkg/wip/ddp-actuator-solver/work/ddp-actuator-solver-1.0.0/examples/romeo_actuator/romeosimpleactuator.cpp cd /local/robotpkg/var/tmp/robotpkg/wip/ddp-actuator-solver/work/ddp-actuator-solver-1.0.0/examples && /usr/bin/g++ -Dddp_actuator_solver_examples_EXPORTS -I/local/robotpkg/var/tmp/robotpkg/wip/ddp-actuator-solver/work/ddp-actuator-solver-1.0.0 -I/local/robotpkg/var/tmp/robotpkg/wip/ddp-actuator-solver/work/ddp-actuator-solver-1.0.0/include -isystem /opt/openrobots/include -isystem /usr/pkg/include/eigen3 -pedantic -Wno-long-long -Wall -Wextra -Wcast-align -Wcast-qual -Wformat -Wwrite-strings -Wconversion -pipe -O3 -DNDEBUG -fPIC -o CMakeFiles/ddp-actuator-solver-examples.dir/romeo_actuator/romeotorqueactuator.cpp.o -c /local/robotpkg/var/tmp/robotpkg/wip/ddp-actuator-solver/work/ddp-actuator-solver-1.0.0/examples/romeo_actuator/romeotorqueactuator.cpp [ 18%] Building CXX object examples/CMakeFiles/ddp-actuator-solver-examples.dir/romeo_actuator/costfunctionromeoactuator.cpp.o cd /local/robotpkg/var/tmp/robotpkg/wip/ddp-actuator-solver/work/ddp-actuator-solver-1.0.0/examples && /usr/bin/g++ -Dddp_actuator_solver_examples_EXPORTS -I/local/robotpkg/var/tmp/robotpkg/wip/ddp-actuator-solver/work/ddp-actuator-solver-1.0.0 -I/local/robotpkg/var/tmp/robotpkg/wip/ddp-actuator-solver/work/ddp-actuator-solver-1.0.0/include -isystem /opt/openrobots/include -isystem /usr/pkg/include/eigen3 -pedantic -Wno-long-long -Wall -Wextra -Wcast-align -Wcast-qual -Wformat -Wwrite-strings -Wconversion -pipe -O3 -DNDEBUG -fPIC -o CMakeFiles/ddp-actuator-solver-examples.dir/romeo_actuator/costfunctionromeoactuator.cpp.o -c /local/robotpkg/var/tmp/robotpkg/wip/ddp-actuator-solver/work/ddp-actuator-solver-1.0.0/examples/romeo_actuator/costfunctionromeoactuator.cpp /local/robotpkg/var/tmp/robotpkg/wip/ddp-actuator-solver/work/ddp-actuator-solver-1.0.0/examples/romeo_actuator/romeosimpleactuator.cpp:2:52: fatal error: eigen3/unsupported/Eigen/MatrixFunctions: No such file or directory compilation terminated. examples/CMakeFiles/ddp-actuator-solver-examples.dir/build.make:78: recipe for target 'examples/CMakeFiles/ddp-actuator-solver-examples.dir/romeo_actuator/romeosimpleactuator.cpp.o' failed gmake[2]: *** [examples/CMakeFiles/ddp-actuator-solver-examples.dir/romeo_actuator/romeosimpleactuator.cpp.o] Error 1 gmake[2]: *** Waiting for unfinished jobs.... gmake[2]: Leaving directory '/local/robotpkg/var/tmp/robotpkg/wip/ddp-actuator-solver/work/ddp-actuator-solver-1.0.0' CMakeFiles/Makefile2:583: recipe for target 'examples/CMakeFiles/ddp-actuator-solver-examples.dir/all' failed gmake[1]: *** [examples/CMakeFiles/ddp-actuator-solver-examples.dir/all] Error 2 gmake[1]: Leaving directory '/local/robotpkg/var/tmp/robotpkg/wip/ddp-actuator-solver/work/ddp-actuator-solver-1.0.0' gmake: *** [all] Error 2 Makefile:143: recipe for target 'all' failed