robotpkg/wip/backward-ros bulk build results

Log for backward-ros-0.1.7 on NetBSD-9.0-x86_64: bulk.log (Back)

=> Checking for clear installation ===> Installing bootstrap dependencies for backward-ros-0.1.7 => Installing /opt/robotpkg/var/lib/robotpkg/packages/bsd/NetBSD-9.0-x86_64/All/digest-20080510.tgz => Installing /opt/robotpkg/var/lib/robotpkg/packages/bsd/NetBSD-9.0-x86_64/All/tnftp-20151004~ssl.tgz ===> Checking bootstrap dependencies for backward-ros-0.1.7 => Required robotpkg package digest>=20080510: digest-20080510 found => Required robotpkg package tnftp>=20130505~ssl: tnftp-20151004~ssl found => Required system package gzip: gzip-20170803 found => Required system package pax and tar archivers: pax found => Required system package pkg_install>=20110805.9: pkg_install-20110805.9 found ===> Done bootstrap-depends for backward-ros-0.1.7 ===> Installing full dependencies for backward-ros-0.1.7 => Dependency digest-20080510 already installed => Installing /opt/robotpkg/var/lib/robotpkg/packages/bsd/NetBSD-9.0-x86_64/All/py27-catkin-pkg-0.4.8.tgz => Installing /opt/robotpkg/var/lib/robotpkg/packages/bsd/NetBSD-9.0-x86_64/All/py27-ros-catkin-0.7.16r1.tgz To use ros, the following environment variables must contain those values: ROS_MASTER_URI http://localhost:11311 ROS_PACKAGE_PATH /opt/openrobots/share PYTHONPATH /opt/openrobots/lib/python2.7/site-packages PATH /opt/openrobots/bin As an alternative to the above configuration, commands can be executed by using the `env.sh' wrapper. For instance, roscore can be started like so: /opt/openrobots/etc/ros/env.sh roscore In Bourne shell scripts, the following file can be sourced instead: /opt/openrobots/etc/ros/setup.sh => Installing /opt/robotpkg/var/lib/robotpkg/packages/bsd/NetBSD-9.0-x86_64/All/ros-comm-1.14.4.tgz => Dependency tnftp-20151004~ssl already installed ===> Checking build options for backward-ros-0.1.7 => Building with no option. ===> Checking alternatives for backward-ros-0.1.7 => Use the GNU C++ compiler: c++-compiler provided by g++>=3 => Use the GNU C compiler: c-compiler provided by gcc>=3 => Use python-2.7: python>=2.5<3.9 provided by python27>=2.7<2.8 => Use ros melodic: ros>=groovy provided by ros-melodic ===> Checking dependencies for backward-ros-0.1.7 => Required system package cmake>=2.8.3: cmake-3.15.3 found => Required system package g++>=3: g++-7.4.0 found => Required system package gcc>=3: gcc-7.4.0 found => Required system package googletest: googletest found => Required system package libstdc++: libstdc++ found => Required system package pkg-config>=0.22: pkg-config-1.6.0 found => Required system package py27-empy>=3: py27-empy-3.3 found => Required system package py27-nose>=0.10: py27-nose-1.3.7 found => Required system package py27-pyparsing>=1: py27-pyparsing-2.4.2 found => Required system package python27>=2.7<2.8: python27-2.7.16 found => Required robotpkg package py27-catkin-pkg>=0.2: py27-catkin-pkg-0.4.8 found => Required robotpkg package py27-ros-catkin>=0.7<0.8: py27-ros-catkin-0.7.16r1 found => Required robotpkg package ros-comm>=1.13<1.15: ros-comm-1.14.4 found ===> Done depends for backward-ros-0.1.7 ===> Extracting for backward-ros-0.1.7 => SHA1 checksums OK => RMD160 checksums OK x backward_ros-0.1.7/ x backward_ros-0.1.7/.gitignore x backward_ros-0.1.7/.travis.yml x backward_ros-0.1.7/CHANGELOG.rst x backward_ros-0.1.7/CMakeLists.txt x backward_ros-0.1.7/LICENSE.txt x backward_ros-0.1.7/README.md x backward_ros-0.1.7/builds.sh x backward_ros-0.1.7/cmake/ x backward_ros-0.1.7/cmake/BackwardConfig.cmake x backward_ros-0.1.7/cmake/BackwardConfigCatkin.cmake x backward_ros-0.1.7/conanfile.py x backward_ros-0.1.7/doc/ x backward_ros-0.1.7/doc/nice.png x backward_ros-0.1.7/doc/pretty.png x backward_ros-0.1.7/doc/rude.png x backward_ros-0.1.7/include/ x backward_ros-0.1.7/include/backward_ros/ x backward_ros-0.1.7/include/backward_ros/backward.hpp x backward_ros-0.1.7/package.xml x backward_ros-0.1.7/src/ x backward_ros-0.1.7/src/backward.cpp x backward_ros-0.1.7/test/ x backward_ros-0.1.7/test/_test_main.cpp x backward_ros-0.1.7/test/rectrace.cpp x backward_ros-0.1.7/test/select_signals.cpp x backward_ros-0.1.7/test/stacktrace.cpp x backward_ros-0.1.7/test/suicide.cpp x backward_ros-0.1.7/test/test.cpp x backward_ros-0.1.7/test/test.hpp x backward_ros-0.1.7/test_package/ x backward_ros-0.1.7/test_package/CMakeLists.txt x backward_ros-0.1.7/test_package/conanfile.py x backward_ros-0.1.7/test_package/main.cpp ===> Configuring for backward-ros-0.1.7 ===> Building for backward-ros-0.1.7 In file included from /local/robotpkg/var/tmp/robotpkg/wip/backward-ros/work/backward_ros-0.1.7/src/backward.cpp:26:0: /local/robotpkg/var/tmp/robotpkg/wip/backward-ros/work/backward_ros-0.1.7/include/backward_ros/backward.hpp: In instantiation of '_Unwind_Reason_Code backward::details::Unwinder::backtrace(_Unwind_Context*) [with F = backward::StackTraceImpl::callback; _Unwind_Reason_Code = int]': /local/robotpkg/var/tmp/robotpkg/wip/backward-ros/work/backward_ros-0.1.7/include/backward_ros/backward.hpp:659:29: required from 'static _Unwind_Reason_Code backward::details::Unwinder::backtrace_trampoline(_Unwind_Context*, void*) [with F = backward::StackTraceImpl::callback; _Unwind_Reason_Code = int]' /local/robotpkg/var/tmp/robotpkg/wip/backward-ros/work/backward_ros-0.1.7/include/backward_ros/backward.hpp:648:28: required from 'size_t backward::details::Unwinder::operator()(F&, size_t) [with F = backward::StackTraceImpl::callback; size_t = long unsigned int]' /local/robotpkg/var/tmp/robotpkg/wip/backward-ros/work/backward_ros-0.1.7/include/backward_ros/backward.hpp:689:17: required from 'size_t backward::details::unwind(F, size_t) [with F = backward::StackTraceImpl::callback; size_t = long unsigned int]' /local/robotpkg/var/tmp/robotpkg/wip/backward-ros/work/backward_ros-0.1.7/include/backward_ros/backward.hpp:705:60: required from here /local/robotpkg/var/tmp/robotpkg/wip/backward-ros/work/backward_ros-0.1.7/include/backward_ros/backward.hpp:667:35: error: invalid conversion from '_Unwind_Ptr {aka void*}' to 'uintptr_t {aka long unsigned int}' [-fpermissive] uintptr_t ip = _Unwind_GetIPInfo(ctx, &ip_before_instruction); ~~~~~~~~~~~~~~~~~^~~~~~~~~~~~~~~~~~~~~~~~~~~~~ gmake[2]: *** [CMakeFiles/backward_object.dir/build.make:66: CMakeFiles/backward_object.dir/src/backward.cpp.o] Error 1 gmake[1]: *** [CMakeFiles/Makefile2:149: CMakeFiles/backward_object.dir/all] Error 2 gmake[1]: *** Waiting for unfinished jobs.... In file included from /local/robotpkg/var/tmp/robotpkg/wip/backward-ros/work/backward_ros-0.1.7/src/backward.cpp:26:0: /local/robotpkg/var/tmp/robotpkg/wip/backward-ros/work/backward_ros-0.1.7/include/backward_ros/backward.hpp: In instantiation of '_Unwind_Reason_Code backward::details::Unwinder::backtrace(_Unwind_Context*) [with F = backward::StackTraceImpl::callback; _Unwind_Reason_Code = int]': /local/robotpkg/var/tmp/robotpkg/wip/backward-ros/work/backward_ros-0.1.7/include/backward_ros/backward.hpp:659:29: required from 'static _Unwind_Reason_Code backward::details::Unwinder::backtrace_trampoline(_Unwind_Context*, void*) [with F = backward::StackTraceImpl::callback; _Unwind_Reason_Code = int]' /local/robotpkg/var/tmp/robotpkg/wip/backward-ros/work/backward_ros-0.1.7/include/backward_ros/backward.hpp:648:28: required from 'size_t backward::details::Unwinder::operator()(F&, size_t) [with F = backward::StackTraceImpl::callback; size_t = long unsigned int]' /local/robotpkg/var/tmp/robotpkg/wip/backward-ros/work/backward_ros-0.1.7/include/backward_ros/backward.hpp:689:17: required from 'size_t backward::details::unwind(F, size_t) [with F = backward::StackTraceImpl::callback; size_t = long unsigned int]' /local/robotpkg/var/tmp/robotpkg/wip/backward-ros/work/backward_ros-0.1.7/include/backward_ros/backward.hpp:705:60: required from here /local/robotpkg/var/tmp/robotpkg/wip/backward-ros/work/backward_ros-0.1.7/include/backward_ros/backward.hpp:667:35: error: invalid conversion from '_Unwind_Ptr {aka void*}' to 'uintptr_t {aka long unsigned int}' [-fpermissive] uintptr_t ip = _Unwind_GetIPInfo(ctx, &ip_before_instruction); ~~~~~~~~~~~~~~~~~^~~~~~~~~~~~~~~~~~~~~~~~~~~~~ gmake[2]: *** [CMakeFiles/backward.dir/build.make:66: CMakeFiles/backward.dir/src/backward.cpp.o] Error 1 gmake[1]: *** [CMakeFiles/Makefile2:338: CMakeFiles/backward.dir/all] Error 2 gmake: *** [Makefile:133: all] Error 2 An unexpected error occured. The last 10 log lines are shown below. | /local/robotpkg/var/tmp/robotpkg/wip/backward-ros/work/backward_ros-0.1.7/include/backward_ros/backward.hpp:689:17: required from 'size_t backward::details::unwind(F, size_t) [with F = backward::StackTraceImpl::callback; size_t = long unsigned int]' | /local/robotpkg/var/tmp/robotpkg/wip/backward-ros/work/backward_ros-0.1.7/include/backward_ros/backward.hpp:705:60: required from here | /local/robotpkg/var/tmp/robotpkg/wip/backward-ros/work/backward_ros-0.1.7/include/backward_ros/backward.hpp:667:35: error: invalid conversion from '_Unwind_Ptr {aka void*}' to 'uintptr_t {aka long unsigned int}' [-fpermissive] | uintptr_t ip = _Unwind_GetIPInfo(ctx, &ip_before_instruction); | ~~~~~~~~~~~~~~~~~^~~~~~~~~~~~~~~~~~~~~~~~~~~~~ | gmake[2]: *** [CMakeFiles/backward.dir/build.make:66: CMakeFiles/backward.dir/src/backward.cpp.o] Error 1 | gmake[1]: *** [CMakeFiles/Makefile2:338: CMakeFiles/backward.dir/all] Error 2 | gmake: *** [Makefile:133: all] Error 2 | gmake[2]: Leaving directory '/local/robotpkg/var/tmp/robotpkg/wip/backward-ros/work/backward_ros-0.1.7' | gmake[1]: Leaving directory '/local/robotpkg/var/tmp/robotpkg/wip/backward-ros/work/backward_ros-0.1.7' For details or bug reports, check the complete log file in: => Marking backward-ros-0.1.7 as broken /local/robotpkg/var/tmp/robotpkg/wip/backward-ros/work/build.log gmake[3]: *** [/local/robotpkg/var/lib/robotpkg/mk/build/build.mk:199: do-build] Error 2 gmake[2]: *** [/local/robotpkg/var/lib/robotpkg/mk/pkg/package.mk:42: pkg-check-installed] Error 2 ERROR: /usr/pkg/bin/gmake: *** [package] Error 2 ===> Deinstalling for backward-ros Removed digest-20080510 Removing dependency py27-rosdistro-0.3.5 Removing dependency py27-rosdep-0.10.30 Removing dependency py27-ros-catkin-0.7.16r1 Removing dependency ros-rospack-2.5.1 Removing dependency ros-roscpp-core-0.6.11 Removing dependency ros-genmsg-0.5.11 Removing dependency ros-ros-1.14.4r1 Removing dependency ros-console-1.13.7 Removing dependency ros-gennodejs-2.0.1 Removing dependency ros-genlisp-0.4.16 Removing dependency ros-geneus-2.2.6 Removing dependency ros-gencpp-0.6.0 Removing dependency ros-genpy-0.6.7 Removing dependency ros-message-runtime-0.4.12 Removing dependency ros-message-generation-0.4.0 Removing dependency ros-std-msgs-0.5.11 Removing dependency ros-comm-msgs-1.11.2r1 Removing dependency ros-class-loader-0.4.1 Removing dependency ros-pluginlib-1.12.1 Removing dependency ros-comm-1.14.4 Removed py27-catkin-pkg-0.4.8 Removed tnftp-20151004~ssl