robotpkg/wip/backward-ros bulk build results

Log for backward-ros-0.1.7 on NetBSD-9.0-x86_64: build.log (Back)

--- Environment --- _override_vars_pkgtools_pkg_config=PKGREQD PKGREQD PKGREQD PYTHON=/usr/pkg/bin/python2.7 LC_MONETARY=C _overrides_pkgtools_pkg_install_PKGREQD=pkg_install>=20110805.9 pkg_install>=20110805.9 pkg_install>=20110805.9 CXX=/usr/bin/g++ _override_vars_devel_ros_catkin=PKGREQD PKGREQD PKGREQD PAX=/bin/pax MFLAGS=--no-print-directory OS_KERNEL_VERSION=9.0 MAKEFLAGS= --no-print-directory -- PKGREQD.cmdline=backward-ros-0.1.7~!doc RECURSIVE_PKGPATH=wip/backward-ros\ tag=NetBSD-9.0-x86_64 BULK_LOGDIR=/local/robotpkg/var/log/bulk BULKBASE=/opt/openrobots LOCALBASE=/opt/openrobots PKG_DBDIR=/opt/openrobots/var/db/robotpkg EXPECT_TARGETS=fetch\ install\ package MAKEOVERRIDES=PKGREQD.cmdline=backward-ros-0.1.7~!doc RECURSIVE_PKGPATH=wip/backward-ros\ tag=NetBSD-9.0-x86_64 BULK_LOGDIR=/local/robotpkg/var/log/bulk BULKBASE=/opt/openrobots LOCALBASE=/opt/openrobots PKG_DBDIR=/opt/openrobots/var/db/robotpkg EXPECT_TARGETS=fetch\ install\ package TAR=/usr/bin/tar GXX=/usr/bin/g++ BULK_LOGDIR=/local/robotpkg/var/log/bulk PWD=/local/robotpkg/var/lib/robotpkg/wip/backward-ros LANG=C GZIP_CMD=/usr/bin/gzip HOME=/ CMAKE=/usr/pkg/bin/cmake PATH=/sbin:/bin:/usr/sbin:/usr/bin CXXCPP=/usr/bin/g++ -E LC_MESSAGES=C _overrides_archivers_pax_PKGREQD=pax pax _overrides_devel_ros_catkin_PKGREQD=py27-ros-catkin>=0.7<0.8 py27-ros-catkin>=0.7<0.8 py27-ros-catkin>=0.7<0.8 PYTHON27_INCLUDE=/usr/pkg/include/python2.7/ _override_vars_pkgtools_pkg_install=PKGREQD PKGREQD PKGREQD MAKELEVEL=4 _override_vars_pkgtools_tnftp=PKGREQD PKGREQD LOWER_OS_VERSION=9.0 hline="$bf======================================================================$rm" ZCAT=/usr/bin/zcat MACHINE_PLATFORM=NetBSD-9.0-x86_64 _override_vars_pkgtools_digest=PKGREQD PKGREQD LC_NUMERIC=C PYTHON27=/usr/pkg/bin/python2.7 OLDPWD=/local/robotpkg/var/lib/robotpkg/wip/dynamic-graph-tutorial CC=/usr/bin/gcc FC=false _override_vars_sysutils_py_catkin_pkg=PKGREQD PKGREQD PKGREQD _overrides_pkgtools_tnftp_PKGREQD=tnftp>=20130505~ssl tnftp>=20130505~ssl PKG_CONFIG=/usr/pkg/bin/pkg-config PYTHON_INCLUDE_CONFIG=/usr/pkg/include/python2.7/ tag=NetBSD-9.0-x86_64 OS_KERNEL=NetBSD ROBOTPKG_TRUSTED_ENV=robotpkg LC_CTYPE=C PYTHON27_LIB=/usr/pkg/lib/libpython2.7.so PYTHONPATH=/opt/openrobots/lib/python2.7/site-packages _ROBOTPKG_NOW=1126191043 LOWER_ARCH=x86_64 NOSETESTS=/usr/pkg/bin/nosetests-2.7 OWNER_GID=robots ROBOTPKG_BASE=/local/robotpkg NODENAME=fluffy64-netbsd9 bf= DIGEST=/opt/openrobots/sbin/robotpkg_digest ECHO_N=echo -n OS_VERSION=9.0 EXPECT_TARGETS=fetch install package LC_COLLATE=C PYTHON_INCLUDE=/usr/pkg/include/python2.7/ rm= _overrides_pkgtools_digest_PKGREQD=digest>=20080510 digest>=20080510 OWNER_UID=rbulk _override_vars_middleware_ros_comm=PKGREQD PKGREQD PKGREQD RECURSIVE_PKGPATH=wip/backward-ros MACHINE_ARCH=x86_64 _overrides_middleware_ros_comm_PKGREQD=ros-comm>=1.13<1.15 ros-comm>=1.13<1.15 ros-comm>=1.13<1.15 ROBOTPKG_DIR=/local/robotpkg/var/lib/robotpkg _override_vars_archivers_pax=PKGREQD PKGREQD PYTHON_LIB=/usr/pkg/lib/libpython2.7.so _overrides_sysutils_py_catkin_pkg_PKGREQD=py27-catkin-pkg>=0.2 py27-catkin-pkg>=0.2 py27-catkin-pkg>=0.2 LOWER_OPSYS=netbsd LC_TIME=C PYTHONDONTWRITEBYTECODE=1 TNFTP=/opt/openrobots/sbin/tnftp OPSYS=NetBSD LOCALBASE=/opt/openrobots LOWER_OS_KERNEL=netbsd PKGTOOLS_VERSION=20110805.9 BULKBASE=/opt/openrobots PKG_CONFIG_LIBDIR=/usr/lib/pkgconfig MACHINE_KERNEL=NetBSD-9.0-x86_64 _overrides_wip_backward_ros_PKGREQD=backward-ros-0.1.7~!doc _overrides_pkgtools_pkg_config_PKGREQD=pkg-config>=0.22 pkg-config>=0.22 pkg-config>=0.22 PKG_CONFIG_PATH=/opt/openrobots/lib/pkgconfig GCC=/usr/bin/gcc PKG_DBDIR=/opt/openrobots/var/db/robotpkg _override_vars_wip_backward_ros=PKGREQD MAKECONF=/opt/robotpkg/etc/robotpkg-wip.conf CPP=/usr/bin/gcc -E --- Running set -e; \ cd /local/robotpkg/var/tmp/robotpkg/wip/backward-ros/work/backward_ros-0.1.7 && cd /local/robotpkg/var/tmp/robotpkg/wip/backward-ros/work/backward_ros-0.1.7 && /usr/bin/env MAKELEVEL= MAKEOVERRIDES= MAKEFLAGS= MFLAGS= 'CPPFLAGS=' 'CFLAGS=-pipe -O3 -DNDEBUG' 'LDFLAGS=' 'CXXFLAGS=-pipe -O3 -DNDEBUG' PREFIX='/opt/openrobots' HOME=/local/robotpkg/var/tmp/robotpkg/wip/backward-ros/work PATH='/opt/openrobots/bin:/opt/openrobots/sbin:/sbin:/bin:/usr/sbin:/usr/bin' LD_LIBRARY_PATH='' LOCALBASE=/opt/openrobots PKGMANDIR=man /usr/pkg/bin/gmake -j4 -f Makefile all; /usr/pkg/bin/cmake -S/local/robotpkg/var/tmp/robotpkg/wip/backward-ros/work/backward_ros-0.1.7 -B/local/robotpkg/var/tmp/robotpkg/wip/backward-ros/work/backward_ros-0.1.7 --check-build-system CMakeFiles/Makefile.cmake 0 /usr/pkg/bin/cmake -E cmake_progress_start /local/robotpkg/var/tmp/robotpkg/wip/backward-ros/work/backward_ros-0.1.7/CMakeFiles /local/robotpkg/var/tmp/robotpkg/wip/backward-ros/work/backward_ros-0.1.7/CMakeFiles/progress.marks /usr/pkg/bin/gmake -f CMakeFiles/Makefile2 all gmake[1]: Entering directory '/local/robotpkg/var/tmp/robotpkg/wip/backward-ros/work/backward_ros-0.1.7' /usr/pkg/bin/gmake -f CMakeFiles/backward_object.dir/build.make CMakeFiles/backward_object.dir/depend /usr/pkg/bin/gmake -f CMakeFiles/backward.dir/build.make CMakeFiles/backward.dir/depend gmake[2]: Entering directory '/local/robotpkg/var/tmp/robotpkg/wip/backward-ros/work/backward_ros-0.1.7' cd /local/robotpkg/var/tmp/robotpkg/wip/backward-ros/work/backward_ros-0.1.7 && /usr/pkg/bin/cmake -E cmake_depends "Unix Makefiles" /local/robotpkg/var/tmp/robotpkg/wip/backward-ros/work/backward_ros-0.1.7 /local/robotpkg/var/tmp/robotpkg/wip/backward-ros/work/backward_ros-0.1.7 /local/robotpkg/var/tmp/robotpkg/wip/backward-ros/work/backward_ros-0.1.7 /local/robotpkg/var/tmp/robotpkg/wip/backward-ros/work/backward_ros-0.1.7 /local/robotpkg/var/tmp/robotpkg/wip/backward-ros/work/backward_ros-0.1.7/CMakeFiles/backward_object.dir/DependInfo.cmake --color= gmake[2]: Entering directory '/local/robotpkg/var/tmp/robotpkg/wip/backward-ros/work/backward_ros-0.1.7' cd /local/robotpkg/var/tmp/robotpkg/wip/backward-ros/work/backward_ros-0.1.7 && /usr/pkg/bin/cmake -E cmake_depends "Unix Makefiles" /local/robotpkg/var/tmp/robotpkg/wip/backward-ros/work/backward_ros-0.1.7 /local/robotpkg/var/tmp/robotpkg/wip/backward-ros/work/backward_ros-0.1.7 /local/robotpkg/var/tmp/robotpkg/wip/backward-ros/work/backward_ros-0.1.7 /local/robotpkg/var/tmp/robotpkg/wip/backward-ros/work/backward_ros-0.1.7 /local/robotpkg/var/tmp/robotpkg/wip/backward-ros/work/backward_ros-0.1.7/CMakeFiles/backward.dir/DependInfo.cmake --color= Scanning dependencies of target backward_object gmake[2]: Leaving directory '/local/robotpkg/var/tmp/robotpkg/wip/backward-ros/work/backward_ros-0.1.7' /usr/pkg/bin/gmake -f CMakeFiles/backward_object.dir/build.make CMakeFiles/backward_object.dir/build gmake[2]: Entering directory '/local/robotpkg/var/tmp/robotpkg/wip/backward-ros/work/backward_ros-0.1.7' Scanning dependencies of target backward gmake[2]: Leaving directory '/local/robotpkg/var/tmp/robotpkg/wip/backward-ros/work/backward_ros-0.1.7' /usr/pkg/bin/gmake -f CMakeFiles/backward.dir/build.make CMakeFiles/backward.dir/build gmake[2]: Entering directory '/local/robotpkg/var/tmp/robotpkg/wip/backward-ros/work/backward_ros-0.1.7' [ 33%] Building CXX object CMakeFiles/backward_object.dir/src/backward.cpp.o /usr/bin/g++ -DBACKWARD_HAS_BACKTRACE=0 -DBACKWARD_HAS_BACKTRACE_SYMBOL=1 -DBACKWARD_HAS_BFD=0 -DBACKWARD_HAS_DW=0 -DBACKWARD_HAS_UNWIND=1 -DROSCONSOLE_BACKEND_LOG4CXX -DROS_BUILD_SHARED_LIBS=1 -DROS_PACKAGE_NAME="backward_ros" -I/local/robotpkg/var/tmp/robotpkg/wip/backward-ros/work/backward_ros-0.1.7/include -I/local/robotpkg/var/tmp/robotpkg/wip/backward-ros/work/backward_ros-0.1.7/cmake -isystem /opt/openrobots/include -isystem /opt/openrobots/share/xmlrpcpp/cmake/../../../include/xmlrpcpp -isystem /usr/pkg/include -pipe -O3 -DNDEBUG -Wall -Wextra -pedantic-errors -g -std=gnu++11 -o CMakeFiles/backward_object.dir/src/backward.cpp.o -c /local/robotpkg/var/tmp/robotpkg/wip/backward-ros/work/backward_ros-0.1.7/src/backward.cpp [ 66%] Building CXX object CMakeFiles/backward.dir/src/backward.cpp.o /usr/bin/g++ -DBACKWARD_HAS_BACKTRACE=0 -DBACKWARD_HAS_BACKTRACE_SYMBOL=1 -DBACKWARD_HAS_BFD=0 -DBACKWARD_HAS_DW=0 -DBACKWARD_HAS_UNWIND=1 -DROSCONSOLE_BACKEND_LOG4CXX -DROS_BUILD_SHARED_LIBS=1 -DROS_PACKAGE_NAME="backward_ros" -Dbackward_EXPORTS -I/local/robotpkg/var/tmp/robotpkg/wip/backward-ros/work/backward_ros-0.1.7/include -I/local/robotpkg/var/tmp/robotpkg/wip/backward-ros/work/backward_ros-0.1.7/cmake -isystem /opt/openrobots/include -isystem /opt/openrobots/share/xmlrpcpp/cmake/../../../include/xmlrpcpp -isystem /usr/pkg/include -pipe -O3 -DNDEBUG -Wall -Wextra -pedantic-errors -g -fPIC -std=gnu++11 -o CMakeFiles/backward.dir/src/backward.cpp.o -c /local/robotpkg/var/tmp/robotpkg/wip/backward-ros/work/backward_ros-0.1.7/src/backward.cpp In file included from /local/robotpkg/var/tmp/robotpkg/wip/backward-ros/work/backward_ros-0.1.7/src/backward.cpp:26:0: /local/robotpkg/var/tmp/robotpkg/wip/backward-ros/work/backward_ros-0.1.7/include/backward_ros/backward.hpp: In instantiation of '_Unwind_Reason_Code backward::details::Unwinder::backtrace(_Unwind_Context*) [with F = backward::StackTraceImpl::callback; _Unwind_Reason_Code = int]': /local/robotpkg/var/tmp/robotpkg/wip/backward-ros/work/backward_ros-0.1.7/include/backward_ros/backward.hpp:659:29: required from 'static _Unwind_Reason_Code backward::details::Unwinder::backtrace_trampoline(_Unwind_Context*, void*) [with F = backward::StackTraceImpl::callback; _Unwind_Reason_Code = int]' /local/robotpkg/var/tmp/robotpkg/wip/backward-ros/work/backward_ros-0.1.7/include/backward_ros/backward.hpp:648:28: required from 'size_t backward::details::Unwinder::operator()(F&, size_t) [with F = backward::StackTraceImpl::callback; size_t = long unsigned int]' /local/robotpkg/var/tmp/robotpkg/wip/backward-ros/work/backward_ros-0.1.7/include/backward_ros/backward.hpp:689:17: required from 'size_t backward::details::unwind(F, size_t) [with F = backward::StackTraceImpl::callback; size_t = long unsigned int]' /local/robotpkg/var/tmp/robotpkg/wip/backward-ros/work/backward_ros-0.1.7/include/backward_ros/backward.hpp:705:60: required from here /local/robotpkg/var/tmp/robotpkg/wip/backward-ros/work/backward_ros-0.1.7/include/backward_ros/backward.hpp:667:35: error: invalid conversion from '_Unwind_Ptr {aka void*}' to 'uintptr_t {aka long unsigned int}' [-fpermissive] uintptr_t ip = _Unwind_GetIPInfo(ctx, &ip_before_instruction); ~~~~~~~~~~~~~~~~~^~~~~~~~~~~~~~~~~~~~~~~~~~~~~ gmake[2]: Leaving directory '/local/robotpkg/var/tmp/robotpkg/wip/backward-ros/work/backward_ros-0.1.7' gmake[2]: *** [CMakeFiles/backward_object.dir/build.make:66: CMakeFiles/backward_object.dir/src/backward.cpp.o] Error 1 gmake[1]: *** [CMakeFiles/Makefile2:149: CMakeFiles/backward_object.dir/all] Error 2 gmake[1]: *** Waiting for unfinished jobs.... In file included from /local/robotpkg/var/tmp/robotpkg/wip/backward-ros/work/backward_ros-0.1.7/src/backward.cpp:26:0: /local/robotpkg/var/tmp/robotpkg/wip/backward-ros/work/backward_ros-0.1.7/include/backward_ros/backward.hpp: In instantiation of '_Unwind_Reason_Code backward::details::Unwinder::backtrace(_Unwind_Context*) [with F = backward::StackTraceImpl::callback; _Unwind_Reason_Code = int]': /local/robotpkg/var/tmp/robotpkg/wip/backward-ros/work/backward_ros-0.1.7/include/backward_ros/backward.hpp:659:29: required from 'static _Unwind_Reason_Code backward::details::Unwinder::backtrace_trampoline(_Unwind_Context*, void*) [with F = backward::StackTraceImpl::callback; _Unwind_Reason_Code = int]' /local/robotpkg/var/tmp/robotpkg/wip/backward-ros/work/backward_ros-0.1.7/include/backward_ros/backward.hpp:648:28: required from 'size_t backward::details::Unwinder::operator()(F&, size_t) [with F = backward::StackTraceImpl::callback; size_t = long unsigned int]' /local/robotpkg/var/tmp/robotpkg/wip/backward-ros/work/backward_ros-0.1.7/include/backward_ros/backward.hpp:689:17: required from 'size_t backward::details::unwind(F, size_t) [with F = backward::StackTraceImpl::callback; size_t = long unsigned int]' /local/robotpkg/var/tmp/robotpkg/wip/backward-ros/work/backward_ros-0.1.7/include/backward_ros/backward.hpp:705:60: required from here /local/robotpkg/var/tmp/robotpkg/wip/backward-ros/work/backward_ros-0.1.7/include/backward_ros/backward.hpp:667:35: error: invalid conversion from '_Unwind_Ptr {aka void*}' to 'uintptr_t {aka long unsigned int}' [-fpermissive] uintptr_t ip = _Unwind_GetIPInfo(ctx, &ip_before_instruction); ~~~~~~~~~~~~~~~~~^~~~~~~~~~~~~~~~~~~~~~~~~~~~~ gmake[2]: *** [CMakeFiles/backward.dir/build.make:66: CMakeFiles/backward.dir/src/backward.cpp.o] Error 1 gmake[1]: *** [CMakeFiles/Makefile2:338: CMakeFiles/backward.dir/all] Error 2 gmake: *** [Makefile:133: all] Error 2 gmake[2]: Leaving directory '/local/robotpkg/var/tmp/robotpkg/wip/backward-ros/work/backward_ros-0.1.7' gmake[1]: Leaving directory '/local/robotpkg/var/tmp/robotpkg/wip/backward-ros/work/backward_ros-0.1.7'