robotpkg/wip/antlr2 bulk build results

Log for antlr2-2.7.7 on Fedora-31-x86_64: autoconf.log (Back)

This file contains any messages produced by compilers while running configure, to aid debugging if configure makes a mistake. It was created by antlr configure 2.7.7, which was generated by GNU Autoconf 2.59. Invocation command line was $ ./configure --with-make=make --with-java=/usr/lib/jvm/java-1.8.0-openjdk-1.8.0.265.b01-1.fc31.x86_64/bin/java --with-jar=/usr/lib/jvm/java-1.8.0-openjdk-1.8.0.265.b01-1.fc31.x86_64/bin/jar --with-javac=/usr/lib/jvm/java-1.8.0-openjdk-1.8.0.265.b01-1.fc31.x86_64/bin/javac --with-pyhton=/usr/bin/python3.7 --disable-csharp --prefix=/opt/openrobots --infodir=/opt/openrobots/info --mandir=/opt/openrobots/man ## --------- ## ## Platform. ## ## --------- ## hostname = hydra64-fedora31 uname -m = x86_64 uname -r = 5.7.11-100.fc31.x86_64 uname -s = Linux uname -v = #1 SMP Wed Jul 29 18:17:53 UTC 2020 /usr/bin/uname -p = x86_64 /bin/uname -X = unknown /bin/arch = x86_64 /usr/bin/arch -k = unknown /usr/convex/getsysinfo = unknown hostinfo = unknown /bin/machine = unknown /usr/bin/oslevel = unknown /bin/universe = unknown PATH: /opt/openrobots/sbin PATH: /usr/local/sbin PATH: /usr/local/bin PATH: /usr/sbin PATH: /usr/bin ## ----------- ## ## Core tests. ## ## ----------- ## configure:2039: checking build system type configure:2057: result: x86_64-unknown-linux-gnu configure:2065: checking host system type configure:2079: result: x86_64-unknown-linux-gnu configure:2092: checking whether this is Cygwin configure:2099: result: no configure:2104: checking whether this is MinGW configure:2111: result: no configure:2138: checking for cygpath configure:2171: result: no configure:2206: checking for /bin/cp configure:2210: result: yes configure:2206: checking for /usr/bin/cp configure:2210: result: yes configure:2227: checking for cp configure:2229: result: /usr/bin/cp configure:2271: checking for /bin/echo configure:2275: result: yes configure:2271: checking for /usr/bin/echo configure:2275: result: yes configure:2292: checking for echo configure:2294: result: /usr/bin/echo configure:2336: checking for /bin/find configure:2340: result: yes configure:2336: checking for /usr/bin/find configure:2340: result: yes configure:2357: checking for find configure:2359: result: /usr/bin/find configure:2454: checking for make configure:2456: result: /usr/bin/make configure:2529: checking for make configure:2547: found /usr/bin/make configure:2559: result: /usr/bin/make configure:2613: checking for /usr/lib/jvm/java-1.8.0-openjdk-1.8.0.265.b01-1.fc31.x86_64/bin/java configure:2617: result: yes configure:2698: checking for /usr/lib/jvm/java-1.8.0-openjdk-1.8.0.265.b01-1.fc31.x86_64/bin/javac configure:2702: result: yes configure:2783: checking for /usr/lib/jvm/java-1.8.0-openjdk-1.8.0.265.b01-1.fc31.x86_64/bin/jar configure:2787: result: yes configure:3038: checking for tlib configure:3040: result: no configure:3038: checking for lib configure:3040: result: no configure:3029: checking for ar configure:3031: result: /usr/bin/ar configure:3008: checking for /usr/bin/ar configure:3012: result: yes configure:3180: checking for C++ compiler version configure:3183: /usr/bin/g++ --version &5 g++ (GCC) 9.3.1 20200408 (Red Hat 9.3.1-2) Copyright (C) 2019 Free Software Foundation, Inc. This is free software; see the source for copying conditions. There is NO warranty; not even for MERCHANTABILITY or FITNESS FOR A PARTICULAR PURPOSE. configure:3186: $? = 0 configure:3188: /usr/bin/g++ -v &5 Using built-in specs. COLLECT_GCC=/usr/bin/g++ COLLECT_LTO_WRAPPER=/usr/libexec/gcc/x86_64-redhat-linux/9/lto-wrapper OFFLOAD_TARGET_NAMES=nvptx-none OFFLOAD_TARGET_DEFAULT=1 Target: x86_64-redhat-linux Configured with: ../configure --enable-bootstrap --enable-languages=c,c++,fortran,objc,obj-c++,ada,go,d,lto --prefix=/usr --mandir=/usr/share/man --infodir=/usr/share/info --with-bugurl=http://bugzilla.redhat.com/bugzilla --enable-shared --enable-threads=posix --enable-checking=release --enable-multilib --with-system-zlib --enable-__cxa_atexit --disable-libunwind-exceptions --enable-gnu-unique-object --enable-linker-build-id --with-gcc-major-version-only --with-linker-hash-style=gnu --enable-plugin --enable-initfini-array --with-isl --enable-offload-targets=nvptx-none --without-cuda-driver --enable-gnu-indirect-function --enable-cet --with-tune=generic --with-arch_32=i686 --build=x86_64-redhat-linux Thread model: posix gcc version 9.3.1 20200408 (Red Hat 9.3.1-2) (GCC) configure:3191: $? = 0 configure:3193: /usr/bin/g++ -V &5 g++: error: unrecognized command line option '-V' g++: fatal error: no input files compilation terminated. configure:3196: $? = 1 configure:3219: checking for C++ compiler default output file name configure:3222: /usr/bin/g++ -pipe -O3 -DNDEBUG conftest.cc >&5 configure:3225: $? = 0 configure:3271: result: a.out configure:3276: checking whether the C++ compiler works configure:3282: ./a.out configure:3285: $? = 0 configure:3302: result: yes configure:3309: checking whether we are cross compiling configure:3311: result: no configure:3314: checking for suffix of executables configure:3316: /usr/bin/g++ -o conftest -pipe -O3 -DNDEBUG conftest.cc >&5 configure:3319: $? = 0 configure:3344: result: configure:3350: checking for suffix of object files configure:3371: /usr/bin/g++ -c -pipe -O3 -DNDEBUG conftest.cc >&5 configure:3374: $? = 0 configure:3396: result: o configure:3400: checking whether we are using the GNU C++ compiler configure:3424: /usr/bin/g++ -c -pipe -O3 -DNDEBUG conftest.cc >&5 configure:3430: $? = 0 configure:3434: test -z || test ! -s conftest.err configure:3437: $? = 0 configure:3440: test -s conftest.o configure:3443: $? = 0 configure:3456: result: yes configure:3462: checking whether /usr/bin/g++ accepts -g configure:3483: /usr/bin/g++ -c -g conftest.cc >&5 configure:3489: $? = 0 configure:3493: test -z || test ! -s conftest.err configure:3496: $? = 0 configure:3499: test -s conftest.o configure:3502: $? = 0 configure:3513: result: yes configure:3555: /usr/bin/g++ -c -pipe -O3 -DNDEBUG conftest.cc >&5 configure:3561: $? = 0 configure:3565: test -z || test ! -s conftest.err configure:3568: $? = 0 configure:3571: test -s conftest.o configure:3574: $? = 0 configure:3600: /usr/bin/g++ -c -pipe -O3 -DNDEBUG conftest.cc >&5 conftest.cc: In function 'int main()': conftest.cc:13:1: error: 'exit' was not declared in this scope 13 | exit (42); | ^~~~ configure:3606: $? = 1 configure: failed program was: | /* confdefs.h. */ | | #define PACKAGE_NAME "antlr" | #define PACKAGE_TARNAME "antlr" | #define PACKAGE_VERSION "2.7.7" | #define PACKAGE_STRING "antlr 2.7.7" | #define PACKAGE_BUGREPORT "" | /* end confdefs.h. */ | | int | main () | { | exit (42); | ; | return 0; | } configure:3555: /usr/bin/g++ -c -pipe -O3 -DNDEBUG conftest.cc >&5 configure:3561: $? = 0 configure:3565: test -z || test ! -s conftest.err configure:3568: $? = 0 configure:3571: test -s conftest.o configure:3574: $? = 0 configure:3600: /usr/bin/g++ -c -pipe -O3 -DNDEBUG conftest.cc >&5 configure:3606: $? = 0 configure:3610: test -z || test ! -s conftest.err configure:3613: $? = 0 configure:3616: test -s conftest.o configure:3619: $? = 0 configure:3741: checking for C compiler version configure:3744: /usr/bin/gcc --version &5 gcc (GCC) 9.3.1 20200408 (Red Hat 9.3.1-2) Copyright (C) 2019 Free Software Foundation, Inc. This is free software; see the source for copying conditions. There is NO warranty; not even for MERCHANTABILITY or FITNESS FOR A PARTICULAR PURPOSE. configure:3747: $? = 0 configure:3749: /usr/bin/gcc -v &5 Using built-in specs. COLLECT_GCC=/usr/bin/gcc COLLECT_LTO_WRAPPER=/usr/libexec/gcc/x86_64-redhat-linux/9/lto-wrapper OFFLOAD_TARGET_NAMES=nvptx-none OFFLOAD_TARGET_DEFAULT=1 Target: x86_64-redhat-linux Configured with: ../configure --enable-bootstrap --enable-languages=c,c++,fortran,objc,obj-c++,ada,go,d,lto --prefix=/usr --mandir=/usr/share/man --infodir=/usr/share/info --with-bugurl=http://bugzilla.redhat.com/bugzilla --enable-shared --enable-threads=posix --enable-checking=release --enable-multilib --with-system-zlib --enable-__cxa_atexit --disable-libunwind-exceptions --enable-gnu-unique-object --enable-linker-build-id --with-gcc-major-version-only --with-linker-hash-style=gnu --enable-plugin --enable-initfini-array --with-isl --enable-offload-targets=nvptx-none --without-cuda-driver --enable-gnu-indirect-function --enable-cet --with-tune=generic --with-arch_32=i686 --build=x86_64-redhat-linux Thread model: posix gcc version 9.3.1 20200408 (Red Hat 9.3.1-2) (GCC) configure:3752: $? = 0 configure:3754: /usr/bin/gcc -V &5 gcc: error: unrecognized command line option '-V' gcc: fatal error: no input files compilation terminated. configure:3757: $? = 1 configure:3760: checking whether we are using the GNU C compiler configure:3784: /usr/bin/gcc -c -pipe -O3 -DNDEBUG conftest.c >&5 configure:3790: $? = 0 configure:3794: test -z || test ! -s conftest.err configure:3797: $? = 0 configure:3800: test -s conftest.o configure:3803: $? = 0 configure:3816: result: yes configure:3822: checking whether /usr/bin/gcc accepts -g configure:3843: /usr/bin/gcc -c -g conftest.c >&5 configure:3849: $? = 0 configure:3853: test -z || test ! -s conftest.err configure:3856: $? = 0 configure:3859: test -s conftest.o configure:3862: $? = 0 configure:3873: result: yes configure:3890: checking for /usr/bin/gcc option to accept ANSI C configure:3960: /usr/bin/gcc -c -pipe -O3 -DNDEBUG conftest.c >&5 configure:3966: $? = 0 configure:3970: test -z || test ! -s conftest.err configure:3973: $? = 0 configure:3976: test -s conftest.o configure:3979: $? = 0 configure:3997: result: none needed configure:4015: /usr/bin/gcc -c -pipe -O3 -DNDEBUG conftest.c >&5 conftest.c:2:3: error: unknown type name 'choke' 2 | choke me | ^~~~~ conftest.c:2:3: error: expected '=', ',', ';', 'asm' or '__attribute__' at end of input configure:4021: $? = 1 configure: failed program was: | #ifndef __cplusplus | choke me | #endif configure:4325: checking how to run the C preprocessor configure:4443: result: /usr/bin/gcc -E configure:4467: /usr/bin/gcc -E conftest.c configure:4473: $? = 0 configure:4505: /usr/bin/gcc -E conftest.c conftest.c:12:10: fatal error: ac_nonexistent.h: No such file or directory 12 | #include | ^~~~~~~~~~~~~~~~~~ compilation terminated. configure:4511: $? = 1 configure: failed program was: | /* confdefs.h. */ | | #define PACKAGE_NAME "antlr" | #define PACKAGE_TARNAME "antlr" | #define PACKAGE_VERSION "2.7.7" | #define PACKAGE_STRING "antlr 2.7.7" | #define PACKAGE_BUGREPORT "" | #ifdef __cplusplus | extern "C" void std::exit (int) throw (); using std::exit; | #endif | /* end confdefs.h. */ | #include configure:4555: checking for egrep configure:4565: result: grep -E configure:4570: checking for ANSI C header files configure:4595: /usr/bin/gcc -c -pipe -O3 -DNDEBUG conftest.c >&5 configure:4601: $? = 0 configure:4605: test -z || test ! -s conftest.err configure:4608: $? = 0 configure:4611: test -s conftest.o configure:4614: $? = 0 configure:4703: /usr/bin/gcc -o conftest -pipe -O3 -DNDEBUG conftest.c >&5 conftest.c: In function 'main': conftest.c:29:7: warning: implicit declaration of function 'exit' [-Wimplicit-function-declaration] 29 | exit(2); | ^~~~ conftest.c:29:7: warning: incompatible implicit declaration of built-in function 'exit' conftest.c:13:1: note: include '' or provide a declaration of 'exit' 12 | #include +++ |+#include 13 | #if ((' ' & 0x0FF) == 0x020) conftest.c:30:3: warning: incompatible implicit declaration of built-in function 'exit' 30 | exit (0); | ^~~~ conftest.c:30:3: note: include '' or provide a declaration of 'exit' configure:4706: $? = 0 configure:4708: ./conftest configure:4711: $? = 0 configure:4726: result: yes configure:4750: checking for sys/types.h configure:4766: /usr/bin/gcc -c -pipe -O3 -DNDEBUG conftest.c >&5 configure:4772: $? = 0 configure:4776: test -z || test ! -s conftest.err configure:4779: $? = 0 configure:4782: test -s conftest.o configure:4785: $? = 0 configure:4796: result: yes configure:4750: checking for sys/stat.h configure:4766: /usr/bin/gcc -c -pipe -O3 -DNDEBUG conftest.c >&5 configure:4772: $? = 0 configure:4776: test -z || test ! -s conftest.err configure:4779: $? = 0 configure:4782: test -s conftest.o configure:4785: $? = 0 configure:4796: result: yes configure:4750: checking for stdlib.h configure:4766: /usr/bin/gcc -c -pipe -O3 -DNDEBUG conftest.c >&5 configure:4772: $? = 0 configure:4776: test -z || test ! -s conftest.err configure:4779: $? = 0 configure:4782: test -s conftest.o configure:4785: $? = 0 configure:4796: result: yes configure:4750: checking for string.h configure:4766: /usr/bin/gcc -c -pipe -O3 -DNDEBUG conftest.c >&5 configure:4772: $? = 0 configure:4776: test -z || test ! -s conftest.err configure:4779: $? = 0 configure:4782: test -s conftest.o configure:4785: $? = 0 configure:4796: result: yes configure:4750: checking for memory.h configure:4766: /usr/bin/gcc -c -pipe -O3 -DNDEBUG conftest.c >&5 configure:4772: $? = 0 configure:4776: test -z || test ! -s conftest.err configure:4779: $? = 0 configure:4782: test -s conftest.o configure:4785: $? = 0 configure:4796: result: yes configure:4750: checking for strings.h configure:4766: /usr/bin/gcc -c -pipe -O3 -DNDEBUG conftest.c >&5 configure:4772: $? = 0 configure:4776: test -z || test ! -s conftest.err configure:4779: $? = 0 configure:4782: test -s conftest.o configure:4785: $? = 0 configure:4796: result: yes configure:4750: checking for inttypes.h configure:4766: /usr/bin/gcc -c -pipe -O3 -DNDEBUG conftest.c >&5 configure:4772: $? = 0 configure:4776: test -z || test ! -s conftest.err configure:4779: $? = 0 configure:4782: test -s conftest.o configure:4785: $? = 0 configure:4796: result: yes configure:4750: checking for stdint.h configure:4766: /usr/bin/gcc -c -pipe -O3 -DNDEBUG conftest.c >&5 configure:4772: $? = 0 configure:4776: test -z || test ! -s conftest.err configure:4779: $? = 0 configure:4782: test -s conftest.o configure:4785: $? = 0 configure:4796: result: yes configure:4750: checking for unistd.h configure:4766: /usr/bin/gcc -c -pipe -O3 -DNDEBUG conftest.c >&5 configure:4772: $? = 0 configure:4776: test -z || test ! -s conftest.err configure:4779: $? = 0 configure:4782: test -s conftest.o configure:4785: $? = 0 configure:4796: result: yes configure:4814: checking for stdlib.h configure:4819: result: yes configure:4814: checking for unistd.h configure:4819: result: yes configure:4961: checking for an ANSI C-conforming const configure:5028: /usr/bin/gcc -c -pipe -O3 -DNDEBUG conftest.c >&5 configure:5034: $? = 0 configure:5038: test -z || test ! -s conftest.err configure:5041: $? = 0 configure:5044: test -s conftest.o configure:5047: $? = 0 configure:5058: result: yes configure:5068: checking for inline configure:5089: /usr/bin/gcc -c -pipe -O3 -DNDEBUG conftest.c >&5 configure:5095: $? = 0 configure:5099: test -z || test ! -s conftest.err configure:5102: $? = 0 configure:5105: test -s conftest.o configure:5108: $? = 0 configure:5120: result: inline configure:5146: checking for stdlib.h configure:5151: result: yes configure:5291: checking for GNU libc compatible malloc configure:5320: /usr/bin/gcc -o conftest -pipe -O3 -DNDEBUG conftest.c >&5 configure:5323: $? = 0 configure:5325: ./conftest configure:5328: $? = 0 configure:5342: result: yes configure:5376: checking for strcasecmp configure:5433: /usr/bin/gcc -o conftest -pipe -O3 -DNDEBUG conftest.c >&5 conftest.c:50:6: warning: conflicting types for built-in function 'strcasecmp'; expected 'int(const char *, const char *)' [-Wbuiltin-declaration-mismatch] 50 | char strcasecmp (); | ^~~~~~~~~~ configure:5439: $? = 0 configure:5443: test -z || test ! -s conftest.err configure:5446: $? = 0 configure:5449: test -s conftest configure:5452: $? = 0 configure:5464: result: yes configure:5483: checking for doxygen configure:5501: found /usr/bin/doxygen configure:5514: result: /usr/bin/doxygen configure:5538: checking for a BSD-compatible install configure:5593: result: /usr/bin/install -c configure:5645: checking for ranlib configure:5661: found /usr/bin/ranlib configure:5672: result: ranlib configure:5687: checking for mkdir configure:5705: found /usr/bin/mkdir configure:5718: result: /usr/bin/mkdir configure:5727: checking for rm configure:5745: found /usr/bin/rm configure:5758: result: /usr/bin/rm configure:5780: checking for /usr/bin/tar configure:5784: result: yes configure:5851: checking for /bin/touch configure:5855: result: yes configure:5851: checking for /usr/bin/touch configure:5855: result: yes configure:5872: checking for touch configure:5874: result: /usr/bin/touch configure:5910: checking for chmod configure:5928: found /usr/bin/chmod configure:5941: result: /usr/bin/chmod configure:5950: checking for sed configure:5968: found /usr/bin/sed configure:5981: result: /usr/bin/sed configure:5990: checking for cat configure:6008: found /usr/bin/cat configure:6021: result: /usr/bin/cat configure:6030: checking for grep configure:6048: found /usr/bin/grep configure:6061: result: /usr/bin/grep configure:6094: checking for /usr/bin/python3.7 configure:6098: result: yes configure:6931: creating ./config.status ## ---------------------- ## ## Running config.status. ## ## ---------------------- ## This file was extended by antlr config.status 2.7.7, which was generated by GNU Autoconf 2.59. Invocation command line was CONFIG_FILES = CONFIG_HEADERS = CONFIG_LINKS = CONFIG_COMMANDS = $ ./config.status on hydra64-fedora31 config.status:885: creating scripts/config.vars config.status:885: creating scripts/config.deps config.status:885: creating scripts/config.make config.status:885: creating antlr/Version.java config.status:885: creating scripts/python.sh config.status:885: creating scripts/pyantlr.sh config.status:885: creating lib/python/Makefile config.status:885: creating examples/python/Makefile config.status:885: creating examples/python/asn1/Makefile config.status:885: creating examples/python/ASTsupport/Makefile config.status:885: creating examples/python/calc/Makefile config.status:885: creating examples/python/columns/Makefile config.status:885: creating examples/python/exprAST/Makefile config.status:885: creating examples/python/filter/Makefile config.status:885: creating examples/python/filterWithRule/Makefile config.status:885: creating examples/python/heteroAST/Makefile config.status:885: creating examples/python/HTML/Makefile config.status:885: creating examples/python/IDL/Makefile config.status:885: creating examples/python/imagNodeAST/Makefile config.status:885: creating examples/python/includeFile/Makefile config.status:885: creating examples/python/inherit.tinyc/Makefile config.status:885: creating examples/python/java/Makefile config.status:885: creating examples/python/lexerTester/Makefile config.status:885: creating examples/python/lexRewrite/Makefile config.status:885: creating examples/python/linkChecker/Makefile config.status:885: creating examples/python/multiLexer/Makefile config.status:885: creating examples/python/multiParser/Makefile config.status:885: creating examples/python/parseBinary/Makefile config.status:885: creating examples/python/pascal/Makefile config.status:885: creating examples/python/cpp/Makefile config.status:885: creating examples/python/preserveWhiteSpace/Makefile config.status:885: creating examples/python/tinybasic/Makefile config.status:885: creating examples/python/tinyc/Makefile config.status:885: creating examples/python/transform/Makefile config.status:885: creating examples/python/treewalk/Makefile config.status:885: creating examples/python/unicode/Makefile config.status:885: creating examples/python/unicode.IDENTs/Makefile config.status:885: creating examples/python/xml/Makefile config.status:885: creating scripts/java.sh config.status:885: creating scripts/jar.sh config.status:885: creating scripts/javac.sh config.status:885: creating scripts/antlr.sh config.status:885: creating scripts/cxx.sh config.status:885: creating scripts/link.sh config.status:885: creating scripts/c.sh config.status:885: creating scripts/lib.sh config.status:885: creating scripts/cpp.sh config.status:885: creating lib/cpp/Makefile config.status:885: creating lib/cpp/antlr/Makefile config.status:885: creating lib/cpp/src/Makefile config.status:885: creating examples/cpp/Makefile config.status:885: creating examples/cpp/ASTsupport/Makefile config.status:885: creating examples/cpp/calc/Makefile config.status:885: creating examples/cpp/exprAST/Makefile config.status:885: creating examples/cpp/filter/Makefile config.status:885: creating examples/cpp/filterWithRule/Makefile config.status:885: creating examples/cpp/flexLexer/Makefile config.status:885: creating examples/cpp/HTML/Makefile config.status:885: creating examples/cpp/heteroAST/Makefile config.status:885: creating examples/cpp/IDL/Makefile config.status:885: creating examples/cpp/imagNodeAST/Makefile config.status:885: creating examples/cpp/includeFile/Makefile config.status:885: creating examples/cpp/inherit.tinyc/Makefile config.status:885: creating examples/cpp/java/Makefile config.status:885: creating examples/cpp/lexRewrite/Makefile config.status:885: creating examples/cpp/multiLexer/Makefile config.status:885: creating examples/cpp/multiParser/Makefile config.status:885: creating examples/cpp/parseBinary/Makefile config.status:885: creating examples/cpp/preserveWhiteSpace/Makefile config.status:885: creating examples/cpp/tinyc/Makefile config.status:885: creating examples/cpp/tokenStreamRewrite/Makefile config.status:885: creating examples/cpp/transform/Makefile config.status:885: creating examples/cpp/treewalk/Makefile config.status:885: creating examples/cpp/unicode/Makefile config.status:885: creating lib/Makefile config.status:885: creating examples/Makefile config.status:885: creating doc/Makefile config.status:885: creating Makefile config.status:885: creating scripts/antlr-config config.status:885: creating scripts/run-antlr config.status:885: creating scripts/antlr.spec config.status:885: creating antlr/Makefile config.status:885: creating examples/java/ASTsupport/Makefile config.status:885: creating examples/java/HTML/Makefile config.status:885: creating examples/java/IDL/Makefile config.status:885: creating examples/java/calc/Makefile config.status:885: creating examples/java/columns/Makefile config.status:885: creating examples/java/exprAST/Makefile config.status:885: creating examples/java/filter/Makefile config.status:885: creating examples/java/filterWithRule/Makefile config.status:885: creating examples/java/heteroAST/Makefile config.status:885: creating examples/java/imagNodeAST/Makefile config.status:885: creating examples/java/includeFile/Makefile config.status:885: creating examples/java/inherit.tinyc/Makefile config.status:885: creating examples/java/java/Makefile config.status:885: creating examples/java/lexRewrite/Makefile config.status:885: creating examples/java/linkChecker/Makefile config.status:885: creating examples/java/multiLexer/Makefile config.status:885: creating examples/java/parseBinary/Makefile config.status:885: creating examples/java/pascal/Makefile config.status:885: creating examples/java/preserveWhiteSpace/Makefile config.status:885: creating examples/java/tinybasic/Makefile config.status:885: creating examples/java/tinyc/Makefile config.status:885: creating examples/java/transform/Makefile config.status:885: creating examples/java/treewalk/Makefile config.status:885: creating examples/java/unicode.IDENTs/Makefile config.status:885: creating examples/java/unicode/Makefile config.status:885: creating examples/java/xml/Makefile config.status:885: creating examples/java/Makefile config.status:885: creating examples/java/cpp/Makefile config.status:1086: executing notice commands config.status:1102: --------------------------------------------------------- * WARNING * This package has been configured to be build by using /usr/bin/make It is very likely that just running "make" from the command line will fail. Please remember therefore to use the configured version. ========================================================= ## ---------------- ## ## Cache variables. ## ## ---------------- ## ac_cv_build=x86_64-unknown-linux-gnu ac_cv_build_alias=x86_64-unknown-linux-gnu ac_cv_c_compiler_gnu=yes ac_cv_c_const=yes ac_cv_c_inline=inline ac_cv_cxx_compiler_gnu=yes ac_cv_env_ANTLRFLAGS_set= ac_cv_env_ANTLRFLAGS_value= ac_cv_env_CC_set=set ac_cv_env_CC_value=/usr/bin/gcc ac_cv_env_CFLAGS_set=set ac_cv_env_CFLAGS_value='-pipe -O3 -DNDEBUG' ac_cv_env_CPPFLAGS_set=set ac_cv_env_CPPFLAGS_value= ac_cv_env_CPP_set=set ac_cv_env_CPP_value='/usr/bin/gcc -E' ac_cv_env_CSHARPCFLAGS_set= ac_cv_env_CSHARPCFLAGS_value= ac_cv_env_CSHARPC_set= ac_cv_env_CSHARPC_value= ac_cv_env_CXXFLAGS_set=set ac_cv_env_CXXFLAGS_value='-pipe -O3 -DNDEBUG' ac_cv_env_CXX_set=set ac_cv_env_CXX_value=/usr/bin/g++ ac_cv_env_JAVACFLAGS_set= ac_cv_env_JAVACFLAGS_value= ac_cv_env_JAVAC_set=set ac_cv_env_JAVAC_value=/usr/lib/jvm/java-1.8.0-openjdk-1.8.0.265.b01-1.fc31.x86_64/bin/javac ac_cv_env_JAVAFLAGS_set= ac_cv_env_JAVAFLAGS_value= ac_cv_env_JAVA_set=set ac_cv_env_JAVA_value=/usr/lib/jvm/java-1.8.0-openjdk-1.8.0.265.b01-1.fc31.x86_64/bin/java ac_cv_env_LDFLAGS_set=set ac_cv_env_LDFLAGS_value= ac_cv_env_MAKE_set= ac_cv_env_MAKE_value= ac_cv_env_PYTHONFLAGS_set= ac_cv_env_PYTHONFLAGS_value= ac_cv_env_PYTHON_set=set ac_cv_env_PYTHON_value=/usr/bin/python3.7 ac_cv_env_build_alias_set= ac_cv_env_build_alias_value= ac_cv_env_host_alias_set= ac_cv_env_host_alias_value= ac_cv_env_target_alias_set= ac_cv_env_target_alias_value= ac_cv_exeext= ac_cv_func_malloc_0_nonnull=yes ac_cv_func_strcasecmp=yes ac_cv_header_inttypes_h=yes ac_cv_header_memory_h=yes ac_cv_header_stdc=yes ac_cv_header_stdint_h=yes ac_cv_header_stdlib_h=yes ac_cv_header_string_h=yes ac_cv_header_strings_h=yes ac_cv_header_sys_stat_h=yes ac_cv_header_sys_types_h=yes ac_cv_header_unistd_h=yes ac_cv_host=x86_64-unknown-linux-gnu ac_cv_host_alias=x86_64-unknown-linux-gnu ac_cv_objext=o ac_cv_path_CAT=/usr/bin/cat ac_cv_path_CHMOD=/usr/bin/chmod ac_cv_path_DOXYGEN=/usr/bin/doxygen ac_cv_path_GREP=/usr/bin/grep ac_cv_path_MKDIR=/usr/bin/mkdir ac_cv_path_RM=/usr/bin/rm ac_cv_path_SED=/usr/bin/sed ac_cv_path_install='/usr/bin/install -c' ac_cv_path_just_make=/usr/bin/make ac_cv_prog_CPP='/usr/bin/gcc -E' ac_cv_prog_ac_ct_RANLIB=ranlib ac_cv_prog_cc_g=yes ac_cv_prog_cc_stdc= ac_cv_prog_cxx_g=yes ac_cv_prog_egrep='grep -E' ## ----------------- ## ## Output variables. ## ## ----------------- ## ANTLR='' ANTLRFLAGS='' ANTLR_ACTION_FILES=' actions/cpp/ActionLexer.java actions/cpp/ActionLexerTokenTypes.java actions/csharp/ActionLexer.java actions/csharp/ActionLexerTokenTypes.java actions/java/ActionLexer.java actions/java/ActionLexerTokenTypes.java actions/python/ActionLexer.java actions/python/ActionLexerTokenTypes.java actions/python/CodeLexer.java actions/python/CodeLexerTokenTypes.java' ANTLR_ANTLR_FILES=' ANTLRParser.java ANTLRTokenTypes.java ANTLRLexer.java' ANTLR_COMPILE_CMD='/bin/sh /local/robotpkg/var/tmp/robotpkg/wip/antlr2/work/antlr-2.7.7/scripts/antlr.sh' ANTLR_CYGWIN='no' ANTLR_JAR='/local/robotpkg/var/tmp/robotpkg/wip/antlr2/work/antlr-2.7.7/antlr/antlr.jar' ANTLR_LIB='/local/robotpkg/var/tmp/robotpkg/wip/antlr2/work/antlr-2.7.7/lib/cpp/src/libantlr.a' ANTLR_MINGW='no' ANTLR_NET='/local/robotpkg/var/tmp/robotpkg/wip/antlr2/work/antlr-2.7.7/lib/antlr.runtime.dll' ANTLR_PY='/local/robotpkg/var/tmp/robotpkg/wip/antlr2/work/antlr-2.7.7/lib/python/antlr/python.py' ANTLR_TOKDEF_FILES=' ANTLRTokdefParser.java ANTLRTokdefLexer.java ANTLRTokdefParserTokenTypes.java' ANTLR_WIN32='' ANTLR_WITH_ANTLR_CMD='' ANTLR_WITH_ANTLR_JAR='' APTC='true' AR='/usr/bin/ar' ARFLAGS='' AS='' ASTFRAME_NET='/local/robotpkg/var/tmp/robotpkg/wip/antlr2/work/antlr-2.7.7/lib/antlr.astframe.dll' BOOTCLASSPATH='' CAT='/usr/bin/cat' CC='/usr/bin/gcc' CFLAGS='-pipe -O3 -DNDEBUG' CHMOD='/usr/bin/chmod' CLR='' CP='/bin/cp' CPP='/usr/bin/gcc -E' CPPFLAGS='' CSHARPC='' CSHARPCFLAGS='' CSHARP_COMPILE_CMD='/bin/sh /local/robotpkg/var/tmp/robotpkg/wip/antlr2/work/antlr-2.7.7/scripts/csc.sh' CXX='/usr/bin/g++' CXXFLAGS='' CXX_COMPILE_CMD='/bin/sh /local/robotpkg/var/tmp/robotpkg/wip/antlr2/work/antlr-2.7.7/scripts/cxx.sh' CXX_LIB_CMD='/bin/sh /local/robotpkg/var/tmp/robotpkg/wip/antlr2/work/antlr-2.7.7/scripts/lib.sh' CXX_LINK_CMD='/bin/sh /local/robotpkg/var/tmp/robotpkg/wip/antlr2/work/antlr-2.7.7/scripts/link.sh' CYGPATH='' CYGPATH_M='echo' CYGPATH_W='echo' C_COMPILE_CMD='/bin/sh /local/robotpkg/var/tmp/robotpkg/wip/antlr2/work/antlr-2.7.7/scripts/c.sh' DEBUG='0' DEFS='-DPACKAGE_NAME=\"antlr\" -DPACKAGE_TARNAME=\"antlr\" -DPACKAGE_VERSION=\"2.7.7\" -DPACKAGE_STRING=\"antlr\ 2.7.7\" -DPACKAGE_BUGREPORT=\"\" -DSTDC_HEADERS=1 -DHAVE_SYS_TYPES_H=1 -DHAVE_SYS_STAT_H=1 -DHAVE_STDLIB_H=1 -DHAVE_STRING_H=1 -DHAVE_MEMORY_H=1 -DHAVE_STRINGS_H=1 -DHAVE_INTTYPES_H=1 -DHAVE_STDINT_H=1 -DHAVE_UNISTD_H=1 -DHAVE_STDLIB_H=1 -DHAVE_UNISTD_H=1 -DHAVE_STDLIB_H=1 -DHAVE_MALLOC=1 -DHAVE_STRCASECMP=1 ' DOXYGEN='/usr/bin/doxygen' ECHO='/bin/echo' ECHO_C='' ECHO_N='-n' ECHO_T='' EGREP='grep -E' EXEEXT='' FIND='/bin/find' GREP='/usr/bin/grep' INSTALL_DATA='${INSTALL} -m 644' INSTALL_PROGRAM='${INSTALL}' INSTALL_SCRIPT='${INSTALL}' JAR='/usr/lib/jvm/java-1.8.0-openjdk-1.8.0.265.b01-1.fc31.x86_64/bin/jar' JARFLAGS='' JAR_CMD='/bin/sh /local/robotpkg/var/tmp/robotpkg/wip/antlr2/work/antlr-2.7.7/scripts/jar.sh' JAVA='/usr/lib/jvm/java-1.8.0-openjdk-1.8.0.265.b01-1.fc31.x86_64/bin/java' JAVAC='/usr/lib/jvm/java-1.8.0-openjdk-1.8.0.265.b01-1.fc31.x86_64/bin/javac' JAVACFLAGS='' JAVAFLAGS='' JAVA_CMD='/bin/sh /local/robotpkg/var/tmp/robotpkg/wip/antlr2/work/antlr-2.7.7/scripts/java.sh' JAVA_COMPILE_CMD='/bin/sh /local/robotpkg/var/tmp/robotpkg/wip/antlr2/work/antlr-2.7.7/scripts/javac.sh' KEYFILE='' LDFLAGS='' LIBEXT='.a' LIBOBJS='' LIBS='' LTLIBOBJS='' MAKE=' /usr/bin/make' MKDIR='/usr/bin/mkdir' OBJEXT='.o' PACKAGE_BUGREPORT='' PACKAGE_NAME='antlr' PACKAGE_STRING='antlr 2.7.7' PACKAGE_TARNAME='antlr' PACKAGE_VERSION='2.7.7' PATCHLEVEL='7' PATH_SEPARATOR=':' PYTHON='/usr/bin/python3.7' PYTHONFLAGS='' RANLIB='ranlib' RM='/usr/bin/rm' RMF='/usr/bin/rm -r -f' SED='/usr/bin/sed' SHELL='/bin/sh' STRONGNAME='false' SUBVERSION='7' TAR='/usr/bin/tar' TIMESTAMP='20200814' TOUCH='/bin/touch' VERBOSE='0' VERSION='2' WITH_EXAMPLES='1' abs_this_builddir='/local/robotpkg/var/tmp/robotpkg/wip/antlr2/work/antlr-2.7.7' ac_ct_CC='' ac_ct_CXX='' ac_ct_RANLIB='ranlib' antlr_jar='antlr.jar' antlr_lib='libantlr.a' antlr_net='antlr.runtime.dll' antlr_py='python.py' astframe_net='antlr.astframe.dll' bindir='${exec_prefix}/bin' build='x86_64-unknown-linux-gnu' build_alias='' build_cpu='x86_64' build_os='linux-gnu' build_vendor='unknown' cxx='gcc' datadir='${prefix}/share' exec_prefix='${prefix}' host='x86_64-unknown-linux-gnu' host_alias='' host_cpu='x86_64' host_os='linux-gnu' host_vendor='unknown' includedir='${prefix}/include' infodir='/opt/openrobots/info' jar='jar' java='' javac='javac' just_make='/usr/bin/make' libdir='${exec_prefix}/lib' libexecdir='${exec_prefix}/libexec' localstatedir='${prefix}/var' mandir='/opt/openrobots/man' oldincludedir='/usr/include' prefix='/opt/openrobots' program_transform_name='s,x,x,' sbindir='${exec_prefix}/sbin' sharedstatedir='${prefix}/com' sysconfdir='${prefix}/etc' target_alias='' ## ------------- ## ## Output files. ## ## ------------- ## stddeps='scripts/config.deps' stdmake='scripts/config.make' stdvars='scripts/config.vars' ## ----------- ## ## confdefs.h. ## ## ----------- ## #define HAVE_INTTYPES_H 1 #define HAVE_MALLOC 1 #define HAVE_MEMORY_H 1 #define HAVE_STDINT_H 1 #define HAVE_STDLIB_H 1 #define HAVE_STDLIB_H 1 #define HAVE_STDLIB_H 1 #define HAVE_STRCASECMP 1 #define HAVE_STRINGS_H 1 #define HAVE_STRING_H 1 #define HAVE_SYS_STAT_H 1 #define HAVE_SYS_TYPES_H 1 #define HAVE_UNISTD_H 1 #define HAVE_UNISTD_H 1 #define PACKAGE_BUGREPORT "" #define PACKAGE_NAME "antlr" #define PACKAGE_STRING "antlr 2.7.7" #define PACKAGE_TARNAME "antlr" #define PACKAGE_VERSION "2.7.7" #define STDC_HEADERS 1 #endif #ifdef __cplusplus extern "C" void std::exit (int) throw (); using std::exit; configure: exit 0