robotpkg/wip/MPC bulk build results

Log for MPC-1.0r2 on Fedora-27-x86_64: bulk.log (Back)

=> Checking for clear installation ===> Installing bootstrap dependencies for MPC-1.0r2 => Installing digest-20080510.tgz => Installing tnftp-20130505~ssl.tgz ===> Checking bootstrap dependencies for MPC-1.0r2 => Required robotpkg package digest>=20080510: digest-20080510 found => Required robotpkg package tnftp>=20091122: tnftp-20130505~ssl found => Required system package gzip: gzip-1.8 found => Required system package patch>=2.0: patch-2.7.5 found => Required system package pax and tar archivers: pax found => Required system package pkg_install>=20110805.7: pkg_install-20110805.7 found ===> Done bootstrap-depends for MPC-1.0r2 ===> Installing full dependencies for MPC-1.0r2 => Dependency digest-20080510 already installed => Dependency tnftp-20130505~ssl already installed ===> Checking build options for MPC-1.0r2 => Building with no option. ===> Checking alternatives for MPC-1.0r2 => Use the GNU C++ compiler: c++-compiler provided by g++>=3 => Use the GNU C compiler: c-compiler provided by gcc>=3 ===> Checking dependencies for MPC-1.0r2 => Required system package boost-headers>=1.34.1: boost-headers-1.64 found => Required system package boostlib-filesystem>=1.34.1: boost-libs-1.64.0 found => Required system package boostlib-iostreams>=1.34.1: boost-libs-1.64.0 found => Required system package boostlib-math>=1.34.1: boost-libs-1.64.0 found => Required system package boostlib-thread>=1.34.1: boost-libs-1.64.0 found => Required system package cmake>=2.6: cmake-3.10.1 found => Required system package freeglut: freeglut found => Required system package g++>=3: g++-7 found => Required system package gcc>=3: gcc-7 found => Required system package glib2>=2.20: glib2-2.54.1 found => Required system package glu>=7: glu-9.0.0 found => Required system package libX11>=1: libX11-1.6.5 found => Required system package libstdc++: libstdc++ found => Required system package mesa>=6.5: mesa-17.2.4 found => Required system package pkg-config>=0.22: pkg-config-1.3.9 found ===> Done depends for MPC-1.0r2 ===> Extracting for MPC-1.0r2 => SHA1 checksums OK => RMD160 checksums OK ===> Patching for MPC-1.0r2 => Applying robotpkg patches for MPC-1.0r2 ===> Configuring for MPC-1.0r2 Searching for X11 Searching for X11 - Found Searching for OpenGL Searching for OpenGL - Found Searching for OpenGL GLU - Found Searching for GLUT Searching for GLUT - Found Searching for glib-2.0 Searching for glib-2.0 - Found Searching for boost Searching for boost - Found Searching for fox-1.6 (optional) Searching for fox-1.6 - Not found Searching for hugr (optional) Searching for hugr - Not found ===> Building for MPC-1.0r2 /local/robotpkg/var/tmp/robotpkg/wip/MPC/work/MPC-1.0/MPC/core/common/src/StateTime.cpp: In member function 'virtual void mpc::StateTime::toGL(double, double, double, double) const': /local/robotpkg/var/tmp/robotpkg/wip/MPC/work/MPC-1.0/MPC/core/common/src/StateTime.cpp:70:37: warning: narrowing conversion of 'R' from 'double' to 'GLfloat {aka float}' inside { } [-Wnarrowing] const GLfloat material[]={R,G,B,1.}; ^ /local/robotpkg/var/tmp/robotpkg/wip/MPC/work/MPC-1.0/MPC/core/common/src/StateTime.cpp:70:37: warning: narrowing conversion of 'G' from 'double' to 'GLfloat {aka float}' inside { } [-Wnarrowing] /local/robotpkg/var/tmp/robotpkg/wip/MPC/work/MPC-1.0/MPC/core/common/src/StateTime.cpp:70:37: warning: narrowing conversion of 'B' from 'double' to 'GLfloat {aka float}' inside { } [-Wnarrowing] In file included from /local/robotpkg/var/tmp/robotpkg/wip/MPC/work/MPC-1.0/MPC/core/./environment/inc/Environment.hpp:6:0, from /local/robotpkg/var/tmp/robotpkg/wip/MPC/work/MPC-1.0/MPC/core/environment/src/Environment.cpp:1: /local/robotpkg/var/tmp/robotpkg/wip/MPC/work/MPC-1.0/MPC/core/./environment/inc/Obs.hpp: In member function 'virtual const mpc::PositionXYTh& mpc::Obs2D::pos(double) const': /local/robotpkg/var/tmp/robotpkg/wip/MPC/work/MPC-1.0/MPC/core/./environment/inc/Obs.hpp:180:82: warning: returning reference to temporary [-Wreturn-local-addr] virtual const PositionXYTh& pos(double t) const { return this->forecastPosT(t); } ^ In file included from /local/robotpkg/var/tmp/robotpkg/wip/MPC/work/MPC-1.0/MPC/core/environment/src/Obs.cpp:1:0: /local/robotpkg/var/tmp/robotpkg/wip/MPC/work/MPC-1.0/MPC/core/./environment/inc/Obs.hpp: In member function 'virtual const mpc::PositionXYTh& mpc::Obs2D::pos(double) const': /local/robotpkg/var/tmp/robotpkg/wip/MPC/work/MPC-1.0/MPC/core/./environment/inc/Obs.hpp:180:82: warning: returning reference to temporary [-Wreturn-local-addr] virtual const PositionXYTh& pos(double t) const { return this->forecastPosT(t); } ^ In file included from /local/robotpkg/var/tmp/robotpkg/wip/MPC/work/MPC-1.0/MPC/core/./environment/inc/Environment.hpp:6:0, from /local/robotpkg/var/tmp/robotpkg/wip/MPC/work/MPC-1.0/MPC/core/./environment/inc/RoadMap.hpp:6, from /local/robotpkg/var/tmp/robotpkg/wip/MPC/work/MPC-1.0/MPC/core/environment/src/RoadMap.cpp:1: /local/robotpkg/var/tmp/robotpkg/wip/MPC/work/MPC-1.0/MPC/core/./environment/inc/Obs.hpp: In member function 'virtual const mpc::PositionXYTh& mpc::Obs2D::pos(double) const': /local/robotpkg/var/tmp/robotpkg/wip/MPC/work/MPC-1.0/MPC/core/./environment/inc/Obs.hpp:180:82: warning: returning reference to temporary [-Wreturn-local-addr] virtual const PositionXYTh& pos(double t) const { return this->forecastPosT(t); } ^ /local/robotpkg/var/tmp/robotpkg/wip/MPC/work/MPC-1.0/MPC/core/environment/src/DistObsMap.cpp: In member function 'void mpc::DistObsMap::initTableDist(int, int)': /local/robotpkg/var/tmp/robotpkg/wip/MPC/work/MPC-1.0/MPC/core/environment/src/DistObsMap.cpp:305:18: warning: overflow in implicit constant conversion [-Woverflow] dist_[i][j].x = INFINITY; ^~~~~~~~ /local/robotpkg/var/tmp/robotpkg/wip/MPC/work/MPC-1.0/MPC/core/environment/src/DistObsMap.cpp:306:18: warning: overflow in implicit constant conversion [-Woverflow] dist_[i][j].y = INFINITY; ^~~~~~~~ /local/robotpkg/var/tmp/robotpkg/wip/MPC/work/MPC-1.0/MPC/core/environment/src/RoadMap.cpp: In member function 'virtual void mpc::DRoadMap::toGL(double) const': /local/robotpkg/var/tmp/robotpkg/wip/MPC/work/MPC-1.0/MPC/core/environment/src/RoadMap.cpp:966:51: warning: narrowing conversion of 'coefR' from 'double' to 'GLfloat {aka float}' inside { } [-Wnarrowing] const GLfloat material[]={coefR,coefG,0.,1.}; ^ /local/robotpkg/var/tmp/robotpkg/wip/MPC/work/MPC-1.0/MPC/core/environment/src/RoadMap.cpp:966:51: warning: narrowing conversion of 'coefG' from 'double' to 'GLfloat {aka float}' inside { } [-Wnarrowing] In file included from /local/robotpkg/var/tmp/robotpkg/wip/MPC/work/MPC-1.0/MPC/core/./planner/inc/CTrajPlanner.hpp:4:0, from /local/robotpkg/var/tmp/robotpkg/wip/MPC/work/MPC-1.0/MPC/core/planner/src/CTrajPlanner.cpp:1: /local/robotpkg/var/tmp/robotpkg/wip/MPC/work/MPC-1.0/MPC/core/./trajGen/inc/TrajGen.hpp:90:25: error: 'constexpr' needed for in-class initialization of static data member 'const double mpc::TrajGen::E' of non-integral type [-fpermissive] static const double E = 0.000000001; /**< small value for computation of the derivatives by finite differences */ ^ /local/robotpkg/var/tmp/robotpkg/wip/MPC/work/MPC-1.0/MPC/core/./trajGen/inc/TrajGen.hpp:91:25: error: 'constexpr' needed for in-class initialization of static data member 'const double mpc::TrajGen::UnSurE' of non-integral type [-fpermissive] static const double UnSurE = 1000000000.0; /**< great value for computation of the derivatives by finite differences */ ^~~~~~ In file included from /local/robotpkg/var/tmp/robotpkg/wip/MPC/work/MPC-1.0/MPC/core/./environment/inc/Environment.hpp:6:0, from /local/robotpkg/var/tmp/robotpkg/wip/MPC/work/MPC-1.0/MPC/core/./planner/inc/TrajPlanner.hpp:5, from /local/robotpkg/var/tmp/robotpkg/wip/MPC/work/MPC-1.0/MPC/core/./planner/inc/CTrajPlanner.hpp:5, from /local/robotpkg/var/tmp/robotpkg/wip/MPC/work/MPC-1.0/MPC/core/planner/src/CTrajPlanner.cpp:1: /local/robotpkg/var/tmp/robotpkg/wip/MPC/work/MPC-1.0/MPC/core/./environment/inc/Obs.hpp: In member function 'virtual const mpc::PositionXYTh& mpc::Obs2D::pos(double) const': /local/robotpkg/var/tmp/robotpkg/wip/MPC/work/MPC-1.0/MPC/core/./environment/inc/Obs.hpp:180:82: warning: returning reference to temporary [-Wreturn-local-addr] virtual const PositionXYTh& pos(double t) const { return this->forecastPosT(t); } ^ In file included from /local/robotpkg/var/tmp/robotpkg/wip/MPC/work/MPC-1.0/MPC/core/./environment/inc/Environment.hpp:6:0, from /local/robotpkg/var/tmp/robotpkg/wip/MPC/work/MPC-1.0/MPC/core/./planner/inc/PathPlanner.hpp:5, from /local/robotpkg/var/tmp/robotpkg/wip/MPC/work/MPC-1.0/MPC/core/planner/src/PathPlanner.cpp:1: /local/robotpkg/var/tmp/robotpkg/wip/MPC/work/MPC-1.0/MPC/core/./environment/inc/Obs.hpp: In member function 'virtual const mpc::PositionXYTh& mpc::Obs2D::pos(double) const': /local/robotpkg/var/tmp/robotpkg/wip/MPC/work/MPC-1.0/MPC/core/./environment/inc/Obs.hpp:180:82: warning: returning reference to temporary [-Wreturn-local-addr] virtual const PositionXYTh& pos(double t) const { return this->forecastPosT(t); } ^ In file included from /local/robotpkg/var/tmp/robotpkg/wip/MPC/work/MPC-1.0/MPC/core/./environment/inc/Environment.hpp:6:0, from /local/robotpkg/var/tmp/robotpkg/wip/MPC/work/MPC-1.0/MPC/core/./planner/inc/TrajPlanner.hpp:5, from /local/robotpkg/var/tmp/robotpkg/wip/MPC/work/MPC-1.0/MPC/core/./planner/inc/PVDTrajPlanner.hpp:4, from /local/robotpkg/var/tmp/robotpkg/wip/MPC/work/MPC-1.0/MPC/core/planner/src/PVDTrajPlanner.cpp:1: /local/robotpkg/var/tmp/robotpkg/wip/MPC/work/MPC-1.0/MPC/core/./environment/inc/Obs.hpp: In member function 'virtual const mpc::PositionXYTh& mpc::Obs2D::pos(double) const': /local/robotpkg/var/tmp/robotpkg/wip/MPC/work/MPC-1.0/MPC/core/./environment/inc/Obs.hpp:180:82: warning: returning reference to temporary [-Wreturn-local-addr] virtual const PositionXYTh& pos(double t) const { return this->forecastPosT(t); } ^ make[2]: *** [core/CMakeFiles/MPC-core.dir/build.make:1695: core/CMakeFiles/MPC-core.dir/planner/src/CTrajPlanner.cpp.o] Error 1 make[2]: *** Waiting for unfinished jobs.... In file included from /local/robotpkg/var/tmp/robotpkg/wip/MPC/work/MPC-1.0/MPC/core/./environment/inc/Environment.hpp:6:0, from /local/robotpkg/var/tmp/robotpkg/wip/MPC/work/MPC-1.0/MPC/core/./planner/inc/PathPlanner.hpp:5, from /local/robotpkg/var/tmp/robotpkg/wip/MPC/work/MPC-1.0/MPC/core/./planner/inc/RoadMapPP.hpp:4, from /local/robotpkg/var/tmp/robotpkg/wip/MPC/work/MPC-1.0/MPC/core/planner/src/RoadMapPP.cpp:1: /local/robotpkg/var/tmp/robotpkg/wip/MPC/work/MPC-1.0/MPC/core/./environment/inc/Obs.hpp: In member function 'virtual const mpc::PositionXYTh& mpc::Obs2D::pos(double) const': /local/robotpkg/var/tmp/robotpkg/wip/MPC/work/MPC-1.0/MPC/core/./environment/inc/Obs.hpp:180:82: warning: returning reference to temporary [-Wreturn-local-addr] virtual const PositionXYTh& pos(double t) const { return this->forecastPosT(t); } ^ make[1]: *** [CMakeFiles/Makefile2:136: core/CMakeFiles/MPC-core.dir/all] Error 2 make: *** [Makefile:130: all] Error 2 An unexpected error occured. The last 10 log lines are shown below. | In file included from /local/robotpkg/var/tmp/robotpkg/wip/MPC/work/MPC-1.0/MPC/core/./environment/inc/Environment.hpp:6:0, | from /local/robotpkg/var/tmp/robotpkg/wip/MPC/work/MPC-1.0/MPC/core/./planner/inc/PathPlanner.hpp:5, | from /local/robotpkg/var/tmp/robotpkg/wip/MPC/work/MPC-1.0/MPC/core/./planner/inc/RoadMapPP.hpp:4, | from /local/robotpkg/var/tmp/robotpkg/wip/MPC/work/MPC-1.0/MPC/core/planner/src/RoadMapPP.cpp:1: | /local/robotpkg/var/tmp/robotpkg/wip/MPC/work/MPC-1.0/MPC/core/./environment/inc/Obs.hpp: In member function 'virtual const mpc::PositionXYTh& mpc::Obs2D::pos(double) const': | /local/robotpkg/var/tmp/robotpkg/wip/MPC/work/MPC-1.0/MPC/core/./environment/inc/Obs.hpp:180:82: warning: returning reference to temporary [-Wreturn-local-addr] | virtual const PositionXYTh& pos(double t) const { return this->forecastPosT(t); } | ^ | make[1]: *** [CMakeFiles/Makefile2:136: core/CMakeFiles/MPC-core.dir/all] Error 2 | make: *** [Makefile:130: all] Error 2 For details or bug reports, check the complete log file in: /local/robotpkg/var/tmp/robotpkg/wip/MPC/work/build.log make[3]: *** [/local/robotpkg/var/lib/robotpkg/mk/build/build.mk:197: do-build] Error 2 make[2]: *** [/local/robotpkg/var/lib/robotpkg/mk/pkg/package.mk:42: pkg-check-installed] Error 2 => Marking MPC-1.0r2 as broken ERROR: make: *** [package] Error 2 ===> Deinstalling for MPC Removed digest-20080510 Removed tnftp-20130505~ssl