robotpkg/wip bulk build results

Log for Ubuntu-16.04-x86_64 (Back)

--- Syncing bulk database ---------------------------------------- setting Ubuntu-16.04-x86_64 as running --- Updating robotpkg -------------------------------------------- Pulling /local/robotpkg/var/lib/robotpkg/wip HEAD is now at 292e2a4 [wip/sot-torque-control] Release version 1.2.0 Updating pkgtools/pkg_install ===> Updating for pkg_install-20110805.9 pkg_install-20110805.9 is already installed and up-to-date. Updating pkgtools/rbulkit ===> Updating for rbulkit-20181116.1 rbulkit-20181116.1 is already installed and up-to-date. Updating pkgtools/pkgrepo2deb ===> Updating for pkgrepo2deb-1.4 pkgrepo2deb-1.4 is already installed and up-to-date. --- Running build for bulk-rbulk-wip ------------------------------- ===> Sorting packages for rbulk wip set Scanning wip/libmove3d-hri:* Scanning wip/sot-torque-control:* Scanning wip/prf-gazebo-ros-pkgs:* Scanning pkgtools/tnftp:tnftp>=20130505~ssl Scanning wip/head-action:* Scanning wip/orocos-dot_service:* Scanning wip/certi:* Scanning wip/gdalwrap:* Scanning wip/mumps:* Scanning wip/metapod:* [wip/metapod:*] Warning: DOXYGEN_PLIST_DIR in wip/metapod is deprecated. [wip/metapod:*] Warning: use DYNAMIC_PLIST_DIRS instead. Scanning wip/sot-pattern-generator-v3:* Scanning wip/jsbsim:* Scanning wip/dptu-genom3:* Scanning wip/ros-swri-serial-util:* Scanning wip/ros-swri-string-util:* Scanning wip/can-utils:* Scanning wip/pal-gazebo-plugins:* Scanning wip/tf-lookup:* Scanning wip/ros-swri-math-util:* Scanning wip/hrp2-14-description:* Scanning wip/hrp2-computer-monitor:* Scanning wip/FRILibrary:* Scanning wip/py-sot-tools-v3:* Scanning wip/sot-talos:* Scanning wip/sot-dyninv:* Scanning wip/pal-hardware-gazebo:* Scanning wip/hrp2-dev:* Scanning wip/jrl-walkgen-v3:* Scanning wip/pal-transmissions:* Scanning wip/py-hla:* Scanning wip/py-example-adder:* Scanning wip/ompl:* Scanning wip/pyrene-motions:* Scanning wip/infuse-asn1-types:* Scanning wip/move3d-studio:* Scanning wip/talos-data:* Scanning wip/backward-ros:* Scanning wip/sot-hrp2-v3:* Scanning wip/move3d-assets:* Scanning wip/ros-swri-nodelet:* Scanning wip/sot-tools-v3:* Scanning wip/morse-hla:* Scanning wip/cppadcodegen:* Scanning wip/py-dynamic-graph-bridge-v3:* Scanning wip/pal-hardware-interfaces:* Scanning wip/hrp2-bringup:* Scanning wip/gerard-bauzil:* Scanning wip/urg:* Scanning wip/dynamic-graph-v3:* Scanning wip/py-dynamic-graph-tutorial:* Scanning wip/spark-genom:* Scanning wip/cppad:* Scanning wip/talos-metapkg-ros-control-sot:* Scanning wip/histodet:* Scanning wip/octovis:* Scanning wip/py-sot-dynamic-pinocchio-v3:* Scanning wip/rqt-dynamic-graph:* Scanning wip/openhrp3-hrp2:* Scanning wip/py-sot-dyninv-v3:* Scanning wip/talos-simulation:* Scanning wip/prf-ros-controllers:* Scanning wip/py-morse:* Scanning wip/simple-humanoid-description:* Scanning wip/infuse-envire:* Scanning wip/py-sot-application-v3:* Scanning wip/soth:* Scanning wip/infuse-novatel-gps-driver-ros:* Scanning wip/libmove3d-planners:* Scanning wip/infuse-idl:* Scanning wip/ros-swri-roscpp:* Scanning wip/roscontrol-sot:* Scanning wip/play-motion:* Scanning wip/tsid:* Scanning wip/orocos-bfl:* Scanning wip/sot-dynamic-pinocchio-v3:* Scanning wip/py-mraa:* Scanning wip/osg-dae:* Scanning wip/sot-dyninv-v3:* Scanning wip/py-jsbsim:* Scanning wip/dynamic-introspection:* Scanning wip/msgconnector:* Scanning wip/lua-rfsm:* Scanning wip/py-sot-core-v3:* Scanning wip/py-parametric-curves:* Scanning wip/roralink:* Scanning wip/talos-dev:* Scanning wip/morse-mavlink:* Scanning wip/sot-hrp2:* Scanning wip/antlr2:* Scanning wip/pal-msgs:* Scanning wip/hpp-environments:* Scanning wip/parametric-curves:* Scanning wip/example-adder:* Scanning wip/talos-moveit-config:* Scanning wip/ur5-description:* [wip/ur5-description:*] Warning: the LICENSE of wip/ur5-description is undefined. Scanning wip/orocos-yarp_transport:* Scanning middleware/orocos-rtt:orocos-rtt>=2.5 Scanning wip/infuse-asn1-conversions:* Scanning wip/infuse-msgs-ros:* Scanning wip/talos-robot:* Scanning wip/tiago-robot:* Scanning wip/libmove3d:* Scanning wip/py-sot-torque-control:* Scanning wip/mavlink:* Scanning wip/pal-gazebo-worlds:* Scanning wip/morse-ros:* Scanning wip/hrp2-machine:* Scanning wip/openhrp3-simulator-wo-rtm:* Scanning wip/py-sot-pattern-generator-v3:* Scanning wip/prf-roboticsgroup-gazebo-plugins:* Scanning wip/sot-core-v3:* Scanning wip/eigen-quadprog:* Scanning wip/dynamic-graph-tutorial:* Scanning wip/prf-ros-control:* Scanning wip/py-mavlink:* Scanning wip/libnabo:* Scanning wip/py-dynamic-graph-v3:* Scanning wip/hatponboard-lib:* Scanning wip/libhatp:* Scanning wip/py-dynamic-graph-v3:py37-dynamic-graph-v3-3.2.0 Scanning wip/py-dynamic-graph-v3:py36-dynamic-graph-v3-3.2.0 Scanning wip/py-dynamic-graph-v3:py35-dynamic-graph-v3-3.2.0 Scanning wip/py-dynamic-graph-v3:py34-dynamic-graph-v3-3.2.0 Scanning wip/py-dynamic-graph-v3:py32-dynamic-graph-v3-3.2.0 Scanning wip/py-mavlink:py37-mavlink-1.1.62 Scanning wip/py-mavlink:py36-mavlink-1.1.62 Scanning wip/py-mavlink:py35-mavlink-1.1.62 Scanning wip/py-mavlink:py34-mavlink-1.1.62 Scanning wip/py-mavlink:py32-mavlink-1.1.62 Scanning wip/py-sot-pattern-generator-v3:py37-sot-pattern-generator-v3-3.1.0 Scanning wip/py-sot-pattern-generator-v3:py36-sot-pattern-generator-v3-3.1.0 Scanning wip/py-sot-pattern-generator-v3:py35-sot-pattern-generator-v3-3.1.0 Scanning wip/py-sot-pattern-generator-v3:py34-sot-pattern-generator-v3-3.1.0 Scanning wip/py-sot-pattern-generator-v3:py32-sot-pattern-generator-v3-3.1.0 Scanning wip/py-sot-torque-control:py37-sot-torque-control-1.1.0 Scanning wip/py-sot-torque-control:py36-sot-torque-control-1.1.0 Scanning wip/py-sot-torque-control:py35-sot-torque-control-1.1.0 Scanning wip/py-sot-torque-control:py34-sot-torque-control-1.1.0 Scanning wip/py-sot-torque-control:py32-sot-torque-control-1.1.0 Scanning wip/py-parametric-curves:py37-parametric-curves-1.2.0 Scanning wip/py-parametric-curves:py36-parametric-curves-1.2.0 Scanning wip/py-parametric-curves:py35-parametric-curves-1.2.0 Scanning wip/py-parametric-curves:py34-parametric-curves-1.2.0 Scanning wip/py-parametric-curves:py32-parametric-curves-1.2.0 Scanning wip/py-sot-core-v3:py37-sot-core-v3-3.3.0 Scanning wip/py-sot-core-v3:py36-sot-core-v3-3.3.0 Scanning wip/py-sot-core-v3:py35-sot-core-v3-3.3.0 Scanning wip/py-sot-core-v3:py34-sot-core-v3-3.3.0 Scanning wip/py-sot-core-v3:py32-sot-core-v3-3.3.0 Scanning wip/py-jsbsim:py37-jsbsim-20150424r1 Scanning wip/py-jsbsim:py36-jsbsim-20150424r1 Scanning wip/py-jsbsim:py35-jsbsim-20150424r1 Scanning wip/py-jsbsim:py34-jsbsim-20150424r1 Scanning wip/py-jsbsim:py32-jsbsim-20150424r1 Scanning wip/py-sot-application-v3:py37-sot-application-v3-1.2.0r2 Scanning wip/py-sot-application-v3:py36-sot-application-v3-1.2.0r2 Scanning wip/py-sot-application-v3:py35-sot-application-v3-1.2.0r2 Scanning wip/py-sot-application-v3:py34-sot-application-v3-1.2.0r2 Scanning wip/py-sot-application-v3:py32-sot-application-v3-1.2.0r2 Scanning wip/py-morse:py37-morse-1.4 Scanning wip/py-morse:py36-morse-1.4 Scanning wip/py-morse:py34-morse-1.4 Scanning wip/py-morse:py32-morse-1.4 Scanning wip/py-sot-dyninv-v3:py37-sot-dyninv-v3-3.1.1r1 Scanning wip/py-sot-dyninv-v3:py36-sot-dyninv-v3-3.1.1r1 Scanning wip/py-sot-dyninv-v3:py35-sot-dyninv-v3-3.1.1r1 Scanning wip/py-sot-dyninv-v3:py34-sot-dyninv-v3-3.1.1r1 Scanning wip/py-sot-dyninv-v3:py32-sot-dyninv-v3-3.1.1r1 Scanning wip/rqt-dynamic-graph:py37-rqt-dynamic-graph-1.0.0 Scanning wip/rqt-dynamic-graph:py36-rqt-dynamic-graph-1.0.0 Scanning wip/rqt-dynamic-graph:py35-rqt-dynamic-graph-1.0.0 Scanning wip/rqt-dynamic-graph:py34-rqt-dynamic-graph-1.0.0 Scanning wip/rqt-dynamic-graph:py32-rqt-dynamic-graph-1.0.0 Scanning wip/py-sot-dynamic-pinocchio-v3:py37-sot-dynamic-pinocchio-v3-3.2.4 Scanning wip/py-sot-dynamic-pinocchio-v3:py36-sot-dynamic-pinocchio-v3-3.2.4 Scanning wip/py-sot-dynamic-pinocchio-v3:py35-sot-dynamic-pinocchio-v3-3.2.4 Scanning wip/py-sot-dynamic-pinocchio-v3:py34-sot-dynamic-pinocchio-v3-3.2.4 Scanning wip/py-sot-dynamic-pinocchio-v3:py32-sot-dynamic-pinocchio-v3-3.2.4 Scanning wip/py-dynamic-graph-tutorial:py37-dynamic-graph-tutorial-1.1.1 Scanning wip/py-dynamic-graph-tutorial:py36-dynamic-graph-tutorial-1.1.1 Scanning wip/py-dynamic-graph-tutorial:py35-dynamic-graph-tutorial-1.1.1 Scanning wip/py-dynamic-graph-tutorial:py34-dynamic-graph-tutorial-1.1.1 Scanning wip/py-dynamic-graph-tutorial:py32-dynamic-graph-tutorial-1.1.1 Scanning wip/py-dynamic-graph-bridge-v3:py37-dynamic-graph-bridge-v3-3.2.0 Scanning wip/py-dynamic-graph-bridge-v3:py36-dynamic-graph-bridge-v3-3.2.0 Scanning wip/py-dynamic-graph-bridge-v3:py35-dynamic-graph-bridge-v3-3.2.0 Scanning wip/py-dynamic-graph-bridge-v3:py34-dynamic-graph-bridge-v3-3.2.0 Scanning wip/py-dynamic-graph-bridge-v3:py32-dynamic-graph-bridge-v3-3.2.0 Scanning wip/py-example-adder:py37-example-adder-1.0.0 Scanning wip/py-example-adder:py36-example-adder-1.0.0 Scanning wip/py-example-adder:py35-example-adder-1.0.0 Scanning wip/py-example-adder:py34-example-adder-1.0.0 Scanning wip/py-example-adder:py32-example-adder-1.0.0 Scanning wip/py-hla:py37-hla-1.1.1r1 Scanning wip/py-hla:py36-hla-1.1.1r1 Scanning wip/py-hla:py35-hla-1.1.1r1 Scanning wip/py-hla:py34-hla-1.1.1r1 Scanning wip/py-hla:py32-hla-1.1.1r1 Scanning wip/py-sot-tools-v3:py37-sot-tools-v3-2.1.0 Scanning wip/py-sot-tools-v3:py36-sot-tools-v3-2.1.0 Scanning wip/py-sot-tools-v3:py35-sot-tools-v3-2.1.0 Scanning wip/py-sot-tools-v3:py34-sot-tools-v3-2.1.0 Scanning wip/py-sot-tools-v3:py32-sot-tools-v3-2.1.0 Scanning wip/dptu-genom3:dptu-genom3-0.2~codels+openprs+ros-client-c+ros-client-ros+ros-server+!* Scanning wip/dptu-genom3:dptu-genom3-0.2~pocolibs-client-c+codels+openprs+pocolibs-server+!* Scanned 312 packages (271 unique) [21%] Processing wip/mavlink:mavlink-20150929 ===> Bulk building for mavlink-20150929 Binary package for mavlink-20150929 is up-to-date. [21%] Processing wip/libmove3d:libmove3d-3.22.0r1 ===> Bulk building for libmove3d-3.22.0r1 Binary package for libmove3d-3.22.0r1 is up-to-date. [22%] Processing wip/morse-ros:morse-ros-1.4 ===> Cleaning temporary files for morse-ros-1.4 ===> Bulk building for morse-ros-1.4 => Checking for clear installation => Installing /opt/robotpkg/var/lib/robotpkg/packages/bsd/Ubuntu-16.04-x86_64/All/digest-20080510.tgz => Installing /opt/robotpkg/var/lib/robotpkg/packages/bsd/Ubuntu-16.04-x86_64/All/tnftp-20130505~ssl.tgz => Required robotpkg package digest>=20080510: digest-20080510 found => Required robotpkg package tnftp>=20091122: tnftp-20130505~ssl found => Required system package gnupg>=1: gnupg-1.4.20 found => Required system package gzip: gzip-1.6 found => Required system package patch>=2.0: patch-2.7.5 found => Required system package pax and tar archivers: pax found => Required system package pkg_install>=20110805.9: pkg_install-20110805.9 found => Required system package pkgrepo2deb>=1.4: pkgrepo2deb-1.4 found => Dependency digest-20080510 already installed => Installing /opt/robotpkg/var/lib/robotpkg/packages/bsd/Ubuntu-16.04-x86_64/All/morse-1.4~doc.tgz => Required system package py35-catkin-pkg>=0.2: MISSING => Dependency tnftp-20130505~ssl already installed ERROR: ====================================================================== ERROR: Missing system packages required for morse-ros-1.4: ERROR: ERROR: py35-catkin-pkg>=0.2 (Ubuntu package python-catkin-pkg) ERROR: ERROR: Please use the system package management tool to install these ERROR: dependencies. If a robotpkg version of a dependency is available, ERROR: you can configure robotpkg.conf to use this version instead. ERROR: ERROR: See /local/robotpkg/var/tmp/robotpkg/wip/morse-ros/work/sysdep.log for details. ERROR: ====================================================================== make[2]: *** [sys-depends] Error 2 ===> Logging bulk summary for morse-ros-1.4 => Checking leftover files => Creating bulk log files => Logging bulk metadata ===> Cleaning temporary files for morse-ros-1.4 ===> Done bulk for morse-ros-1.4 [22%] Processing wip/openhrp3-simulator-wo-rtm:openhrp3-simulator-wo-rtm-1.2.0 ===> Bulk building for openhrp3-simulator-wo-rtm-1.2.0 Binary package for openhrp3-simulator-wo-rtm-1.2.0 is up-to-date. [22%] Processing wip/hrp2-machine:hrp2-machine-1.0.2 ===> Bulk building for hrp2-machine-1.0.2 Binary package for hrp2-machine-1.0.2 is up-to-date. [23%] Processing wip/eigen-quadprog:eigen-quadprog-1.0.0 ===> Bulk building for eigen-quadprog-1.0.0 Binary package for eigen-quadprog-1.0.0 is up-to-date. [24%] Processing wip/py-mavlink:py35-mavlink-1.1.62 ===> Cleaning temporary files for py35-mavlink-1.1.62 ===> Bulk building for py35-mavlink-1.1.62 => Checking for clear installation => Installing /opt/robotpkg/var/lib/robotpkg/packages/bsd/Ubuntu-16.04-x86_64/All/digest-20080510.tgz => Installing /opt/robotpkg/var/lib/robotpkg/packages/bsd/Ubuntu-16.04-x86_64/All/tnftp-20130505~ssl.tgz => Required robotpkg package digest>=20080510: digest-20080510 found => Required robotpkg package tnftp>=20091122: tnftp-20130505~ssl found => Required system package git>=1.6: git-2.7.4 found => Required system package gnupg>=1: gnupg-1.4.20 found => Required system package gzip: gzip-1.6 found => Required system package pax and tar archivers: pax found => Required system package pkg_install>=20110805.9: pkg_install-20110805.9 found => Required system package pkgrepo2deb>=1.4: pkgrepo2deb-1.4 found => Dependency digest-20080510 already installed => Dependency tnftp-20130505~ssl already installed => Building with no option. => Use the GNU C compiler: c-compiler provided by gcc>=3 => Use python-3.5: python>=2.5<3.8 provided by python35>=3.5<3.6 => Required system package gcc>=3: gcc-5.4.0 found => Required system package python35>=3.5<3.6: python35-3.5.2 found => SHA1 checksums OK => RMD160 checksums OK => Compiling python files File "/opt/openrobots/lib/python3.5/site-packages/pymavlink/generator/lib/genxmlif/__init__.py", line 81 raise AttributeError, "Unknown XML interface: %s" %(xmlIf) ^ SyntaxError: invalid syntax File "/opt/openrobots/lib/python3.5/site-packages/pymavlink/generator/lib/genxmlif/xmlif4Dom.py", line 58 print "Using 4Dom interface module..." ^ SyntaxError: Missing parentheses in call to 'print' File "/opt/openrobots/lib/python3.5/site-packages/pymavlink/generator/lib/genxmlif/xmlifApi.py", line 370 raise AttributeError, "Attribute %s not found!" %(repr(tupleOrAttrName)) ^ SyntaxError: invalid syntax File "/opt/openrobots/lib/python3.5/site-packages/pymavlink/generator/lib/genxmlif/xmlifDom.py", line 69 print "Xinclude: %s" %href ^ SyntaxError: Missing parentheses in call to 'print' File "/opt/openrobots/lib/python3.5/site-packages/pymavlink/generator/lib/genxmlif/xmlifElementTree.py", line 72 print "Using elementtree interface module..." ^ SyntaxError: Missing parentheses in call to 'print' File "/opt/openrobots/lib/python3.5/site-packages/pymavlink/generator/lib/genxmlif/xmlifMinidom.py", line 63 print "Using minidom interface module..." ^ SyntaxError: Missing parentheses in call to 'print' File "/opt/openrobots/lib/python3.5/site-packages/pymavlink/generator/lib/genxmlif/xmlifUtils.py", line 193 raise LookupError, "Prefix for namespaceURI '%s' not found!" % (ns) ^ SyntaxError: invalid syntax File "/opt/openrobots/lib/python3.5/site-packages/pymavlink/generator/lib/genxmlif/xmliftest.py", line 12 print xmlTree.printTree(prettyPrint=1) ^ SyntaxError: invalid syntax File "/opt/openrobots/lib/python3.5/site-packages/pymavlink/generator/lib/minixsv/minixsvWrapper.py", line 36 print validSyntaxText ^ SyntaxError: Missing parentheses in call to 'print' File "/opt/openrobots/lib/python3.5/site-packages/pymavlink/generator/lib/minixsv/pyxsval.py", line 93 raise KeyError, "xmlIfKey %s already implemented!" %(xmlIfKey) ^ SyntaxError: invalid syntax File "/opt/openrobots/lib/python3.5/site-packages/pymavlink/generator/lib/minixsv/xsvalBase.py", line 135 except TagException, errInst: ^ SyntaxError: invalid syntax File "/opt/openrobots/lib/python3.5/site-packages/pymavlink/generator/lib/minixsv/xsvalErrorHandler.py", line 122 print string.join (self.infoDict.keys(), "n") ^ SyntaxError: invalid syntax File "/opt/openrobots/lib/python3.5/site-packages/pymavlink/generator/lib/minixsv/xsvalSchema.py", line 431 except TagException, errInst: ^ SyntaxError: invalid syntax File "/opt/openrobots/lib/python3.5/site-packages/pymavlink/generator/lib/minixsv/xsvalSimpleTypes.py", line 78 except BaseTypeError, errstr: ^ SyntaxError: invalid syntax File "/opt/openrobots/lib/python3.5/site-packages/pymavlink/generator/lib/minixsv/xsvalUtils.py", line 48 r"Cc" : ur"x00-x1fx7f-x9f", ^ SyntaxError: invalid syntax File "/opt/openrobots/lib/python3.5/site-packages/pymavlink/generator/lib/genxmlif/__init__.py", line 81 raise AttributeError, "Unknown XML interface: %s" %(xmlIf) ^ SyntaxError: invalid syntax File "/opt/openrobots/lib/python3.5/site-packages/pymavlink/generator/lib/genxmlif/xmlif4Dom.py", line 58 print "Using 4Dom interface module..." ^ SyntaxError: Missing parentheses in call to 'print' File "/opt/openrobots/lib/python3.5/site-packages/pymavlink/generator/lib/genxmlif/xmlifApi.py", line 370 raise AttributeError, "Attribute %s not found!" %(repr(tupleOrAttrName)) ^ SyntaxError: invalid syntax File "/opt/openrobots/lib/python3.5/site-packages/pymavlink/generator/lib/genxmlif/xmlifDom.py", line 69 print "Xinclude: %s" %href ^ SyntaxError: Missing parentheses in call to 'print' File "/opt/openrobots/lib/python3.5/site-packages/pymavlink/generator/lib/genxmlif/xmlifElementTree.py", line 72 print "Using elementtree interface module..." ^ SyntaxError: Missing parentheses in call to 'print' File "/opt/openrobots/lib/python3.5/site-packages/pymavlink/generator/lib/genxmlif/xmlifMinidom.py", line 63 print "Using minidom interface module..." ^ SyntaxError: Missing parentheses in call to 'print' File "/opt/openrobots/lib/python3.5/site-packages/pymavlink/generator/lib/genxmlif/xmlifUtils.py", line 193 raise LookupError, "Prefix for namespaceURI '%s' not found!" % (ns) ^ SyntaxError: invalid syntax File "/opt/openrobots/lib/python3.5/site-packages/pymavlink/generator/lib/genxmlif/xmliftest.py", line 12 print xmlTree.printTree(prettyPrint=1) ^ SyntaxError: invalid syntax File "/opt/openrobots/lib/python3.5/site-packages/pymavlink/generator/lib/minixsv/minixsvWrapper.py", line 36 print validSyntaxText ^ SyntaxError: Missing parentheses in call to 'print' File "/opt/openrobots/lib/python3.5/site-packages/pymavlink/generator/lib/minixsv/pyxsval.py", line 93 raise KeyError, "xmlIfKey %s already implemented!" %(xmlIfKey) ^ SyntaxError: invalid syntax File "/opt/openrobots/lib/python3.5/site-packages/pymavlink/generator/lib/minixsv/xsvalBase.py", line 135 except TagException, errInst: ^ SyntaxError: invalid syntax File "/opt/openrobots/lib/python3.5/site-packages/pymavlink/generator/lib/minixsv/xsvalErrorHandler.py", line 122 print string.join (self.infoDict.keys(), "n") ^ SyntaxError: invalid syntax File "/opt/openrobots/lib/python3.5/site-packages/pymavlink/generator/lib/minixsv/xsvalSchema.py", line 431 except TagException, errInst: ^ SyntaxError: invalid syntax File "/opt/openrobots/lib/python3.5/site-packages/pymavlink/generator/lib/minixsv/xsvalSimpleTypes.py", line 78 except BaseTypeError, errstr: ^ SyntaxError: invalid syntax File "/opt/openrobots/lib/python3.5/site-packages/pymavlink/generator/lib/minixsv/xsvalUtils.py", line 48 r"Cc" : ur"x00-x1fx7f-x9f", ^ SyntaxError: invalid syntax robotpkg_create: can't stat `/opt/openrobots/lib/python3.5/site-packages/mavnative.so' robotpkg_create: can't stat `/opt/openrobots/lib/python3.5/site-packages/pymavlink/generator/lib/genxmlif/__pycache__/__init__.cpython-35.pyc' robotpkg_create: can't stat `/opt/openrobots/lib/python3.5/site-packages/pymavlink/generator/lib/genxmlif/__pycache__/__init__.cpython-35.opt-1.pyc' robotpkg_create: can't stat `/opt/openrobots/lib/python3.5/site-packages/pymavlink/generator/lib/genxmlif/__pycache__/xmlif4Dom.cpython-35.pyc' robotpkg_create: can't stat `/opt/openrobots/lib/python3.5/site-packages/pymavlink/generator/lib/genxmlif/__pycache__/xmlif4Dom.cpython-35.opt-1.pyc' robotpkg_create: can't stat `/opt/openrobots/lib/python3.5/site-packages/pymavlink/generator/lib/genxmlif/__pycache__/xmlifApi.cpython-35.pyc' robotpkg_create: can't stat `/opt/openrobots/lib/python3.5/site-packages/pymavlink/generator/lib/genxmlif/__pycache__/xmlifApi.cpython-35.opt-1.pyc' robotpkg_create: can't stat `/opt/openrobots/lib/python3.5/site-packages/pymavlink/generator/lib/genxmlif/__pycache__/xmlifDom.cpython-35.pyc' robotpkg_create: can't stat `/opt/openrobots/lib/python3.5/site-packages/pymavlink/generator/lib/genxmlif/__pycache__/xmlifDom.cpython-35.opt-1.pyc' robotpkg_create: can't stat `/opt/openrobots/lib/python3.5/site-packages/pymavlink/generator/lib/genxmlif/__pycache__/xmlifElementTree.cpython-35.pyc' robotpkg_create: can't stat `/opt/openrobots/lib/python3.5/site-packages/pymavlink/generator/lib/genxmlif/__pycache__/xmlifElementTree.cpython-35.opt-1.pyc' robotpkg_create: can't stat `/opt/openrobots/lib/python3.5/site-packages/pymavlink/generator/lib/genxmlif/__pycache__/xmlifMinidom.cpython-35.pyc' robotpkg_create: can't stat `/opt/openrobots/lib/python3.5/site-packages/pymavlink/generator/lib/genxmlif/__pycache__/xmlifMinidom.cpython-35.opt-1.pyc' robotpkg_create: can't stat `/opt/openrobots/lib/python3.5/site-packages/pymavlink/generator/lib/genxmlif/__pycache__/xmlifUtils.cpython-35.pyc' robotpkg_create: can't stat `/opt/openrobots/lib/python3.5/site-packages/pymavlink/generator/lib/genxmlif/__pycache__/xmlifUtils.cpython-35.opt-1.pyc' robotpkg_create: can't stat `/opt/openrobots/lib/python3.5/site-packages/pymavlink/generator/lib/genxmlif/__pycache__/xmliftest.cpython-35.pyc' robotpkg_create: can't stat `/opt/openrobots/lib/python3.5/site-packages/pymavlink/generator/lib/genxmlif/__pycache__/xmliftest.cpython-35.opt-1.pyc' robotpkg_create: can't stat `/opt/openrobots/lib/python3.5/site-packages/pymavlink/generator/lib/minixsv/__pycache__/minixsvWrapper.cpython-35.pyc' robotpkg_create: can't stat `/opt/openrobots/lib/python3.5/site-packages/pymavlink/generator/lib/minixsv/__pycache__/minixsvWrapper.cpython-35.opt-1.pyc' robotpkg_create: can't stat `/opt/openrobots/lib/python3.5/site-packages/pymavlink/generator/lib/minixsv/__pycache__/pyxsval.cpython-35.pyc' robotpkg_create: can't stat `/opt/openrobots/lib/python3.5/site-packages/pymavlink/generator/lib/minixsv/__pycache__/pyxsval.cpython-35.opt-1.pyc' robotpkg_create: can't stat `/opt/openrobots/lib/python3.5/site-packages/pymavlink/generator/lib/minixsv/__pycache__/xsvalBase.cpython-35.pyc' robotpkg_create: can't stat `/opt/openrobots/lib/python3.5/site-packages/pymavlink/generator/lib/minixsv/__pycache__/xsvalBase.cpython-35.opt-1.pyc' robotpkg_create: can't stat `/opt/openrobots/lib/python3.5/site-packages/pymavlink/generator/lib/minixsv/__pycache__/xsvalErrorHandler.cpython-35.pyc' robotpkg_create: can't stat `/opt/openrobots/lib/python3.5/site-packages/pymavlink/generator/lib/minixsv/__pycache__/xsvalErrorHandler.cpython-35.opt-1.pyc' robotpkg_create: can't stat `/opt/openrobots/lib/python3.5/site-packages/pymavlink/generator/lib/minixsv/__pycache__/xsvalSchema.cpython-35.pyc' robotpkg_create: can't stat `/opt/openrobots/lib/python3.5/site-packages/pymavlink/generator/lib/minixsv/__pycache__/xsvalSchema.cpython-35.opt-1.pyc' robotpkg_create: can't stat `/opt/openrobots/lib/python3.5/site-packages/pymavlink/generator/lib/minixsv/__pycache__/xsvalSimpleTypes.cpython-35.pyc' robotpkg_create: can't stat `/opt/openrobots/lib/python3.5/site-packages/pymavlink/generator/lib/minixsv/__pycache__/xsvalSimpleTypes.cpython-35.opt-1.pyc' robotpkg_create: can't stat `/opt/openrobots/lib/python3.5/site-packages/pymavlink/generator/lib/minixsv/__pycache__/xsvalUtils.cpython-35.pyc' robotpkg_create: can't stat `/opt/openrobots/lib/python3.5/site-packages/pymavlink/generator/lib/minixsv/__pycache__/xsvalUtils.cpython-35.opt-1.pyc' => Registering installation for py35-mavlink-1.1.62 robotpkg_admin: py35-mavlink-1.1.62: File `/opt/openrobots/lib/python3.5/site-packages/mavnative.so' is in +CONTENTS but not on filesystem! robotpkg_admin: py35-mavlink-1.1.62: File `/opt/openrobots/lib/python3.5/site-packages/pymavlink/generator/lib/genxmlif/__pycache__/__init__.cpython-35.pyc' is in +CONTENTS but not on filesystem! robotpkg_admin: py35-mavlink-1.1.62: File `/opt/openrobots/lib/python3.5/site-packages/pymavlink/generator/lib/genxmlif/__pycache__/__init__.cpython-35.opt-1.pyc' is in +CONTENTS but not on filesystem! robotpkg_admin: py35-mavlink-1.1.62: File `/opt/openrobots/lib/python3.5/site-packages/pymavlink/generator/lib/genxmlif/__pycache__/xmlif4Dom.cpython-35.pyc' is in +CONTENTS but not on filesystem! robotpkg_admin: py35-mavlink-1.1.62: File `/opt/openrobots/lib/python3.5/site-packages/pymavlink/generator/lib/genxmlif/__pycache__/xmlif4Dom.cpython-35.opt-1.pyc' is in +CONTENTS but not on filesystem! robotpkg_admin: py35-mavlink-1.1.62: File `/opt/openrobots/lib/python3.5/site-packages/pymavlink/generator/lib/genxmlif/__pycache__/xmlifApi.cpython-35.pyc' is in +CONTENTS but not on filesystem! robotpkg_admin: py35-mavlink-1.1.62: File `/opt/openrobots/lib/python3.5/site-packages/pymavlink/generator/lib/genxmlif/__pycache__/xmlifApi.cpython-35.opt-1.pyc' is in +CONTENTS but not on filesystem! robotpkg_admin: py35-mavlink-1.1.62: File `/opt/openrobots/lib/python3.5/site-packages/pymavlink/generator/lib/genxmlif/__pycache__/xmlifDom.cpython-35.pyc' is in +CONTENTS but not on filesystem! robotpkg_admin: py35-mavlink-1.1.62: File `/opt/openrobots/lib/python3.5/site-packages/pymavlink/generator/lib/genxmlif/__pycache__/xmlifDom.cpython-35.opt-1.pyc' is in +CONTENTS but not on filesystem! robotpkg_admin: py35-mavlink-1.1.62: File `/opt/openrobots/lib/python3.5/site-packages/pymavlink/generator/lib/genxmlif/__pycache__/xmlifElementTree.cpython-35.pyc' is in +CONTENTS but not on filesystem! robotpkg_admin: py35-mavlink-1.1.62: File `/opt/openrobots/lib/python3.5/site-packages/pymavlink/generator/lib/genxmlif/__pycache__/xmlifElementTree.cpython-35.opt-1.pyc' is in +CONTENTS but not on filesystem! robotpkg_admin: py35-mavlink-1.1.62: File `/opt/openrobots/lib/python3.5/site-packages/pymavlink/generator/lib/genxmlif/__pycache__/xmlifMinidom.cpython-35.pyc' is in +CONTENTS but not on filesystem! robotpkg_admin: py35-mavlink-1.1.62: File `/opt/openrobots/lib/python3.5/site-packages/pymavlink/generator/lib/genxmlif/__pycache__/xmlifMinidom.cpython-35.opt-1.pyc' is in +CONTENTS but not on filesystem! robotpkg_admin: py35-mavlink-1.1.62: File `/opt/openrobots/lib/python3.5/site-packages/pymavlink/generator/lib/genxmlif/__pycache__/xmlifUtils.cpython-35.pyc' is in +CONTENTS but not on filesystem! robotpkg_admin: py35-mavlink-1.1.62: File `/opt/openrobots/lib/python3.5/site-packages/pymavlink/generator/lib/genxmlif/__pycache__/xmlifUtils.cpython-35.opt-1.pyc' is in +CONTENTS but not on filesystem! robotpkg_admin: py35-mavlink-1.1.62: File `/opt/openrobots/lib/python3.5/site-packages/pymavlink/generator/lib/genxmlif/__pycache__/xmliftest.cpython-35.pyc' is in +CONTENTS but not on filesystem! robotpkg_admin: py35-mavlink-1.1.62: File `/opt/openrobots/lib/python3.5/site-packages/pymavlink/generator/lib/genxmlif/__pycache__/xmliftest.cpython-35.opt-1.pyc' is in +CONTENTS but not on filesystem! robotpkg_admin: py35-mavlink-1.1.62: File `/opt/openrobots/lib/python3.5/site-packages/pymavlink/generator/lib/minixsv/__pycache__/minixsvWrapper.cpython-35.pyc' is in +CONTENTS but not on filesystem! robotpkg_admin: py35-mavlink-1.1.62: File `/opt/openrobots/lib/python3.5/site-packages/pymavlink/generator/lib/minixsv/__pycache__/minixsvWrapper.cpython-35.opt-1.pyc' is in +CONTENTS but not on filesystem! robotpkg_admin: py35-mavlink-1.1.62: File `/opt/openrobots/lib/python3.5/site-packages/pymavlink/generator/lib/minixsv/__pycache__/pyxsval.cpython-35.pyc' is in +CONTENTS but not on filesystem! robotpkg_admin: py35-mavlink-1.1.62: File `/opt/openrobots/lib/python3.5/site-packages/pymavlink/generator/lib/minixsv/__pycache__/pyxsval.cpython-35.opt-1.pyc' is in +CONTENTS but not on filesystem! robotpkg_admin: py35-mavlink-1.1.62: File `/opt/openrobots/lib/python3.5/site-packages/pymavlink/generator/lib/minixsv/__pycache__/xsvalBase.cpython-35.pyc' is in +CONTENTS but not on filesystem! robotpkg_admin: py35-mavlink-1.1.62: File `/opt/openrobots/lib/python3.5/site-packages/pymavlink/generator/lib/minixsv/__pycache__/xsvalBase.cpython-35.opt-1.pyc' is in +CONTENTS but not on filesystem! robotpkg_admin: py35-mavlink-1.1.62: File `/opt/openrobots/lib/python3.5/site-packages/pymavlink/generator/lib/minixsv/__pycache__/xsvalErrorHandler.cpython-35.pyc' is in +CONTENTS but not on filesystem! robotpkg_admin: py35-mavlink-1.1.62: File `/opt/openrobots/lib/python3.5/site-packages/pymavlink/generator/lib/minixsv/__pycache__/xsvalErrorHandler.cpython-35.opt-1.pyc' is in +CONTENTS but not on filesystem! robotpkg_admin: py35-mavlink-1.1.62: File `/opt/openrobots/lib/python3.5/site-packages/pymavlink/generator/lib/minixsv/__pycache__/xsvalSchema.cpython-35.pyc' is in +CONTENTS but not on filesystem! robotpkg_admin: py35-mavlink-1.1.62: File `/opt/openrobots/lib/python3.5/site-packages/pymavlink/generator/lib/minixsv/__pycache__/xsvalSchema.cpython-35.opt-1.pyc' is in +CONTENTS but not on filesystem! robotpkg_admin: py35-mavlink-1.1.62: File `/opt/openrobots/lib/python3.5/site-packages/pymavlink/generator/lib/minixsv/__pycache__/xsvalSimpleTypes.cpython-35.pyc' is in +CONTENTS but not on filesystem! robotpkg_admin: py35-mavlink-1.1.62: File `/opt/openrobots/lib/python3.5/site-packages/pymavlink/generator/lib/minixsv/__pycache__/xsvalSimpleTypes.cpython-35.opt-1.pyc' is in +CONTENTS but not on filesystem! robotpkg_admin: py35-mavlink-1.1.62: File `/opt/openrobots/lib/python3.5/site-packages/pymavlink/generator/lib/minixsv/__pycache__/xsvalUtils.cpython-35.pyc' is in +CONTENTS but not on filesystem! robotpkg_admin: py35-mavlink-1.1.62: File `/opt/openrobots/lib/python3.5/site-packages/pymavlink/generator/lib/minixsv/__pycache__/xsvalUtils.cpython-35.opt-1.pyc' is in +CONTENTS but not on filesystem! robotpkg_create: can't stat `/opt/openrobots/lib/python3.5/site-packages/mavnative.so' robotpkg_create: can't stat `/opt/openrobots/lib/python3.5/site-packages/pymavlink/generator/lib/genxmlif/__pycache__/__init__.cpython-35.pyc' robotpkg_create: can't stat `/opt/openrobots/lib/python3.5/site-packages/pymavlink/generator/lib/genxmlif/__pycache__/__init__.cpython-35.opt-1.pyc' robotpkg_create: can't stat `/opt/openrobots/lib/python3.5/site-packages/pymavlink/generator/lib/genxmlif/__pycache__/xmlif4Dom.cpython-35.pyc' robotpkg_create: can't stat `/opt/openrobots/lib/python3.5/site-packages/pymavlink/generator/lib/genxmlif/__pycache__/xmlif4Dom.cpython-35.opt-1.pyc' robotpkg_create: can't stat `/opt/openrobots/lib/python3.5/site-packages/pymavlink/generator/lib/genxmlif/__pycache__/xmlifApi.cpython-35.pyc' robotpkg_create: can't stat `/opt/openrobots/lib/python3.5/site-packages/pymavlink/generator/lib/genxmlif/__pycache__/xmlifApi.cpython-35.opt-1.pyc' robotpkg_create: can't stat `/opt/openrobots/lib/python3.5/site-packages/pymavlink/generator/lib/genxmlif/__pycache__/xmlifDom.cpython-35.pyc' robotpkg_create: can't stat `/opt/openrobots/lib/python3.5/site-packages/pymavlink/generator/lib/genxmlif/__pycache__/xmlifDom.cpython-35.opt-1.pyc' robotpkg_create: can't stat `/opt/openrobots/lib/python3.5/site-packages/pymavlink/generator/lib/genxmlif/__pycache__/xmlifElementTree.cpython-35.pyc' robotpkg_create: can't stat `/opt/openrobots/lib/python3.5/site-packages/pymavlink/generator/lib/genxmlif/__pycache__/xmlifElementTree.cpython-35.opt-1.pyc' robotpkg_create: can't stat `/opt/openrobots/lib/python3.5/site-packages/pymavlink/generator/lib/genxmlif/__pycache__/xmlifMinidom.cpython-35.pyc' robotpkg_create: can't stat `/opt/openrobots/lib/python3.5/site-packages/pymavlink/generator/lib/genxmlif/__pycache__/xmlifMinidom.cpython-35.opt-1.pyc' robotpkg_create: can't stat `/opt/openrobots/lib/python3.5/site-packages/pymavlink/generator/lib/genxmlif/__pycache__/xmlifUtils.cpython-35.pyc' robotpkg_create: can't stat `/opt/openrobots/lib/python3.5/site-packages/pymavlink/generator/lib/genxmlif/__pycache__/xmlifUtils.cpython-35.opt-1.pyc' robotpkg_create: can't stat `/opt/openrobots/lib/python3.5/site-packages/pymavlink/generator/lib/genxmlif/__pycache__/xmliftest.cpython-35.pyc' robotpkg_create: can't stat `/opt/openrobots/lib/python3.5/site-packages/pymavlink/generator/lib/genxmlif/__pycache__/xmliftest.cpython-35.opt-1.pyc' robotpkg_create: can't stat `/opt/openrobots/lib/python3.5/site-packages/pymavlink/generator/lib/minixsv/__pycache__/minixsvWrapper.cpython-35.pyc' robotpkg_create: can't stat `/opt/openrobots/lib/python3.5/site-packages/pymavlink/generator/lib/minixsv/__pycache__/minixsvWrapper.cpython-35.opt-1.pyc' robotpkg_create: can't stat `/opt/openrobots/lib/python3.5/site-packages/pymavlink/generator/lib/minixsv/__pycache__/pyxsval.cpython-35.pyc' robotpkg_create: can't stat `/opt/openrobots/lib/python3.5/site-packages/pymavlink/generator/lib/minixsv/__pycache__/pyxsval.cpython-35.opt-1.pyc' robotpkg_create: can't stat `/opt/openrobots/lib/python3.5/site-packages/pymavlink/generator/lib/minixsv/__pycache__/xsvalBase.cpython-35.pyc' robotpkg_create: can't stat `/opt/openrobots/lib/python3.5/site-packages/pymavlink/generator/lib/minixsv/__pycache__/xsvalBase.cpython-35.opt-1.pyc' robotpkg_create: can't stat `/opt/openrobots/lib/python3.5/site-packages/pymavlink/generator/lib/minixsv/__pycache__/xsvalErrorHandler.cpython-35.pyc' robotpkg_create: can't stat `/opt/openrobots/lib/python3.5/site-packages/pymavlink/generator/lib/minixsv/__pycache__/xsvalErrorHandler.cpython-35.opt-1.pyc' robotpkg_create: can't stat `/opt/openrobots/lib/python3.5/site-packages/pymavlink/generator/lib/minixsv/__pycache__/xsvalSchema.cpython-35.pyc' robotpkg_create: can't stat `/opt/openrobots/lib/python3.5/site-packages/pymavlink/generator/lib/minixsv/__pycache__/xsvalSchema.cpython-35.opt-1.pyc' robotpkg_create: can't stat `/opt/openrobots/lib/python3.5/site-packages/pymavlink/generator/lib/minixsv/__pycache__/xsvalSimpleTypes.cpython-35.pyc' robotpkg_create: can't stat `/opt/openrobots/lib/python3.5/site-packages/pymavlink/generator/lib/minixsv/__pycache__/xsvalSimpleTypes.cpython-35.opt-1.pyc' robotpkg_create: can't stat `/opt/openrobots/lib/python3.5/site-packages/pymavlink/generator/lib/minixsv/__pycache__/xsvalUtils.cpython-35.pyc' robotpkg_create: can't stat `/opt/openrobots/lib/python3.5/site-packages/pymavlink/generator/lib/minixsv/__pycache__/xsvalUtils.cpython-35.opt-1.pyc' robotpkg_create: lstat failed for file lib/python3.5/site-packages/mavnative.so: No such file or directory make[3]: *** [pkg-tarup] Error 2 => Unlinking package in /opt/robotpkg/var/lib/robotpkg/wip/packages/bsd/Ubuntu-16.04-x86_64/All => Unlinking package in /opt/robotpkg/var/lib/robotpkg/wip/packages/bsd/Ubuntu-16.04-x86_64/pub => Unlinking package in /opt/robotpkg/var/lib/robotpkg/wip/packages/bsd/Ubuntu-16.04-x86_64/jrl => Unlinking package in /opt/robotpkg/var/lib/robotpkg/wip/packages/bsd/Ubuntu-16.04-x86_64/pal => Updating debian binary packages make[2]: *** [package-failed] Error 2 => Marking py35-mavlink-1.1.62 as broken ERROR: make: *** [package] Error 2 robotpkg_delete: Couldn't remove /opt/openrobots/lib/python3.5/site-packages/mavnative.so robotpkg_delete: Couldn't remove /opt/openrobots/lib/python3.5/site-packages/pymavlink/generator/lib/genxmlif/__pycache__/__init__.cpython-35.pyc robotpkg_delete: Couldn't remove /opt/openrobots/lib/python3.5/site-packages/pymavlink/generator/lib/genxmlif/__pycache__/__init__.cpython-35.opt-1.pyc robotpkg_delete: Couldn't remove /opt/openrobots/lib/python3.5/site-packages/pymavlink/generator/lib/genxmlif/__pycache__/xmlif4Dom.cpython-35.pyc robotpkg_delete: Couldn't remove /opt/openrobots/lib/python3.5/site-packages/pymavlink/generator/lib/genxmlif/__pycache__/xmlif4Dom.cpython-35.opt-1.pyc robotpkg_delete: Couldn't remove /opt/openrobots/lib/python3.5/site-packages/pymavlink/generator/lib/genxmlif/__pycache__/xmlifApi.cpython-35.pyc robotpkg_delete: Couldn't remove /opt/openrobots/lib/python3.5/site-packages/pymavlink/generator/lib/genxmlif/__pycache__/xmlifApi.cpython-35.opt-1.pyc robotpkg_delete: Couldn't remove /opt/openrobots/lib/python3.5/site-packages/pymavlink/generator/lib/genxmlif/__pycache__/xmlifDom.cpython-35.pyc robotpkg_delete: Couldn't remove /opt/openrobots/lib/python3.5/site-packages/pymavlink/generator/lib/genxmlif/__pycache__/xmlifDom.cpython-35.opt-1.pyc robotpkg_delete: Couldn't remove /opt/openrobots/lib/python3.5/site-packages/pymavlink/generator/lib/genxmlif/__pycache__/xmlifElementTree.cpython-35.pyc robotpkg_delete: Couldn't remove /opt/openrobots/lib/python3.5/site-packages/pymavlink/generator/lib/genxmlif/__pycache__/xmlifElementTree.cpython-35.opt-1.pyc robotpkg_delete: Couldn't remove /opt/openrobots/lib/python3.5/site-packages/pymavlink/generator/lib/genxmlif/__pycache__/xmlifMinidom.cpython-35.pyc robotpkg_delete: Couldn't remove /opt/openrobots/lib/python3.5/site-packages/pymavlink/generator/lib/genxmlif/__pycache__/xmlifMinidom.cpython-35.opt-1.pyc robotpkg_delete: Couldn't remove /opt/openrobots/lib/python3.5/site-packages/pymavlink/generator/lib/genxmlif/__pycache__/xmlifUtils.cpython-35.pyc robotpkg_delete: Couldn't remove /opt/openrobots/lib/python3.5/site-packages/pymavlink/generator/lib/genxmlif/__pycache__/xmlifUtils.cpython-35.opt-1.pyc robotpkg_delete: Couldn't remove /opt/openrobots/lib/python3.5/site-packages/pymavlink/generator/lib/genxmlif/__pycache__/xmliftest.cpython-35.pyc robotpkg_delete: Couldn't remove /opt/openrobots/lib/python3.5/site-packages/pymavlink/generator/lib/genxmlif/__pycache__/xmliftest.cpython-35.opt-1.pyc robotpkg_delete: Couldn't remove /opt/openrobots/lib/python3.5/site-packages/pymavlink/generator/lib/minixsv/__pycache__/minixsvWrapper.cpython-35.pyc robotpkg_delete: Couldn't remove /opt/openrobots/lib/python3.5/site-packages/pymavlink/generator/lib/minixsv/__pycache__/minixsvWrapper.cpython-35.opt-1.pyc robotpkg_delete: Couldn't remove /opt/openrobots/lib/python3.5/site-packages/pymavlink/generator/lib/minixsv/__pycache__/pyxsval.cpython-35.pyc robotpkg_delete: Couldn't remove /opt/openrobots/lib/python3.5/site-packages/pymavlink/generator/lib/minixsv/__pycache__/pyxsval.cpython-35.opt-1.pyc robotpkg_delete: Couldn't remove /opt/openrobots/lib/python3.5/site-packages/pymavlink/generator/lib/minixsv/__pycache__/xsvalBase.cpython-35.pyc robotpkg_delete: Couldn't remove /opt/openrobots/lib/python3.5/site-packages/pymavlink/generator/lib/minixsv/__pycache__/xsvalBase.cpython-35.opt-1.pyc robotpkg_delete: Couldn't remove /opt/openrobots/lib/python3.5/site-packages/pymavlink/generator/lib/minixsv/__pycache__/xsvalErrorHandler.cpython-35.pyc robotpkg_delete: Couldn't remove /opt/openrobots/lib/python3.5/site-packages/pymavlink/generator/lib/minixsv/__pycache__/xsvalErrorHandler.cpython-35.opt-1.pyc robotpkg_delete: Couldn't remove /opt/openrobots/lib/python3.5/site-packages/pymavlink/generator/lib/minixsv/__pycache__/xsvalSchema.cpython-35.pyc robotpkg_delete: Couldn't remove /opt/openrobots/lib/python3.5/site-packages/pymavlink/generator/lib/minixsv/__pycache__/xsvalSchema.cpython-35.opt-1.pyc robotpkg_delete: Couldn't remove /opt/openrobots/lib/python3.5/site-packages/pymavlink/generator/lib/minixsv/__pycache__/xsvalSimpleTypes.cpython-35.pyc robotpkg_delete: Couldn't remove /opt/openrobots/lib/python3.5/site-packages/pymavlink/generator/lib/minixsv/__pycache__/xsvalSimpleTypes.cpython-35.opt-1.pyc robotpkg_delete: Couldn't remove /opt/openrobots/lib/python3.5/site-packages/pymavlink/generator/lib/minixsv/__pycache__/xsvalUtils.cpython-35.pyc robotpkg_delete: Couldn't remove /opt/openrobots/lib/python3.5/site-packages/pymavlink/generator/lib/minixsv/__pycache__/xsvalUtils.cpython-35.opt-1.pyc robotpkg_delete: Directory `/opt/openrobots/share/mavlink' disappeared, skipping ===> Logging bulk summary for py35-mavlink-1.1.62 => Checking leftover files WARNING: 1 files leftover. => Creating bulk log files => Logging bulk metadata ===> Cleaning temporary files for py35-mavlink-1.1.62 ===> Done bulk for py35-mavlink-1.1.62 [24%] Processing wip/py-mavlink:py27-mavlink-1.1.62 ===> Bulk building for py27-mavlink-1.1.62 Binary package for py27-mavlink-1.1.62 is up-to-date. [25%] Processing wip/py-mavlink:py32-mavlink-1.1.62 ===> Bulk building for py32-mavlink-1.1.62 Binary package for py32-mavlink-1.1.62 is up-to-date. [25%] Processing wip/py-mavlink:py34-mavlink-1.1.62 ===> Bulk building for py34-mavlink-1.1.62 Binary package for py34-mavlink-1.1.62 is up-to-date. [25%] Processing wip/py-mavlink:py36-mavlink-1.1.62 ===> Bulk building for py36-mavlink-1.1.62 Binary package for py36-mavlink-1.1.62 is up-to-date. [26%] Processing wip/py-mavlink:py37-mavlink-1.1.62 ===> Bulk building for py37-mavlink-1.1.62 Binary package for py37-mavlink-1.1.62 is up-to-date. [26%] Processing wip/prf-ros-control:prf-ros-control-0.2.6r3 ===> Bulk building for prf-ros-control-0.2.6r3 Binary package for prf-ros-control-0.2.6r3 is up-to-date. [28%] Processing wip/libhatp:libhatp-1.3.0 ===> Bulk building for libhatp-1.3.0 Binary package for libhatp-1.3.0 is up-to-date. [30%] Processing wip/libmove3d-hri:libmove3d-hri-2.24 ===> Bulk building for libmove3d-hri-2.24 Binary package for libmove3d-hri-2.24 is up-to-date. [30%] Processing wip/prf-gazebo-ros-pkgs:prf-gazebo-ros-pkgs-2.6.7r4 ===> Bulk building for prf-gazebo-ros-pkgs-2.6.7r4 Binary package for prf-gazebo-ros-pkgs-2.6.7r4 is up-to-date. [30%] Processing wip/head-action:head-action-0.0.1r4 ===> Bulk building for head-action-0.0.1r4 Binary package for head-action-0.0.1r4 is up-to-date. [31%] Processing wip/certi:certi-3.5.1 ===> Cleaning temporary files for certi-3.5.1 ===> Bulk building for certi-3.5.1 => Checking for clear installation => Installing /opt/robotpkg/var/lib/robotpkg/packages/bsd/Ubuntu-16.04-x86_64/All/digest-20080510.tgz => Installing /opt/robotpkg/var/lib/robotpkg/packages/bsd/Ubuntu-16.04-x86_64/All/tnftp-20130505~ssl.tgz => Required robotpkg package digest>=20080510: digest-20080510 found => Required robotpkg package tnftp>=20091122: tnftp-20130505~ssl found => Required system package gnupg>=1: gnupg-1.4.20 found => Required system package gzip: gzip-1.6 found => Required system package pax and tar archivers: pax found => Required system package pkg_install>=20110805.9: pkg_install-20110805.9 found => Required system package pkgrepo2deb>=1.4: pkgrepo2deb-1.4 found => Dependency digest-20080510 already installed => Dependency tnftp-20130505~ssl already installed => Building with no option. => Use the GNU C++ compiler: c++-compiler provided by g++>=3 => Use the GNU C compiler: c-compiler provided by gcc>=3 => Required system package bison: bison found => Required system package cmake>=2.8.11: cmake-3.5.1 found => Required system package flex>=2.5.33: flex-2.6.0 found => Required system package g++>=3: g++-5.4.0 found => Required system package gcc>=3: gcc-5.4.0 found => Required system package libstdc++: libstdc++ found => Required system package libxml2>=2: libxml2-2.9.3 found => SHA1 checksums OK => RMD160 checksums OK An unexpected error occured. The last 10 log lines are shown below. | make[1]: *** Waiting for unfinished jobs.... | [ 96%] Linking CXX shared library libRTI1516e.so | cd /local/robotpkg/var/tmp/robotpkg/wip/certi/work/CERTI-3.5.1-Source/libRTI/ieee1516-2010 && /usr/bin/cmake -E cmake_link_script CMakeFiles/RTI1516e.dir/link.txt --verbose=1 | /usr/bin/g++ -fPIC -pipe -O3 -DNDEBUG -fmessage-length=0 -fvisibility=hidden -std=c++98 -Wall -Woverloaded-virtual -Wno-unused-function -shared -Wl,-soname,libRTI1516e.so.1 -o libRTI1516e.so.1.0.0 CMakeFiles/RTI1516e.dir/RTIambassadorFactory.cpp.o CMakeFiles/RTI1516e.dir/Exception.cpp.o CMakeFiles/RTI1516e.dir/RTIvariableLengthData.cpp.o CMakeFiles/RTI1516e.dir/RTIambassador.cpp.o CMakeFiles/RTI1516e.dir/RTIambassadorImplementation.cpp.o CMakeFiles/RTI1516e.dir/RTIambPrivateRefs.cpp.o CMakeFiles/RTI1516e.dir/Handle.cpp.o CMakeFiles/RTI1516e.dir/HandleImplementation.cpp.o CMakeFiles/RTI1516e.dir/RTIfedAmbassador.cpp.o CMakeFiles/RTI1516e.dir/RTIHandleFactory.cpp.o CMakeFiles/RTI1516e.dir/Typedefs.cpp.o ../../libCERTI/libCERTI.so.3.5.1 libFedTime1516e.so ../../libHLA/libHLA.so.3.5.1 -lrt -lxml2 -Wl,-rpath,/local/robotpkg/var/tmp/robotpkg/wip/certi/work/CERTI-3.5.1-Source/libCERTI:/local/robotpkg/var/tmp/robotpkg/wip/certi/work/CERTI-3.5.1-Source/libRTI/ieee1516-2010:/local/robotpkg/var/tmp/robotpkg/wip/certi/work/CERTI-3.5.1-Source/libHLA: => Marking certi-3.5.1 as broken | cd /local/robotpkg/var/tmp/robotpkg/wip/certi/work/CERTI-3.5.1-Source/libRTI/ieee1516-2010 && /usr/bin/cmake -E cmake_symlink_library libRTI1516e.so.1.0.0 libRTI1516e.so.1 libRTI1516e.so | make[2]: Leaving directory '/local/robotpkg/var/tmp/robotpkg/wip/certi/work/CERTI-3.5.1-Source' | [ 96%] Built target RTI1516e | make[1]: Leaving directory '/local/robotpkg/var/tmp/robotpkg/wip/certi/work/CERTI-3.5.1-Source' | Makefile:163: recipe for target 'all' failed | make: *** [all] Error 2 For details or bug reports, check the complete log file in: /local/robotpkg/var/tmp/robotpkg/wip/certi/work/build.log make[3]: *** [do-build] Error 2 make[2]: *** [pkg-check-installed] Error 2 ERROR: make: *** [package] Error 2 ===> Logging bulk summary for certi-3.5.1 => Checking leftover files => Creating bulk log files => Logging bulk metadata ===> Cleaning temporary files for certi-3.5.1 ===> Done bulk for certi-3.5.1 [31%] Processing wip/gdalwrap:gdalwrap-0.1.10 ===> Bulk building for gdalwrap-0.1.10 Binary package for gdalwrap-0.1.10 is up-to-date. [32%] Processing wip/mumps:mumps-4.10.0 ===> Bulk building for mumps-4.10.0 Binary package for mumps-4.10.0 is up-to-date. [32%] Processing wip/metapod:metapod-1.0.10 Warning: DOXYGEN_PLIST_DIR in wip/metapod is deprecated. Warning: use DYNAMIC_PLIST_DIRS instead. ===> Bulk building for metapod-1.0.10 Binary package for metapod-1.0.10 is up-to-date. [32%] Processing wip/jsbsim:jsbsim-20150424 ===> Bulk building for jsbsim-20150424 Binary package for jsbsim-20150424 is up-to-date. [33%] Processing wip/dptu-genom3:dptu-genom3-0.2~pocolibs-client-c+codels+openprs+pocolibs-server+!* ===> Bulk building for dptu-genom3-0.2~codels+openprs+pocolibs-client-c+pocolibs-server Binary package for dptu-genom3-0.2~codels+openprs+pocolibs-client-c+pocolibs-server is up-to-date. [33%] Processing wip/dptu-genom3:dptu-genom3-0.2~codels+openprs+ros-client-c+ros-client-ros+ros-server+!* ===> Bulk building for dptu-genom3-0.2~codels+openprs+ros-client-c+ros-client-ros+ros-server Binary package for dptu-genom3-0.2~codels+openprs+ros-client-c+ros-client-ros+ros-server is up-to-date. [33%] Processing wip/ros-swri-serial-util:ros-swri-serial-util-2.3.0 ===> Bulk building for ros-swri-serial-util-2.3.0 Binary package for ros-swri-serial-util-2.3.0 is up-to-date. [34%] Processing wip/ros-swri-string-util:ros-swri-string-util-2.3.0 ===> Cleaning temporary files for ros-swri-string-util-2.3.0 ===> Bulk building for ros-swri-string-util-2.3.0 => Checking for clear installation => Installing /opt/robotpkg/var/lib/robotpkg/packages/bsd/Ubuntu-16.04-x86_64/All/digest-20080510.tgz => Installing /opt/robotpkg/var/lib/robotpkg/packages/bsd/Ubuntu-16.04-x86_64/All/tnftp-20130505~ssl.tgz => Required robotpkg package digest>=20080510: digest-20080510 found => Required robotpkg package tnftp>=20130505~ssl: tnftp-20130505~ssl found => Required system package gnupg>=1: gnupg-1.4.20 found => Required system package gzip: gzip-1.6 found => Required system package pax and tar archivers: pax found => Required system package pkg_install>=20110805.9: pkg_install-20110805.9 found => Required system package pkgrepo2deb>=1.4: pkgrepo2deb-1.4 found => Dependency digest-20080510 already installed => Installing /opt/robotpkg/var/lib/robotpkg/packages/bsd/Ubuntu-16.04-x86_64/All/ros-catkin-0.7.14.tgz => Dependency tnftp-20130505~ssl already installed => Building with no option. => Use the GNU C++ compiler: c++-compiler provided by g++>=3 => Use the GNU C compiler: c-compiler provided by gcc>=3 => Use python-2.7: python>=2.5<3.8 provided by python27>=2.7<2.8 => Use ros melodic: ros==melodic provided by ros-melodic => Required system package cmake>=2.8.3: cmake-3.5.1 found => Required system package g++>=3: g++-5.4.0 found => Required system package gcc>=3: gcc-5.4.0 found => Required system package googletest: googletest found => Required system package libstdc++: libstdc++ found => Required system package pkg-config>=0.22: pkg-config-0.29.1 found => Required system package py27-empy>=3: py27-empy-3.3.2 found => Required system package py27-nose>=0.10: py27-nose-1.3.7 found => Required system package python27>=2.7<2.8: python27-2.7.12 found => Required robotpkg package ros-catkin>=0.7<0.8: ros-catkin-0.7.14 found => SHA1 checksums OK => RMD160 checksums OK An unexpected error occured. The last 10 log lines are shown below. | | Add the installation prefix of "rostest" to CMAKE_PREFIX_PATH or set | "rostest_DIR" to a directory containing one of the above files. If | "rostest" provides a separate development package or SDK, be sure it has | been installed. | | | -- Configuring incomplete, errors occurred! | See also "/local/robotpkg/var/tmp/robotpkg/wip/ros-swri-string-util/work/marti_common-2.3.0/swri_string_util/CMakeFiles/CMakeOutput.log". | See also "/local/robotpkg/var/tmp/robotpkg/wip/ros-swri-string-util/work/marti_common-2.3.0/swri_string_util/CMakeFiles/CMakeError.log". For details or bug reports, check the complete log file in: /local/robotpkg/var/tmp/robotpkg/wip/ros-swri-string-util/work/configure.log make[3]: *** [do-configure-cmake] Error 1 make[2]: *** [pkg-check-installed] Error 2 => Marking ros-swri-string-util-2.3.0 as broken ERROR: make: *** [package] Error 2 ===> Logging bulk summary for ros-swri-string-util-2.3.0 => Checking leftover files => Creating bulk log files => Logging bulk metadata ===> Cleaning temporary files for ros-swri-string-util-2.3.0 ===> Done bulk for ros-swri-string-util-2.3.0 [34%] Processing wip/can-utils:can-utils-2018.02.0 ===> Bulk building for can-utils-2018.02.0 Binary package for can-utils-2018.02.0 is up-to-date. [35%] Processing wip/tf-lookup:tf-lookup-0.0.1r1 ===> Bulk building for tf-lookup-0.0.1r1 Binary package for tf-lookup-0.0.1r1 is up-to-date. [35%] Processing wip/ros-swri-math-util:ros-swri-math-util-2.3.0 ===> Bulk building for ros-swri-math-util-2.3.0 Binary package for ros-swri-math-util-2.3.0 is up-to-date. [35%] Processing wip/hrp2-14-description:hrp2-14-description-1.0.5 ===> Bulk building for hrp2-14-description-1.0.5 Binary package for hrp2-14-description-1.0.5 is up-to-date. [36%] Processing wip/hrp2-computer-monitor:hrp2-computer-monitor-1.0.2 ===> Bulk building for hrp2-computer-monitor-1.0.2 Binary package for hrp2-computer-monitor-1.0.2 is up-to-date. [36%] Processing wip/FRILibrary:FRILibrary-1.2r1 ===> Bulk building for FRILibrary-1.2r1 Binary package for FRILibrary-1.2r1 is up-to-date. [36%] Processing wip/pal-transmissions:pal-transmissions-0.2.2r2 ===> Bulk building for pal-transmissions-0.2.2r2 Binary package for pal-transmissions-0.2.2r2 is up-to-date. [37%] Processing wip/py-hla:py27-hla-1.1.1r1 ===> Cleaning temporary files for py27-hla-1.1.1r1 ===> Bulk building for py27-hla-1.1.1r1 => Checking for clear installation => Installing /opt/robotpkg/var/lib/robotpkg/packages/bsd/Ubuntu-16.04-x86_64/All/digest-20080510.tgz => Installing /opt/robotpkg/var/lib/robotpkg/packages/bsd/Ubuntu-16.04-x86_64/All/tnftp-20130505~ssl.tgz => Required robotpkg package digest>=20080510: digest-20080510 found => Required robotpkg package tnftp>=20091122: tnftp-20130505~ssl found => Required system package gnupg>=1: gnupg-1.4.20 found => Required system package gzip: gzip-1.6 found => Required system package patch>=2.0: patch-2.7.5 found => Required system package pax and tar archivers: pax found => Required system package pkg_install>=20110805.9: pkg_install-20110805.9 found => Required system package pkgrepo2deb>=1.4: pkgrepo2deb-1.4 found ERROR: Required robotpkg package certi>=3.4.0: BROKEN => Dependency digest-20080510 already installed => Dependency tnftp-20130505~ssl already installed ===> Logging bulk summary for py27-hla-1.1.1r1 => Checking leftover files => Creating bulk log files => Logging bulk metadata ===> Cleaning temporary files for py27-hla-1.1.1r1 ===> Done bulk for py27-hla-1.1.1r1 [37%] Processing wip/py-hla:py32-hla-1.1.1r1 ===> Bulk building for py32-hla-1.1.1r1 Binary package for py32-hla-1.1.1r1 is up-to-date. [38%] Processing wip/py-hla:py34-hla-1.1.1r1 ===> Bulk building for py34-hla-1.1.1r1 Binary package for py34-hla-1.1.1r1 is up-to-date. [38%] Processing wip/py-hla:py35-hla-1.1.1r1 ===> Cleaning temporary files for py35-hla-1.1.1r1 ===> Bulk building for py35-hla-1.1.1r1 => Checking for clear installation => Installing /opt/robotpkg/var/lib/robotpkg/packages/bsd/Ubuntu-16.04-x86_64/All/digest-20080510.tgz => Installing /opt/robotpkg/var/lib/robotpkg/packages/bsd/Ubuntu-16.04-x86_64/All/tnftp-20130505~ssl.tgz => Required robotpkg package digest>=20080510: digest-20080510 found => Required robotpkg package tnftp>=20091122: tnftp-20130505~ssl found => Required system package gnupg>=1: gnupg-1.4.20 found => Required system package gzip: gzip-1.6 found => Required system package patch>=2.0: patch-2.7.5 found => Required system package pax and tar archivers: pax found => Required system package pkg_install>=20110805.9: pkg_install-20110805.9 found => Required system package pkgrepo2deb>=1.4: pkgrepo2deb-1.4 found ERROR: Required robotpkg package certi>=3.4.0: BROKEN => Dependency digest-20080510 already installed => Dependency tnftp-20130505~ssl already installed ===> Logging bulk summary for py35-hla-1.1.1r1 => Checking leftover files => Creating bulk log files => Logging bulk metadata ===> Cleaning temporary files for py35-hla-1.1.1r1 ===> Done bulk for py35-hla-1.1.1r1 [38%] Processing wip/py-hla:py36-hla-1.1.1r1 ===> Bulk building for py36-hla-1.1.1r1 Binary package for py36-hla-1.1.1r1 is up-to-date. [39%] Processing wip/py-hla:py37-hla-1.1.1r1 ===> Bulk building for py37-hla-1.1.1r1 Binary package for py37-hla-1.1.1r1 is up-to-date. [39%] Processing wip/ompl:ompl-1.0.0 ===> Bulk building for ompl-1.0.0 Binary package for ompl-1.0.0 is up-to-date. [39%] Processing wip/pyrene-motions:pyrene-motions ===> Cleaning temporary files for pyrene-motions ===> Bulk building for pyrene-motions => Checking for clear installation => Installing /opt/robotpkg/var/lib/robotpkg/packages/bsd/Ubuntu-16.04-x86_64/All/digest-20080510.tgz => Installing /opt/robotpkg/var/lib/robotpkg/packages/bsd/Ubuntu-16.04-x86_64/All/tnftp-20130505~ssl.tgz => Required robotpkg package digest>=20080510: digest-20080510 found => Required robotpkg package tnftp>=20091122: tnftp-20130505~ssl found => Required system package gnupg>=1: gnupg-1.4.20 found => Required system package gzip: gzip-1.6 found => Required system package pax and tar archivers: pax found => Required system package pkg_install>=20110805.9: pkg_install-20110805.9 found => Required system package pkgrepo2deb>=1.4: pkgrepo2deb-1.4 found => Dependency digest-20080510 already installed => Dependency tnftp-20130505~ssl already installed => Building with no option. => Use the GNU C++ compiler: c++-compiler provided by g++>=3 => Use the GNU C compiler: c-compiler provided by gcc>=3 => Required system package cmake>=2.6: cmake-3.5.1 found => Required system package g++>=3: g++-5.4.0 found => Required system package gcc>=3: gcc-5.4.0 found => Required system package libstdc++: libstdc++ found => Required system package pkg-config>=0.22: pkg-config-0.29.1 found => SHA1 checksums OK => RMD160 checksums OK => Adding run-time search paths to pkg-config files => Registering installation for pyrene-motions make[3]: *** [pkg-tarup] Error 1 => Unlinking package in /opt/robotpkg/var/lib/robotpkg/wip/packages/bsd/Ubuntu-16.04-x86_64/All => Unlinking package in /opt/robotpkg/var/lib/robotpkg/wip/packages/bsd/Ubuntu-16.04-x86_64/pub => Unlinking package in /opt/robotpkg/var/lib/robotpkg/wip/packages/bsd/Ubuntu-16.04-x86_64/jrl => Unlinking package in /opt/robotpkg/var/lib/robotpkg/wip/packages/bsd/Ubuntu-16.04-x86_64/pal => Updating debian binary packages make[3]: *** [deb-package] Error 1 make[2]: *** [package-failed] Error 2 => Marking pyrene-motions as broken ERROR: make: *** [package] Error 2 ===> Logging bulk summary for pyrene-motions => Checking leftover files WARNING: 47 files leftover. => Creating bulk log files => Logging bulk metadata ===> Cleaning temporary files for pyrene-motions ===> Done bulk for pyrene-motions [40%] Processing wip/infuse-asn1-types:infuse-asn1-types-0.3 ===> Cleaning temporary files for infuse-asn1-types-0.3 ===> Bulk building for infuse-asn1-types-0.3 => Checking for clear installation => Installing /opt/robotpkg/var/lib/robotpkg/packages/bsd/Ubuntu-16.04-x86_64/All/digest-20080510.tgz => Installing /opt/robotpkg/var/lib/robotpkg/packages/bsd/Ubuntu-16.04-x86_64/All/tnftp-20130505~ssl.tgz => Required robotpkg package digest>=20080510: digest-20080510 found => Required robotpkg package tnftp>=20091122: tnftp-20130505~ssl found => Required system package gnupg>=1: gnupg-1.4.20 found => Required system package gzip: gzip-1.6 found => Required system package pax and tar archivers: pax found => Required system package pkg_install>=20110805.9: pkg_install-20110805.9 found => Required system package pkgrepo2deb>=1.4: pkgrepo2deb-1.4 found => Dependency digest-20080510 already installed => Required system package mono>=4.2: MISSING => Dependency tnftp-20130505~ssl already installed ERROR: ====================================================================== ERROR: Missing system packages required for infuse-asn1-types-0.3: ERROR: ERROR: mono>=4.2 (Ubuntu package mono-devel) ERROR: ERROR: Please use the system package management tool to install these ERROR: dependencies. If a robotpkg version of a dependency is available, ERROR: you can configure robotpkg.conf to use this version instead. ERROR: ERROR: See /local/robotpkg/var/tmp/robotpkg/wip/infuse-asn1-types/work/sysdep.log for details. ERROR: ====================================================================== make[2]: *** [sys-depends] Error 2 ===> Logging bulk summary for infuse-asn1-types-0.3 => Checking leftover files => Creating bulk log files => Logging bulk metadata ===> Cleaning temporary files for infuse-asn1-types-0.3 ===> Done bulk for infuse-asn1-types-0.3 [40%] Processing wip/talos-data:talos-data-0.0.20 ===> Bulk building for talos-data-0.0.20 Binary package for talos-data-0.0.20 is up-to-date. [40%] Processing wip/backward-ros:backward-ros-0.1.4r3 ===> Bulk building for backward-ros-0.1.4r3 Binary package for backward-ros-0.1.4r3 is up-to-date. [41%] Processing wip/move3d-assets:move3d-assets-20120125 ===> Bulk building for move3d-assets-20120125 Binary package for move3d-assets-20120125 is up-to-date. [41%] Processing wip/ros-swri-nodelet:ros-swri-nodelet-2.3.0 ===> Cleaning temporary files for ros-swri-nodelet-2.3.0 ===> Bulk building for ros-swri-nodelet-2.3.0 => Checking for clear installation => Installing /opt/robotpkg/var/lib/robotpkg/packages/bsd/Ubuntu-16.04-x86_64/All/digest-20080510.tgz => Installing /opt/robotpkg/var/lib/robotpkg/packages/bsd/Ubuntu-16.04-x86_64/All/tnftp-20130505~ssl.tgz => Required robotpkg package digest>=20080510: digest-20080510 found => Required robotpkg package tnftp>=20130505~ssl: tnftp-20130505~ssl found => Required system package gnupg>=1: gnupg-1.4.20 found => Required system package gzip: gzip-1.6 found => Required system package pax and tar archivers: pax found => Required system package pkg_install>=20110805.9: pkg_install-20110805.9 found => Required system package pkgrepo2deb>=1.4: pkgrepo2deb-1.4 found => Dependency digest-20080510 already installed => Installing /opt/robotpkg/var/lib/robotpkg/packages/bsd/Ubuntu-16.04-x86_64/All/ros-catkin-0.7.14.tgz => Installing /opt/robotpkg/var/lib/robotpkg/packages/bsd/Ubuntu-16.04-x86_64/All/ros-comm-1.14.3.tgz => Installing /opt/robotpkg/var/lib/robotpkg/packages/bsd/Ubuntu-16.04-x86_64/All/ros-nodelet-core-1.9.16.tgz => Dependency ros-std-msgs-0.5.11 already installed => Dependency tnftp-20130505~ssl already installed => Building with no option. => Use the GNU C++ compiler: c++-compiler provided by g++>=3 => Use the GNU C compiler: c-compiler provided by gcc>=3 => Use python-2.7: python>=2.5<3.8 provided by python27>=2.7<2.8 => Use ros melodic: ros==melodic provided by ros-melodic => Required system package cmake>=2.8.3: cmake-3.5.1 found => Required system package g++>=3: g++-5.4.0 found => Required system package gcc>=3: gcc-5.4.0 found => Required system package googletest: googletest found => Required system package libstdc++: libstdc++ found => Required system package pkg-config>=0.22: pkg-config-0.29.1 found => Required system package py27-empy>=3: py27-empy-3.3.2 found => Required system package py27-nose>=0.10: py27-nose-1.3.7 found => Required system package python27>=2.7<2.8: python27-2.7.12 found => Required robotpkg package ros-catkin>=0.7<0.8: ros-catkin-0.7.14 found => Required robotpkg package ros-comm>=1.13<1.15: ros-comm-1.14.3 found => Required robotpkg package ros-nodelet-core>=1.9<1.10: ros-nodelet-core-1.9.16 found => Required robotpkg package ros-std-msgs>=0.5: ros-std-msgs-0.5.11 found => SHA1 checksums OK => RMD160 checksums OK An unexpected error occured. The last 10 log lines are shown below. | if (nullptr == obj) { | ^ | make[2]: *** [CMakeFiles/swri_nodelet_test.dir/src/test_nodelet.cpp.o] Error 1 | CMakeFiles/swri_nodelet_test.dir/build.make:65: recipe for target 'CMakeFiles/swri_nodelet_test.dir/src/test_nodelet.cpp.o' failed | make[2]: Leaving directory '/local/robotpkg/var/tmp/robotpkg/wip/ros-swri-nodelet/work/marti_common-2.3.0/swri_nodelet' | make[1]: *** [CMakeFiles/swri_nodelet_test.dir/all] Error 2 | CMakeFiles/Makefile2:1072: recipe for target 'CMakeFiles/swri_nodelet_test.dir/all' failed | make[1]: Leaving directory '/local/robotpkg/var/tmp/robotpkg/wip/ros-swri-nodelet/work/marti_common-2.3.0/swri_nodelet' | Makefile:130: recipe for target 'all' failed | make: *** [all] Error 2 For details or bug reports, check the complete log file in: /local/robotpkg/var/tmp/robotpkg/wip/ros-swri-nodelet/work/build.log make[3]: *** [do-build] Error 2 make[2]: *** [pkg-check-installed] Error 2 => Marking ros-swri-nodelet-2.3.0 as broken ERROR: make: *** [package] Error 2 ===> Logging bulk summary for ros-swri-nodelet-2.3.0 => Checking leftover files => Creating bulk log files => Logging bulk metadata ===> Cleaning temporary files for ros-swri-nodelet-2.3.0 ===> Done bulk for ros-swri-nodelet-2.3.0 [42%] Processing wip/morse-hla:morse-hla-1.4 ===> Cleaning temporary files for morse-hla-1.4 ===> Bulk building for morse-hla-1.4 => Checking for clear installation => Installing /opt/robotpkg/var/lib/robotpkg/packages/bsd/Ubuntu-16.04-x86_64/All/digest-20080510.tgz => Installing /opt/robotpkg/var/lib/robotpkg/packages/bsd/Ubuntu-16.04-x86_64/All/tnftp-20130505~ssl.tgz => Required robotpkg package digest>=20080510: digest-20080510 found => Required robotpkg package tnftp>=20091122: tnftp-20130505~ssl found => Required system package gnupg>=1: gnupg-1.4.20 found => Required system package gzip: gzip-1.6 found => Required system package patch>=2.0: patch-2.7.5 found => Required system package pax and tar archivers: pax found => Required system package pkg_install>=20110805.9: pkg_install-20110805.9 found => Required system package pkgrepo2deb>=1.4: pkgrepo2deb-1.4 found => Dependency digest-20080510 already installed => Installing /opt/robotpkg/var/lib/robotpkg/packages/bsd/Ubuntu-16.04-x86_64/All/morse-1.4~doc.tgz ERROR: Required robotpkg package py35-hla>=1.1.1: BROKEN => Dependency tnftp-20130505~ssl already installed ===> Logging bulk summary for morse-hla-1.4 => Checking leftover files => Creating bulk log files => Logging bulk metadata ===> Cleaning temporary files for morse-hla-1.4 ===> Done bulk for morse-hla-1.4 [42%] Processing wip/pal-hardware-interfaces:pal-hardware-interfaces-0.0.3 ===> Bulk building for pal-hardware-interfaces-0.0.3 Binary package for pal-hardware-interfaces-0.0.3 is up-to-date. [42%] Processing wip/hrp2-bringup:hrp2-bringup-1.0.6 ===> Bulk building for hrp2-bringup-1.0.6 Binary package for hrp2-bringup-1.0.6 is up-to-date. [43%] Processing wip/gerard-bauzil:gerard-bauzil-1.0.1 ===> Bulk building for gerard-bauzil-1.0.1 Binary package for gerard-bauzil-1.0.1 is up-to-date. [43%] Processing wip/urg:urg-0.8.18 ===> Bulk building for urg-0.8.18 Binary package for urg-0.8.18 is up-to-date. [43%] Processing wip/spark-genom:spark-genom-3.9 ===> Cleaning temporary files for spark-genom-3.9~mightability+openprs+tcl+tclserv_client ===> Bulk building for spark-genom-3.9~mightability+openprs+tcl+tclserv_client => Checking for clear installation => Installing /opt/robotpkg/var/lib/robotpkg/packages/bsd/Ubuntu-16.04-x86_64/All/digest-20080510.tgz => Installing /opt/robotpkg/var/lib/robotpkg/packages/bsd/Ubuntu-16.04-x86_64/All/tnftp-20130505~ssl.tgz => Required robotpkg package digest>=20080510: digest-20080510 found => Required robotpkg package tnftp>=20091122: tnftp-20130505~ssl found => Required system package gnupg>=1: gnupg-1.4.20 found => Required system package gzip: gzip-1.6 found => Required system package patch>=2.0: patch-2.7.5 found => Required system package pax and tar archivers: pax found => Required system package pkg_install>=20110805.9: pkg_install-20110805.9 found => Required system package pkgrepo2deb>=1.4: pkgrepo2deb-1.4 found => Dependency digest-20080510 already installed => Installing /opt/robotpkg/var/lib/robotpkg/packages/bsd/Ubuntu-16.04-x86_64/All/genBasic-genom-0.4r1~openprs+tcl+tclserv_client.tgz => Installing /opt/robotpkg/var/lib/robotpkg/packages/bsd/Ubuntu-16.04-x86_64/All/genHum-genom-1.1r1~openprs+tcl+tclserv_client.tgz => Installing /opt/robotpkg/var/lib/robotpkg/packages/bsd/Ubuntu-16.04-x86_64/All/genManip-genom-0.9~openprs+tcl+tclserv_client.tgz => Dependency genom-2.12~doc already installed => Installing /opt/robotpkg/var/lib/robotpkg/wip/packages/bsd/Ubuntu-16.04-x86_64/All/libmove3d-3.22.0r1.tgz => Installing /opt/robotpkg/var/lib/robotpkg/wip/packages/bsd/Ubuntu-16.04-x86_64/All/libmove3d-hri-2.24.tgz => Installing /opt/robotpkg/var/lib/robotpkg/packages/bsd/Ubuntu-16.04-x86_64/All/libt3d-2.6~doc.tgz => Dependency libtclserv_client-0.5r1 already installed => Installing /opt/robotpkg/var/lib/robotpkg/packages/bsd/Ubuntu-16.04-x86_64/All/mkdep-2.9.tgz => Installing /opt/robotpkg/var/lib/robotpkg/packages/bsd/Ubuntu-16.04-x86_64/All/mocap-genom-1.3~openprs+tcl+tclserv_client.tgz => Installing /opt/robotpkg/var/lib/robotpkg/packages/bsd/Ubuntu-16.04-x86_64/All/niut-genom-0.6~openprs+tcl+tclserv_client.tgz => Dependency pocolibs-2.17 already installed => Installing /opt/robotpkg/var/lib/robotpkg/packages/bsd/Ubuntu-16.04-x86_64/All/pom-genom-0.7~openprs+tcl+tclserv_client.tgz => Dependency tclserv-2.8.1 already installed => Dependency tnftp-20130505~ssl already installed => Dependency transgen-1.1b1 already installed => Installing /opt/robotpkg/var/lib/robotpkg/packages/bsd/Ubuntu-16.04-x86_64/All/viman-genom-1.6~openprs+tcl+tclserv_client.tgz => Building with the following options: => Use the GNU C++ compiler: c++-compiler provided by g++>=3 => Use the GNU C compiler: c-compiler provided by gcc>=3 => Use tcl-8.6: tcl>=8.4 provided by tcl86>=8.6<8.7 => Required system package autoconf>=2.59: autoconf-2.69 found => Required system package boost-headers>=1.34.1: boost-headers-1.58 found => Required system package g++>=3: g++-5.4.0 found => Required system package gcc>=3: gcc-5.4.0 found => Required system package GNU m4>=1.4: gm4-1.4.17 found => Required system package libstdc++: libstdc++ found => Required system package libtool>=1.5.22: libtool-2.4.6 found => Required system package perl>=5: perl-5 found => Required system package pkg-config>=0.22: pkg-config-0.29.1 found => Required system package tcl86>=8.6<8.7: tcl86-8.6 found => Required robotpkg package genBasic-genom>=0.1: genBasic-genom-0.4r1~openprs+tcl+tclserv_client found => Required robotpkg package genHum-genom>=1.1: genHum-genom-1.1r1~openprs+tcl+tclserv_client found => Required robotpkg package genManip-genom>=0.9: genManip-genom-0.9~openprs+tcl+tclserv_client found => Required robotpkg package genom>=2.9: genom-2.12~doc found => Required robotpkg package libmove3d>=3.22.0: libmove3d-3.22.0r1 found => Required robotpkg package libmove3d-hri>=2.24: libmove3d-hri-2.24 found => Required robotpkg package libt3d>=2.6: libt3d-2.6~doc found => Required robotpkg package libtclserv_client>=0.3: libtclserv_client-0.5r1 found => Required robotpkg package mkdep>=2.6: mkdep-2.9 found => Required robotpkg package mocap-genom>=1.3: mocap-genom-1.3~openprs+tcl+tclserv_client found => Required robotpkg package niut-genom>=0.6: niut-genom-0.6~openprs+tcl+tclserv_client found => Required robotpkg package pocolibs>=2.17: pocolibs-2.17 found => Required robotpkg package pom-genom>=0.5r1: pom-genom-0.7~openprs+tcl+tclserv_client found => Required robotpkg package tclserv>=2.7: tclserv-2.8.1 found => Required robotpkg package transgen>=1.1b0: transgen-1.1b1 found => Required robotpkg package viman-genom>=1.4: viman-genom-1.6~openprs+tcl+tclserv_client found => SHA1 checksums OK => RMD160 checksums OK => Applying robotpkg patches for spark-genom-3.9~mightability+openprs+tcl+tclserv_client => Generating spark module An unexpected error occured. The last 10 log lines are shown below. | _override_vars_wip_libmove3d=PKGREQD PKGREQD PKGREQD | --- | Running set -e;cd /local/robotpkg/var/tmp/robotpkg/wip/spark-genom/work/spark-genom-3.9 && | /usr/bin/env CONFIG_SHELL=/bin/sh LIBS='' 'CPPFLAGS=' 'CFLAGS=-pipe -O3 -DNDEBUG' 'LDFLAGS=' 'CXXFLAGS=-pipe -O3 -DNDEBUG' PREFIX='/opt/openrobots' HOME=/local/robotpkg/var/tmp/robotpkg/wip/spark-genom/work PATH='/opt/openrobots/bin:/opt/openrobots/sbin:/usr/local/sbin:/usr/local/bin:/usr/sbin:/usr/bin:/sbin:/bin' LD_LIBRARY_PATH='' | /opt/openrobots/bin/genom -DUSE_MIGHTABILITY_MAPS -o -t -x spark | Package libmove3d-planners was not found in the pkg-config search path. | Perhaps you should add the directory containing `libmove3d-planners.pc' | to the PKG_CONFIG_PATH environment variable | No package 'libmove3d-planners' found | error running /usr/bin/pkg-config For details or bug reports, check the complete log file in: /local/robotpkg/var/tmp/robotpkg/wip/spark-genom/work/configure.log make[3]: *** [genom-generate] Error 1 make[2]: *** [pkg-check-installed] Error 2 => Marking spark-genom-3.9~mightability+openprs+tcl+tclserv_client as broken ERROR: make: *** [package] Error 2 ===> Logging bulk summary for spark-genom-3.9~mightability+openprs+tcl+tclserv_client => Checking leftover files => Creating bulk log files => Logging bulk metadata ===> Cleaning temporary files for spark-genom-3.9~mightability+openprs+tcl+tclserv_client ===> Done bulk for spark-genom-3.9~mightability+openprs+tcl+tclserv_client [44%] Processing wip/dynamic-graph-v3:dynamic-graph-v3-3.2.0 ===> Bulk building for dynamic-graph-v3-3.2.0 Binary package for dynamic-graph-v3-3.2.0 is up-to-date. [44%] Processing wip/cppad:CppAD-20180000.0 ===> Bulk building for CppAD-20180000.0 Binary package for CppAD-20180000.0 is up-to-date. [45%] Processing wip/histodet:histodet-1.0r2 ===> Bulk building for histodet-1.0r2 Binary package for histodet-1.0r2 is up-to-date. [45%] Processing wip/octovis:octoviz-1.6.1 ===> Cleaning temporary files for octoviz-1.6.1 ===> Bulk building for octoviz-1.6.1 => Checking for clear installation => Installing /opt/robotpkg/var/lib/robotpkg/packages/bsd/Ubuntu-16.04-x86_64/All/digest-20080510.tgz => Installing /opt/robotpkg/var/lib/robotpkg/packages/bsd/Ubuntu-16.04-x86_64/All/tnftp-20130505~ssl.tgz => Required robotpkg package digest>=20080510: digest-20080510 found => Required robotpkg package tnftp>=20130505~ssl: tnftp-20130505~ssl found => Required system package gnupg>=1: gnupg-1.4.20 found => Required system package gzip: gzip-1.6 found => Required system package pax and tar archivers: pax found => Required system package pkg_install>=20110805.9: pkg_install-20110805.9 found => Required system package pkgrepo2deb>=1.4: pkgrepo2deb-1.4 found => Dependency digest-20080510 already installed => Required system package libqglviewer>=2.3: MISSING => Installing /opt/robotpkg/var/lib/robotpkg/packages/bsd/Ubuntu-16.04-x86_64/All/octomap-1.6.1.tgz => Dependency tnftp-20130505~ssl already installed ERROR: ====================================================================== ERROR: Missing system packages required for octoviz-1.6.1: ERROR: ERROR: libqglviewer>=2.3 (Ubuntu package libqglviewer-qt4-dev) ERROR: ERROR: Please use the system package management tool to install these ERROR: dependencies. If a robotpkg version of a dependency is available, ERROR: you can configure robotpkg.conf to use this version instead. ERROR: ERROR: See /local/robotpkg/var/tmp/robotpkg/wip/octovis/work/sysdep.log for details. ERROR: ====================================================================== make[2]: *** [sys-depends] Error 2 ===> Logging bulk summary for octoviz-1.6.1 => Checking leftover files => Creating bulk log files => Logging bulk metadata ===> Cleaning temporary files for octoviz-1.6.1 ===> Done bulk for octoviz-1.6.1 [45%] Processing wip/rqt-dynamic-graph:py27-rqt-dynamic-graph-1.0.0 ===> Bulk building for py27-rqt-dynamic-graph-1.0.0 Binary package for py27-rqt-dynamic-graph-1.0.0 is up-to-date. [46%] Processing wip/rqt-dynamic-graph:py32-rqt-dynamic-graph-1.0.0 ===> Bulk building for py32-rqt-dynamic-graph-1.0.0 Binary package for py32-rqt-dynamic-graph-1.0.0 is up-to-date. [46%] Processing wip/rqt-dynamic-graph:py34-rqt-dynamic-graph-1.0.0 ===> Bulk building for py34-rqt-dynamic-graph-1.0.0 Binary package for py34-rqt-dynamic-graph-1.0.0 is up-to-date. [46%] Processing wip/rqt-dynamic-graph:py35-rqt-dynamic-graph-1.0.0 ===> Cleaning temporary files for py35-rqt-dynamic-graph-1.0.0 ===> Bulk building for py35-rqt-dynamic-graph-1.0.0 => Checking for clear installation => Installing /opt/robotpkg/var/lib/robotpkg/packages/bsd/Ubuntu-16.04-x86_64/All/digest-20080510.tgz => Installing /opt/robotpkg/var/lib/robotpkg/packages/bsd/Ubuntu-16.04-x86_64/All/tnftp-20130505~ssl.tgz => Required robotpkg package digest>=20080510: digest-20080510 found => Required robotpkg package tnftp>=20091122: tnftp-20130505~ssl found => Required system package gnupg>=1: gnupg-1.4.20 found => Required system package gzip: gzip-1.6 found => Required system package pax and tar archivers: pax found => Required system package pkg_install>=20110805.9: pkg_install-20110805.9 found => Required system package pkgrepo2deb>=1.4: pkgrepo2deb-1.4 found => Dependency digest-20080510 already installed => Required system package py35-empy>=3: MISSING => Required system package ros-catkin>=0.7<0.8: MISSING => Required system package ros-rqt>=0.3<0.6: MISSING => Dependency tnftp-20130505~ssl already installed ERROR: ====================================================================== ERROR: Missing system packages required for py35-rqt-dynamic-graph-1.0.0: ERROR: ERROR: py35-empy>=3 (Ubuntu package python-empy (python-3.5)) ERROR: ros-catkin>=0.7<0.8 (Ubuntu package ros-kinetic-catkin) ERROR: ros-rqt>=0.3<0.6 (Ubuntu package ros-kinetic-rqt) ERROR: ERROR: Please use the system package management tool to install these ERROR: dependencies. If a robotpkg version of a dependency is available, ERROR: you can configure robotpkg.conf to use this version instead. ERROR: ERROR: See /local/robotpkg/var/tmp/robotpkg/wip/rqt-dynamic-graph/work/sysdep.log for details. ERROR: ====================================================================== make[2]: *** [sys-depends] Error 2 ===> Logging bulk summary for py35-rqt-dynamic-graph-1.0.0 => Checking leftover files => Creating bulk log files => Logging bulk metadata ===> Cleaning temporary files for py35-rqt-dynamic-graph-1.0.0 ===> Done bulk for py35-rqt-dynamic-graph-1.0.0 [47%] Processing wip/rqt-dynamic-graph:py36-rqt-dynamic-graph-1.0.0 ===> Bulk building for py36-rqt-dynamic-graph-1.0.0 Binary package for py36-rqt-dynamic-graph-1.0.0 is up-to-date. [47%] Processing wip/rqt-dynamic-graph:py37-rqt-dynamic-graph-1.0.0 ===> Bulk building for py37-rqt-dynamic-graph-1.0.0 Binary package for py37-rqt-dynamic-graph-1.0.0 is up-to-date. [47%] Processing wip/prf-ros-controllers:prf-ros-controllers-0.3.5r3 ===> Bulk building for prf-ros-controllers-0.3.5r3 Binary package for prf-ros-controllers-0.3.5r3 is up-to-date. [48%] Processing wip/py-morse:py32-morse-1.4 ===> Bulk building for py32-morse-1.4 Binary package for py32-morse-1.4 is up-to-date. [48%] Processing wip/py-morse:py34-morse-1.4 ===> Bulk building for py34-morse-1.4 Binary package for py34-morse-1.4 is up-to-date. [49%] Processing wip/py-morse:py35-morse-1.4 ===> Bulk building for py35-morse-1.4 Binary package for py35-morse-1.4 is up-to-date. [49%] Processing wip/py-morse:py36-morse-1.4 ===> Bulk building for py36-morse-1.4 Binary package for py36-morse-1.4 is up-to-date. [49%] Processing wip/py-morse:py37-morse-1.4 ===> Bulk building for py37-morse-1.4 Binary package for py37-morse-1.4 is up-to-date. [50%] Processing wip/simple-humanoid-description:simple-humanoid-description-1.0.1 ===> Bulk building for simple-humanoid-description-1.0.1 Binary package for simple-humanoid-description-1.0.1 is up-to-date. [50%] Processing wip/infuse-envire:infuse-envire-0.1.1 ===> Bulk building for infuse-envire-0.1.1 Binary package for infuse-envire-0.1.1 is up-to-date. [50%] Processing wip/soth:soth-2.0.3 ===> Bulk building for soth-2.0.3 Binary package for soth-2.0.3 is up-to-date. [51%] Processing wip/infuse-novatel-gps-driver-ros:infuse-novatel-gps-driver-ros-0.1.0 ===> Cleaning temporary files for infuse-novatel-gps-driver-ros-0.1.0 ===> Bulk building for infuse-novatel-gps-driver-ros-0.1.0 => Checking for clear installation => Installing /opt/robotpkg/var/lib/robotpkg/packages/bsd/Ubuntu-16.04-x86_64/All/digest-20080510.tgz => Installing /opt/robotpkg/var/lib/robotpkg/packages/bsd/Ubuntu-16.04-x86_64/All/tnftp-20130505~ssl.tgz => Required robotpkg package digest>=20080510: digest-20080510 found => Required robotpkg package tnftp>=20091122: tnftp-20130505~ssl found => Required system package gnupg>=1: gnupg-1.4.20 found => Required system package gzip: gzip-1.6 found => Required system package pax and tar archivers: pax found => Required system package pkg_install>=20110805.9: pkg_install-20110805.9 found => Required system package pkgrepo2deb>=1.4: pkgrepo2deb-1.4 found => Dependency digest-20080510 already installed WARNING: Cannot check installed version of libpcap => Required system package ros-gps-umd>=0.2.0: MISSING => Required system package ros-swri-math-util>=2.3.0: MISSING => Required system package ros-swri-nodelet>=2.3.0: MISSING => Required system package ros-swri-roscpp>=2.3.0: MISSING => Required system package ros-swri-serial-util>=2.3.0: MISSING => Required system package ros-swri-string-util>=2.3.0: MISSING => Dependency tnftp-20130505~ssl already installed ERROR: ====================================================================== ERROR: Missing system packages required for infuse-novatel-gps-driver-ros-0.1.0: ERROR: ERROR: ros-gps-umd>=0.2.0 (Ubuntu package ros-kinetic-gps-umd) ERROR: ros-swri-math-util>=2.3.0 (Ubuntu package ros-kinetic-swri-math-util) ERROR: ros-swri-nodelet>=2.3.0 (Ubuntu package ros-kinetic-swri-nodelet) ERROR: ros-swri-roscpp>=2.3.0 (Ubuntu package ros-kinetic-swri-roscpp) ERROR: ros-swri-serial-util>=2.3.0 (Ubuntu package ros-kinetic-swri-serial-util) ERROR: ros-swri-string-util>=2.3.0 (Ubuntu package ros-kinetic-swri-string-util) ERROR: ERROR: Please use the system package management tool to install these ERROR: dependencies. If a robotpkg version of a dependency is available, ERROR: you can configure robotpkg.conf to use this version instead. ERROR: ERROR: See /local/robotpkg/var/tmp/robotpkg/wip/infuse-novatel-gps-driver-ros/work/sysdep.log for details. ERROR: ====================================================================== make[2]: *** [sys-depends] Error 2 ===> Logging bulk summary for infuse-novatel-gps-driver-ros-0.1.0 => Checking leftover files => Creating bulk log files => Logging bulk metadata ===> Cleaning temporary files for infuse-novatel-gps-driver-ros-0.1.0 ===> Done bulk for infuse-novatel-gps-driver-ros-0.1.0 [51%] Processing wip/libmove3d-planners:libmove3d-planners-1.4.0 ===> Cleaning temporary files for libmove3d-planners-1.4.0 ===> Bulk building for libmove3d-planners-1.4.0 => Checking for clear installation => Installing /opt/robotpkg/var/lib/robotpkg/packages/bsd/Ubuntu-16.04-x86_64/All/digest-20080510.tgz => Installing /opt/robotpkg/var/lib/robotpkg/packages/bsd/Ubuntu-16.04-x86_64/All/tnftp-20130505~ssl.tgz => Required robotpkg package digest>=20080510: digest-20080510 found => Required robotpkg package tnftp>=20091122: tnftp-20130505~ssl found => Required system package gnupg>=1: gnupg-1.4.20 found => Required system package gzip: gzip-1.6 found => Required system package pax and tar archivers: pax found => Required system package pkg_install>=20110805.9: pkg_install-20110805.9 found => Required system package pkgrepo2deb>=1.4: pkgrepo2deb-1.4 found => Dependency digest-20080510 already installed WARNING: Cannot check installed version of libXpm => Installing /opt/robotpkg/var/lib/robotpkg/wip/packages/bsd/Ubuntu-16.04-x86_64/All/libmove3d-3.22.0r1.tgz => Installing /opt/robotpkg/var/lib/robotpkg/wip/packages/bsd/Ubuntu-16.04-x86_64/All/libmove3d-hri-2.24.tgz => Dependency tnftp-20130505~ssl already installed => Building with no option. => Use the GNU C++ compiler: c++-compiler provided by g++>=3 => Use the GNU C compiler: c-compiler provided by gcc>=3 => Required system package boost-headers>=1.34.1: boost-headers-1.58 found => Required system package boostlib-filesystem{>=1.34.1<1.49,>=1.50}: boost-lib-filesystem-1.58.0 found => Required system package boostlib-iostreams{>=1.34.1<1.49,>=1.50}: boost-lib-iostreams-1.58.0 found => Required system package boostlib-math{>=1.34.1<1.49,>=1.50}: boost-lib-math-1.58.0 found => Required system package boostlib-thread{>=1.34.1<1.49,>=1.50}: boost-lib-thread-1.58.0 found => Required system package cmake>=2.6: cmake-3.5.1 found => Required system package eigen3>=3.0.0: eigen3-3.2.92 found => Required system package g++>=3: g++-5.4.0 found => Required system package gcc>=3: gcc-5.4.0 found => Required system package glu>=7: glu-9.0.0 found => Required system package libXpm>=3.5.7: libXpm found => Required system package libstdc++: libstdc++ found => Required system package pkg-config>=0.22: pkg-config-0.29.1 found WARNING: Cannot check installed version of libXpm => Required robotpkg package libmove3d>=3.22.0: libmove3d-3.22.0r1 found => Required robotpkg package libmove3d-hri>=2.24: libmove3d-hri-2.24 found => SHA1 checksums OK => RMD160 checksums OK An unexpected error occured. The last 10 log lines are shown below. | compilation terminated. | CMakeFiles/move3d-planners.dir/build.make:382: recipe for target 'CMakeFiles/move3d-planners.dir/src/API/Grids/TwoDCell.cpp.o' failed | make[2]: *** [CMakeFiles/move3d-planners.dir/src/API/Grids/TwoDCell.cpp.o] Error 1 | make[2]: *** Waiting for unfinished jobs.... | make[2]: Leaving directory '/local/robotpkg/var/tmp/robotpkg/wip/libmove3d-planners/work/libmove3d-planners-1.4.0' | CMakeFiles/Makefile2:70: recipe for target 'CMakeFiles/move3d-planners.dir/all' failed | make[1]: Leaving directory '/local/robotpkg/var/tmp/robotpkg/wip/libmove3d-planners/work/libmove3d-planners-1.4.0' | Makefile:130: recipe for target 'all' failed | make[1]: *** [CMakeFiles/move3d-planners.dir/all] Error 2 | make: *** [all] Error 2 For details or bug reports, check the complete log file in: /local/robotpkg/var/tmp/robotpkg/wip/libmove3d-planners/work/build.log make[3]: *** [do-build] Error 2 make[2]: *** [pkg-check-installed] Error 2 => Marking libmove3d-planners-1.4.0 as broken ERROR: make: *** [package] Error 2 ===> Logging bulk summary for libmove3d-planners-1.4.0 => Checking leftover files => Creating bulk log files => Logging bulk metadata ===> Cleaning temporary files for libmove3d-planners-1.4.0 ===> Done bulk for libmove3d-planners-1.4.0 [52%] Processing wip/infuse-idl:infuse-idl-0.1.1 ===> Bulk building for infuse-idl-0.1.1 Binary package for infuse-idl-0.1.1 is up-to-date. [52%] Processing wip/ros-swri-roscpp:ros-swri-roscpp-2.3.0 ===> Bulk building for ros-swri-roscpp-2.3.0 Binary package for ros-swri-roscpp-2.3.0 is up-to-date. [53%] Processing wip/play-motion:play-motion-0.4.5 ===> Bulk building for play-motion-0.4.5 Binary package for play-motion-0.4.5 is up-to-date. [53%] Processing wip/tsid:tsid-1.1.0 ===> Bulk building for tsid-1.1.0 Binary package for tsid-1.1.0 is up-to-date. [53%] Processing wip/orocos-bfl:orocos-bfl-0.8.0 ===> Bulk building for orocos-bfl-0.8.0 Binary package for orocos-bfl-0.8.0 is up-to-date. [54%] Processing wip/py-mraa:mraa-1.9.0 ===> Cleaning temporary files for mraa-1.9.0 ===> Bulk building for mraa-1.9.0 => Checking for clear installation => Installing /opt/robotpkg/var/lib/robotpkg/packages/bsd/Ubuntu-16.04-x86_64/All/digest-20080510.tgz => Installing /opt/robotpkg/var/lib/robotpkg/packages/bsd/Ubuntu-16.04-x86_64/All/tnftp-20130505~ssl.tgz => Required robotpkg package digest>=20080510: digest-20080510 found => Required robotpkg package tnftp>=20130505~ssl: tnftp-20130505~ssl found => Required system package gnupg>=1: gnupg-1.4.20 found => Required system package gzip: gzip-1.6 found => Required system package pax and tar archivers: pax found => Required system package pkg_install>=20110805.9: pkg_install-20110805.9 found => Required system package pkgrepo2deb>=1.4: pkgrepo2deb-1.4 found => Dependency digest-20080510 already installed => Required system package libjson-c>=0.10: MISSING => Dependency tnftp-20130505~ssl already installed ERROR: ====================================================================== ERROR: Missing system packages required for mraa-1.9.0: ERROR: ERROR: libjson-c>=0.10 ERROR: ERROR: Please use the system package management tool to install these ERROR: dependencies. If a robotpkg version of a dependency is available, ERROR: you can configure robotpkg.conf to use this version instead. ERROR: ERROR: See /local/robotpkg/var/tmp/robotpkg/wip/py-mraa/work/sysdep.log for details. ERROR: ====================================================================== make[2]: *** [sys-depends] Error 2 ===> Logging bulk summary for mraa-1.9.0 => Checking leftover files => Creating bulk log files => Logging bulk metadata ===> Cleaning temporary files for mraa-1.9.0 ===> Done bulk for mraa-1.9.0 [54%] Processing wip/osg-dae:osg-dae-3.2.1r2 ===> Bulk building for osg-dae-3.2.1r2 Binary package for osg-dae-3.2.1r2 is up-to-date. [54%] Processing wip/py-jsbsim:py27-jsbsim-20150424r1 ===> Cleaning temporary files for py27-jsbsim-20150424r1 ===> Bulk building for py27-jsbsim-20150424r1 => Checking for clear installation => Installing /opt/robotpkg/var/lib/robotpkg/packages/bsd/Ubuntu-16.04-x86_64/All/digest-20080510.tgz => Installing /opt/robotpkg/var/lib/robotpkg/packages/bsd/Ubuntu-16.04-x86_64/All/tnftp-20130505~ssl.tgz => Required robotpkg package digest>=20080510: digest-20080510 found => Required robotpkg package tnftp>=20091122: tnftp-20130505~ssl found => Required system package cvs>=1: cvs-1.12.1311 found => Required system package gnupg>=1: gnupg-1.4.20 found => Required system package gzip: gzip-1.6 found => Required system package pax and tar archivers: pax found => Required system package pkg_install>=20110805.9: pkg_install-20110805.9 found => Required system package pkgrepo2deb>=1.4: pkgrepo2deb-1.4 found => Dependency digest-20080510 already installed => Installing /opt/robotpkg/var/lib/robotpkg/wip/packages/bsd/Ubuntu-16.04-x86_64/All/jsbsim-20150424.tgz => Dependency tnftp-20130505~ssl already installed => Building with no option. => Use the GNU C++ compiler: c++-compiler provided by g++>=3 => Use the GNU C compiler: c-compiler provided by gcc>=3 => Use python-2.7: python>=2.5<3.8 provided by python27>=2.7<2.8 => Required system package cmake>=2.6: cmake-3.5.1 found => Required system package g++>=3: g++-5.4.0 found => Required system package gcc>=3: gcc-5.4.0 found => Required system package libstdc++: libstdc++ found => Required system package python27>=2.7<2.8: python27-2.7.12 found => Required robotpkg package jsbsim>=1.0: jsbsim-20150424 found => SHA1 checksums OK => RMD160 checksums OK An unexpected error occured. The last 10 log lines are shown below. | Could NOT find Cython (missing: CYTHON_EXECUTABLE) | Call Stack (most recent call first): | /usr/share/cmake-3.5/Modules/FindPackageHandleStandardArgs.cmake:388 (_FPHSA_FAILURE_MESSAGE) | CMakeModules/FindCython.cmake:42 (FIND_PACKAGE_HANDLE_STANDARD_ARGS) | CMakeModules/UseCython.cmake:74 (find_package) | CMakeLists.txt:6 (include) | | | -- Configuring incomplete, errors occurred! | See also "/local/robotpkg/var/tmp/robotpkg/wip/py-jsbsim/work/jsbsim-20150424/tests/CMakeFiles/CMakeOutput.log". For details or bug reports, check the complete log file in: /local/robotpkg/var/tmp/robotpkg/wip/py-jsbsim/work/configure.log make[3]: *** [do-configure-cmake] Error 1 make[2]: *** [pkg-check-installed] Error 2 => Marking py27-jsbsim-20150424r1 as broken ERROR: make: *** [package] Error 2 ===> Logging bulk summary for py27-jsbsim-20150424r1 => Checking leftover files => Creating bulk log files => Logging bulk metadata ===> Cleaning temporary files for py27-jsbsim-20150424r1 ===> Done bulk for py27-jsbsim-20150424r1 [55%] Processing wip/py-jsbsim:py32-jsbsim-20150424r1 ===> Bulk building for py32-jsbsim-20150424r1 Binary package for py32-jsbsim-20150424r1 is up-to-date. [55%] Processing wip/py-jsbsim:py34-jsbsim-20150424r1 ===> Bulk building for py34-jsbsim-20150424r1 Binary package for py34-jsbsim-20150424r1 is up-to-date. [56%] Processing wip/py-jsbsim:py35-jsbsim-20150424r1 ===> Cleaning temporary files for py35-jsbsim-20150424r1 ===> Bulk building for py35-jsbsim-20150424r1 => Checking for clear installation => Installing /opt/robotpkg/var/lib/robotpkg/packages/bsd/Ubuntu-16.04-x86_64/All/digest-20080510.tgz => Installing /opt/robotpkg/var/lib/robotpkg/packages/bsd/Ubuntu-16.04-x86_64/All/tnftp-20130505~ssl.tgz => Required robotpkg package digest>=20080510: digest-20080510 found => Required robotpkg package tnftp>=20091122: tnftp-20130505~ssl found => Required system package cvs>=1: cvs-1.12.1311 found => Required system package gnupg>=1: gnupg-1.4.20 found => Required system package gzip: gzip-1.6 found => Required system package pax and tar archivers: pax found => Required system package pkg_install>=20110805.9: pkg_install-20110805.9 found => Required system package pkgrepo2deb>=1.4: pkgrepo2deb-1.4 found => Dependency digest-20080510 already installed => Installing /opt/robotpkg/var/lib/robotpkg/wip/packages/bsd/Ubuntu-16.04-x86_64/All/jsbsim-20150424.tgz => Dependency tnftp-20130505~ssl already installed => Building with no option. => Use the GNU C++ compiler: c++-compiler provided by g++>=3 => Use the GNU C compiler: c-compiler provided by gcc>=3 => Use python-3.5: python>=2.5<3.8 provided by python35>=3.5<3.6 => Required system package cmake>=2.6: cmake-3.5.1 found => Required system package g++>=3: g++-5.4.0 found => Required system package gcc>=3: gcc-5.4.0 found => Required system package libstdc++: libstdc++ found => Required system package python35>=3.5<3.6: python35-3.5.2 found => Required robotpkg package jsbsim>=1.0: jsbsim-20150424 found => SHA1 checksums OK => RMD160 checksums OK An unexpected error occured. The last 10 log lines are shown below. | Could NOT find Cython (missing: CYTHON_EXECUTABLE) | Call Stack (most recent call first): | /usr/share/cmake-3.5/Modules/FindPackageHandleStandardArgs.cmake:388 (_FPHSA_FAILURE_MESSAGE) | CMakeModules/FindCython.cmake:42 (FIND_PACKAGE_HANDLE_STANDARD_ARGS) | CMakeModules/UseCython.cmake:74 (find_package) | CMakeLists.txt:6 (include) | | | -- Configuring incomplete, errors occurred! | See also "/local/robotpkg/var/tmp/robotpkg/wip/py-jsbsim/work/jsbsim-20150424/tests/CMakeFiles/CMakeOutput.log". For details or bug reports, check the complete log file in: /local/robotpkg/var/tmp/robotpkg/wip/py-jsbsim/work/configure.log make[3]: *** [do-configure-cmake] Error 1 make[2]: *** [pkg-check-installed] Error 2 => Marking py35-jsbsim-20150424r1 as broken ERROR: make: *** [package] Error 2 ===> Logging bulk summary for py35-jsbsim-20150424r1 => Checking leftover files => Creating bulk log files => Logging bulk metadata ===> Cleaning temporary files for py35-jsbsim-20150424r1 ===> Done bulk for py35-jsbsim-20150424r1 [56%] Processing wip/py-jsbsim:py36-jsbsim-20150424r1 ===> Bulk building for py36-jsbsim-20150424r1 Binary package for py36-jsbsim-20150424r1 is up-to-date. [56%] Processing wip/py-jsbsim:py37-jsbsim-20150424r1 ===> Bulk building for py37-jsbsim-20150424r1 Binary package for py37-jsbsim-20150424r1 is up-to-date. [57%] Processing wip/msgconnector:msgconnector-2.13.0 ===> Bulk building for msgconnector-2.13.0~bridge-print+liboro+openprs+yarp Binary package for msgconnector-2.13.0~bridge-print+liboro+openprs+yarp is up-to-date. [57%] Processing wip/dynamic-introspection:dynamic-introspection-1.0.5 ===> Bulk building for dynamic-introspection-1.0.5 Binary package for dynamic-introspection-1.0.5 is up-to-date. [57%] Processing wip/lua-rfsm:lua-rfsm-20131212.44fcec2db5r2 ===> Bulk building for lua-rfsm-20131212.44fcec2db5r2 Binary package for lua-rfsm-20131212.44fcec2db5r2 is up-to-date. [58%] Processing wip/roralink:roralink-0.3.0-Source ===> Cleaning temporary files for roralink-0.3.0-Source ===> Bulk building for roralink-0.3.0-Source => Checking for clear installation => Installing /opt/robotpkg/var/lib/robotpkg/packages/bsd/Ubuntu-16.04-x86_64/All/digest-20080510.tgz => Installing /opt/robotpkg/var/lib/robotpkg/packages/bsd/Ubuntu-16.04-x86_64/All/tnftp-20130505~ssl.tgz => Required robotpkg package digest>=20080510: digest-20080510 found => Required robotpkg package tnftp>=20091122: tnftp-20130505~ssl found => Required system package gnupg>=1: gnupg-1.4.20 found => Required system package gzip: gzip-1.6 found => Required system package pax and tar archivers: pax found => Required system package pkg_install>=20110805.9: pkg_install-20110805.9 found => Required system package pkgrepo2deb>=1.4: pkgrepo2deb-1.4 found => Dependency digest-20080510 already installed => Dependency tnftp-20130505~ssl already installed => Building with no option. => Use the GNU C compiler: c-compiler provided by gcc>=3 => Required system package cmake>=2.6: cmake-3.5.1 found => Required system package gcc>=3: gcc-5.4.0 found => Fetching roralink-0.3.0-Source.tar.gz => Total size: 12237 bytes fetch: Unable to fetch expected file roralink-0.3.0-Source.tar.gz tnftp: Error retrieving file `404 Not Found' fetch: Unable to fetch expected file roralink-0.3.0-Source.tar.gz => Total size: 12237 bytes tnftp: Error retrieving file `404 Not Found' fetch: Unable to fetch expected file roralink-0.3.0-Source.tar.gz ERROR: Could not fetch the following file: ERROR: roralink-0.3.0-Source.tar.gz ERROR: ERROR: Please retrieve this file manually into: ERROR: /opt/robotpkg/var/lib/robotpkg/distfiles/ => Marking roralink-0.3.0-Source as broken make[3]: *** [/opt/robotpkg/var/lib/robotpkg/distfiles/roralink-0.3.0-Source.tar.gz] Error 1 make[2]: *** [pkg-check-installed] Error 2 ERROR: make: *** [package] Error 2 ===> Logging bulk summary for roralink-0.3.0-Source => Checking leftover files => Creating bulk log files => Logging bulk metadata ===> Cleaning temporary files for roralink-0.3.0-Source ===> Done bulk for roralink-0.3.0-Source [58%] Processing wip/morse-mavlink:morse-mavlink-1.4 ===> Cleaning temporary files for morse-mavlink-1.4 ===> Bulk building for morse-mavlink-1.4 => Checking for clear installation => Installing /opt/robotpkg/var/lib/robotpkg/packages/bsd/Ubuntu-16.04-x86_64/All/digest-20080510.tgz => Installing /opt/robotpkg/var/lib/robotpkg/packages/bsd/Ubuntu-16.04-x86_64/All/tnftp-20130505~ssl.tgz => Required robotpkg package digest>=20080510: digest-20080510 found => Required robotpkg package tnftp>=20091122: tnftp-20130505~ssl found => Required system package gnupg>=1: gnupg-1.4.20 found => Required system package gzip: gzip-1.6 found => Required system package patch>=2.0: patch-2.7.5 found => Required system package pax and tar archivers: pax found => Required system package pkg_install>=20110805.9: pkg_install-20110805.9 found => Required system package pkgrepo2deb>=1.4: pkgrepo2deb-1.4 found => Dependency digest-20080510 already installed => Installing /opt/robotpkg/var/lib/robotpkg/wip/packages/bsd/Ubuntu-16.04-x86_64/All/mavlink-20150929.tgz => Installing /opt/robotpkg/var/lib/robotpkg/packages/bsd/Ubuntu-16.04-x86_64/All/morse-1.4~doc.tgz ERROR: Required robotpkg package py35-mavlink>=1.1.62: BROKEN => Dependency tnftp-20130505~ssl already installed ===> Logging bulk summary for morse-mavlink-1.4 => Checking leftover files => Creating bulk log files => Logging bulk metadata ===> Cleaning temporary files for morse-mavlink-1.4 ===> Done bulk for morse-mavlink-1.4 [59%] Processing wip/antlr2:antlr2-2.7.7 ===> Bulk building for antlr2-2.7.7 Binary package for antlr2-2.7.7 is up-to-date. [59%] Processing wip/pal-msgs:pal-msgs-0.11.3 ===> Bulk building for pal-msgs-0.11.3 Binary package for pal-msgs-0.11.3 is up-to-date. [59%] Processing wip/hpp-environments:hpp-environments-4.2.0 ===> Bulk building for hpp-environments-4.2.0 Binary package for hpp-environments-4.2.0 is up-to-date. [60%] Processing wip/parametric-curves:parametric-curves-1.2.0 ===> Bulk building for parametric-curves-1.2.0 Binary package for parametric-curves-1.2.0 is up-to-date. [60%] Processing wip/example-adder:example-adder-1.0.0 ===> Bulk building for example-adder-1.0.0 Binary package for example-adder-1.0.0 is up-to-date. [60%] Processing wip/talos-moveit-config:talos-moveit-config-0.2.6r1 ===> Bulk building for talos-moveit-config-0.2.6r1 Binary package for talos-moveit-config-0.2.6r1 is up-to-date. [61%] Processing wip/ur5-description:ur5-description-1.0.1 Warning: the LICENSE of wip/ur5-description is undefined. ===> Bulk building for ur5-description-1.0.1 Binary package for ur5-description-1.0.1 is up-to-date. [61%] Processing wip/orocos-yarp_transport:orocos-yarp_transport-20150316 ===> Cleaning temporary files for orocos-yarp_transport-20150316~doc ===> Bulk building for orocos-yarp_transport-20150316~doc => Checking for clear installation => Installing /opt/robotpkg/var/lib/robotpkg/packages/bsd/Ubuntu-16.04-x86_64/All/digest-20080510.tgz => Installing /opt/robotpkg/var/lib/robotpkg/packages/bsd/Ubuntu-16.04-x86_64/All/tnftp-20130505~ssl.tgz => Required robotpkg package digest>=20080510: digest-20080510 found => Required robotpkg package tnftp>=20091122: tnftp-20130505~ssl found => Required system package git>=1.6: git-2.7.4 found => Required system package gnupg>=1: gnupg-1.4.20 found => Required system package gzip: gzip-1.6 found => Required system package pax and tar archivers: pax found => Required system package pkg_install>=20110805.9: pkg_install-20110805.9 found => Required system package pkgrepo2deb>=1.4: pkgrepo2deb-1.4 found => Dependency digest-20080510 already installed WARNING: Cannot check installed version of docbook => Installing /opt/robotpkg/var/lib/robotpkg/packages/bsd/Ubuntu-16.04-x86_64/All/orocos-rtt-2.9.0rc1.tgz => Dependency tnftp-20130505~ssl already installed => Installing /opt/robotpkg/var/lib/robotpkg/packages/bsd/Ubuntu-16.04-x86_64/All/yarp-2.3.64r3~gui.tgz => Building with the following options: => Use the GNU C++ compiler: c++-compiler provided by g++>=3 => Use the GNU C compiler: c-compiler provided by gcc>=3 => Required system package ace>=5.6: ace-6.3.3 found => Required system package cmake>=2.6: cmake-3.5.1 found => Required system package docbook>=0.6: docbook found => Required system package g++>=3: g++-5.4.0 found => Required system package gcc>=3: gcc-5.4.0 found => Required system package libstdc++: libstdc++ found WARNING: Cannot check installed version of docbook => Required robotpkg package orocos-rtt>=2.5: orocos-rtt-2.9.0rc1 found => Required robotpkg package yarp>=2.2: yarp-2.3.64r3~gui found => SHA1 checksums OK => RMD160 checksums OK An unexpected error occured. The last 10 log lines are shown below. | make[1]: *** [CMakeFiles/yarp-transport.dir/all] Error 2 | make[1]: *** Waiting for unfinished jobs.... | [ 75%] Linking CXX shared library orocos/gnulinux/yarp/plugins/libyarp-service-gnulinux.so | /usr/bin/cmake -E cmake_link_script CMakeFiles/yarp-service.dir/link.txt --verbose=1 | /usr/bin/g++ -fPIC -pipe -O3 -DNDEBUG -Wl,-z,defs -shared -Wl,-soname,libyarp-service-gnulinux.so -o orocos/gnulinux/yarp/plugins/libyarp-service-gnulinux.so CMakeFiles/yarp-service.dir/service/Yarp-service.cpp.o /opt/openrobots/lib/liborocos-rtt-gnulinux.so.2.9.0 -lboost_filesystem -lboost_system -lboost_serialization -lxerces-c -lpthread -lrt -ldl -Wl,-rpath,/opt/openrobots/lib::::::::::::::::::::::::::::::::::::::::::::::::::::::::::::::::::::::::::::::::::::::::::::::::::::::::::::::::::::::::::::::::::::::::::::::::::::::::::::::::::::::::::::::::::::::::::::::::::::::::::::::::::::::::::::::::::::::::::::::::::::::::::::::::::: | make[2]: Leaving directory '/local/robotpkg/var/tmp/robotpkg/wip/orocos-yarp_transport/work/orocos-yarp_transport-20150316' | [ 75%] Built target yarp-service | make[1]: Leaving directory '/local/robotpkg/var/tmp/robotpkg/wip/orocos-yarp_transport/work/orocos-yarp_transport-20150316' | Makefile:130: recipe for target 'all' failed => Marking orocos-yarp_transport-20150316~doc as broken | make: *** [all] Error 2 For details or bug reports, check the complete log file in: /local/robotpkg/var/tmp/robotpkg/wip/orocos-yarp_transport/work/build.log make[3]: *** [do-build] Error 2 make[2]: *** [pkg-check-installed] Error 2 ERROR: make: *** [package] Error 2 ===> Logging bulk summary for orocos-yarp_transport-20150316~doc => Checking leftover files => Creating bulk log files => Logging bulk metadata ===> Cleaning temporary files for orocos-yarp_transport-20150316~doc ===> Done bulk for orocos-yarp_transport-20150316~doc [61%] Processing wip/infuse-asn1-conversions:infuse-asn1-conversions-0.4r1 ===> Cleaning temporary files for infuse-asn1-conversions-0.4r1 ===> Bulk building for infuse-asn1-conversions-0.4r1 => Checking for clear installation => Installing /opt/robotpkg/var/lib/robotpkg/packages/bsd/Ubuntu-16.04-x86_64/All/digest-20080510.tgz => Installing /opt/robotpkg/var/lib/robotpkg/packages/bsd/Ubuntu-16.04-x86_64/All/tnftp-20130505~ssl.tgz => Required robotpkg package digest>=20080510: digest-20080510 found => Required robotpkg package tnftp>=20091122: tnftp-20130505~ssl found => Required system package gnupg>=1: gnupg-1.4.20 found => Required system package gzip: gzip-1.6 found => Required system package patch>=2.0: patch-2.7.5 found => Required system package pax and tar archivers: pax found => Required system package pkg_install>=20110805.9: pkg_install-20110805.9 found => Required system package pkgrepo2deb>=1.4: pkgrepo2deb-1.4 found => Dependency digest-20080510 already installed => Required robotpkg package infuse-asn1-types>=0.2: N/A => Dependency tnftp-20130505~ssl already installed ===> Logging bulk summary for infuse-asn1-conversions-0.4r1 => Checking leftover files => Creating bulk log files => Logging bulk metadata ===> Cleaning temporary files for infuse-asn1-conversions-0.4r1 ===> Done bulk for infuse-asn1-conversions-0.4r1 [62%] Processing wip/infuse-msgs-ros:infuse-msgs-ros-0.1.0 ===> Bulk building for infuse-msgs-ros-0.1.0 Binary package for infuse-msgs-ros-0.1.0 is up-to-date. [62%] Processing wip/talos-robot:talos-robot-1.0.2 ===> Bulk building for talos-robot-1.0.2 Binary package for talos-robot-1.0.2 is up-to-date. [63%] Processing wip/tiago-robot:tiago-robot-0.0.35os1 ===> Cleaning temporary files for tiago-robot-0.0.35os1 ===> Bulk building for tiago-robot-0.0.35os1 => Checking for clear installation => Installing /opt/robotpkg/var/lib/robotpkg/packages/bsd/Ubuntu-16.04-x86_64/All/digest-20080510.tgz => Installing /opt/robotpkg/var/lib/robotpkg/packages/bsd/Ubuntu-16.04-x86_64/All/tnftp-20130505~ssl.tgz => Required robotpkg package digest>=20080510: digest-20080510 found => Required robotpkg package tnftp>=20130505~ssl: tnftp-20130505~ssl found => Required system package gnupg>=1: gnupg-1.4.20 found => Required system package gzip: gzip-1.6 found => Required system package pax and tar archivers: pax found => Required system package pkg_install>=20110805.9: pkg_install-20110805.9 found => Required system package pkgrepo2deb>=1.4: pkgrepo2deb-1.4 found => Dependency digest-20080510 already installed => Installing /opt/robotpkg/var/lib/robotpkg/wip/packages/bsd/Ubuntu-16.04-x86_64/All/head-action-0.0.1r4.tgz => Required robotpkg package pal-gripper>=0.0.13: NOT found ERROR: Required robotpkg package pal-gripper>=0.0.13: NOT found => Required robotpkg package pmb2-robot>=1.1.8: NOT found ERROR: Required robotpkg package pmb2-robot>=1.1.8: NOT found => Installing /opt/robotpkg/var/lib/robotpkg/wip/packages/bsd/Ubuntu-16.04-x86_64/All/tf-lookup-0.0.1r1.tgz => Dependency tnftp-20130505~ssl already installed ===> Logging bulk summary for tiago-robot-0.0.35os1 => Checking leftover files => Creating bulk log files => Logging bulk metadata ===> Cleaning temporary files for tiago-robot-0.0.35os1 ===> Done bulk for tiago-robot-0.0.35os1 [63%] Processing wip/pal-gazebo-worlds:pal-gazebo-worlds-2.0.8r2 ===> Bulk building for pal-gazebo-worlds-2.0.8r2 Binary package for pal-gazebo-worlds-2.0.8r2 is up-to-date. [63%] Processing wip/prf-roboticsgroup-gazebo-plugins:prf-roboticsgroup-gazebo-plugins-0.1.0 ===> Bulk building for prf-roboticsgroup-gazebo-plugins-0.1.0 Binary package for prf-roboticsgroup-gazebo-plugins-0.1.0 is up-to-date. [64%] Processing wip/sot-core-v3:sot-core-v3-3.3.0 ===> Bulk building for sot-core-v3-3.3.0 Binary package for sot-core-v3-3.3.0 is up-to-date. [64%] Processing wip/dynamic-graph-tutorial:dynamic-graph-tutorial-1.1.1 ===> Bulk building for dynamic-graph-tutorial-1.1.1 Binary package for dynamic-graph-tutorial-1.1.1 is up-to-date. [64%] Processing wip/libnabo:libnabo-1.0.4 ===> Bulk building for libnabo-1.0.4 Binary package for libnabo-1.0.4 is up-to-date. [65%] Processing wip/py-dynamic-graph-v3:py27-dynamic-graph-v3-3.2.0 ===> Bulk building for py27-dynamic-graph-v3-3.2.0 Binary package for py27-dynamic-graph-v3-3.2.0 is up-to-date. [65%] Processing wip/py-dynamic-graph-v3:py32-dynamic-graph-v3-3.2.0 ===> Bulk building for py32-dynamic-graph-v3-3.2.0 Binary package for py32-dynamic-graph-v3-3.2.0 is up-to-date. [66%] Processing wip/py-dynamic-graph-v3:py34-dynamic-graph-v3-3.2.0 ===> Bulk building for py34-dynamic-graph-v3-3.2.0 Binary package for py34-dynamic-graph-v3-3.2.0 is up-to-date. [66%] Processing wip/py-dynamic-graph-v3:py35-dynamic-graph-v3-3.2.0 ===> Cleaning temporary files for py35-dynamic-graph-v3-3.2.0 ===> Bulk building for py35-dynamic-graph-v3-3.2.0 => Checking for clear installation => Installing /opt/robotpkg/var/lib/robotpkg/packages/bsd/Ubuntu-16.04-x86_64/All/digest-20080510.tgz => Installing /opt/robotpkg/var/lib/robotpkg/packages/bsd/Ubuntu-16.04-x86_64/All/tnftp-20130505~ssl.tgz => Required robotpkg package digest>=20080510: digest-20080510 found => Required robotpkg package tnftp>=20091122: tnftp-20130505~ssl found => Required system package gnupg>=1: gnupg-1.4.20 found => Required system package gzip: gzip-1.6 found => Required system package pax and tar archivers: pax found => Required system package pkg_install>=20110805.9: pkg_install-20110805.9 found => Required system package pkgrepo2deb>=1.4: pkgrepo2deb-1.4 found => Dependency digest-20080510 already installed => Installing /opt/robotpkg/var/lib/robotpkg/wip/packages/bsd/Ubuntu-16.04-x86_64/All/dynamic-graph-v3-3.2.0.tgz => Dependency tnftp-20130505~ssl already installed => Building with no option. => Use the GNU C++ compiler: c++-compiler provided by g++>=3 => Use the GNU C compiler: c-compiler provided by gcc>=3 => Use python-3.5: python>=2.5<3.8 provided by python35>=3.5<3.6 => Required system package cmake>=2.6: cmake-3.5.1 found => Required system package doxygen>=1.5: doxygen-1.8.11 found => Required system package eigen3>=3.0.0: eigen3-3.2.92 found => Required system package g++>=3: g++-5.4.0 found => Required system package gcc>=3: gcc-5.4.0 found => Required system package graphviz>=2: graphviz-2.38.0 found => Required system package libstdc++: libstdc++ found => Required system package pkg-config>=0.22: pkg-config-0.29.1 found => Required system package py-sphinx>=1.1: py-sphinx-1.3.6 found => Required system package python35>=3.5<3.6: python35-3.5.2 found => Required robotpkg package dynamic-graph-v3>=3.0.0: dynamic-graph-v3-3.2.0 found => SHA1 checksums OK => RMD160 checksums OK An unexpected error occured. The last 10 log lines are shown below. | Call Stack (most recent call first): | /usr/share/cmake-3.5/Modules/FindPackageHandleStandardArgs.cmake:386 (_FPHSA_FAILURE_MESSAGE) | /usr/share/cmake-3.5/Modules/FindPythonInterp.cmake:163 (FIND_PACKAGE_HANDLE_STANDARD_ARGS) | cmake/python.cmake:47 (FIND_PACKAGE) | CMakeLists.txt:45 (FINDPYTHON) | | | -- Configuring incomplete, errors occurred! | See also "/local/robotpkg/var/tmp/robotpkg/wip/py-dynamic-graph-v3/work/dynamic-graph-python-3.2.0/CMakeFiles/CMakeOutput.log". | See also "/local/robotpkg/var/tmp/robotpkg/wip/py-dynamic-graph-v3/work/dynamic-graph-python-3.2.0/CMakeFiles/CMakeError.log". For details or bug reports, check the complete log file in: /local/robotpkg/var/tmp/robotpkg/wip/py-dynamic-graph-v3/work/configure.log make[3]: *** [do-configure-cmake] Error 1 make[2]: *** [pkg-check-installed] Error 2 => Marking py35-dynamic-graph-v3-3.2.0 as broken ERROR: make: *** [package] Error 2 ===> Logging bulk summary for py35-dynamic-graph-v3-3.2.0 => Checking leftover files => Creating bulk log files => Logging bulk metadata ===> Cleaning temporary files for py35-dynamic-graph-v3-3.2.0 ===> Done bulk for py35-dynamic-graph-v3-3.2.0 [66%] Processing wip/py-dynamic-graph-v3:py36-dynamic-graph-v3-3.2.0 ===> Bulk building for py36-dynamic-graph-v3-3.2.0 Binary package for py36-dynamic-graph-v3-3.2.0 is up-to-date. [67%] Processing wip/py-dynamic-graph-v3:py37-dynamic-graph-v3-3.2.0 ===> Bulk building for py37-dynamic-graph-v3-3.2.0 Binary package for py37-dynamic-graph-v3-3.2.0 is up-to-date. [67%] Processing wip/hatponboard-lib:hatponboard-lib-3.4.0 ===> Bulk building for hatponboard-lib-3.4.0~enable-goal Binary package for hatponboard-lib-3.4.0~enable-goal is up-to-date. [67%] Processing wip/sot-torque-control:sot-torque-control-1.2.0 ===> Cleaning temporary files for sot-torque-control-1.2.0 ===> Bulk building for sot-torque-control-1.2.0 => Checking for clear installation => Installing /opt/robotpkg/var/lib/robotpkg/packages/bsd/Ubuntu-16.04-x86_64/All/digest-20080510.tgz => Installing /opt/robotpkg/var/lib/robotpkg/packages/bsd/Ubuntu-16.04-x86_64/All/tnftp-20130505~ssl.tgz => Required robotpkg package digest>=20080510: digest-20080510 found => Required robotpkg package tnftp>=20091122: tnftp-20130505~ssl found => Required system package gnupg>=1: gnupg-1.4.20 found => Required system package gzip: gzip-1.6 found => Required system package pax and tar archivers: pax found => Required system package pkg_install>=20110805.9: pkg_install-20110805.9 found => Required system package pkgrepo2deb>=1.4: pkgrepo2deb-1.4 found => Dependency digest-20080510 already installed => Installing /opt/robotpkg/var/lib/robotpkg/wip/packages/bsd/Ubuntu-16.04-x86_64/All/dynamic-graph-v3-3.2.0.tgz => Installing /opt/robotpkg/var/lib/robotpkg/packages/bsd/Ubuntu-16.04-x86_64/All/hpp-fcl-0.6.0.tgz => Installing /opt/robotpkg/var/lib/robotpkg/wip/packages/bsd/Ubuntu-16.04-x86_64/All/parametric-curves-1.2.0.tgz => Installing /opt/robotpkg/var/lib/robotpkg/packages/bsd/Ubuntu-16.04-x86_64/All/pinocchio-1.3.3.tgz => Installing /opt/robotpkg/var/lib/robotpkg/wip/packages/bsd/Ubuntu-16.04-x86_64/All/simple-humanoid-description-1.0.1.tgz => Installing /opt/robotpkg/var/lib/robotpkg/wip/packages/bsd/Ubuntu-16.04-x86_64/All/sot-core-v3-3.3.0.tgz => Dependency tnftp-20130505~ssl already installed => Installing /opt/robotpkg/var/lib/robotpkg/wip/packages/bsd/Ubuntu-16.04-x86_64/All/tsid-1.1.0.tgz => Building with no option. => Use the GNU C++ compiler: c++-compiler provided by g++>=3 => Use the GNU C compiler: c-compiler provided by gcc>=3 => Required system package boost-headers>=1.34.1: boost-headers-1.58 found => Required system package boostlib-filesystem>=1.34.1: boost-libs-1.58.0 found => Required system package boostlib-iostreams>=1.34.1: boost-libs-1.58.0 found => Required system package boostlib-math>=1.34.1: boost-libs-1.58.0 found => Required system package boostlib-thread>=1.34.1: boost-libs-1.58.0 found => Required system package cmake>=2.6: cmake-3.5.1 found => Required system package doxygen>=1.5: doxygen-1.8.11 found => Required system package eigen3>=3.0.0: eigen3-3.2.92 found => Required system package g++>=3: g++-5.4.0 found => Required system package gcc>=3: gcc-5.4.0 found => Required system package graphviz>=2: graphviz-2.38.0 found => Required system package libstdc++: libstdc++ found => Required system package pkg-config>=0.22: pkg-config-0.29.1 found => Required system package tinyxml>=2: tinyxml-2.6.2 found => Required system package urdfdom>=0.2.8<1: urdfdom-0.4.0 found => Required robotpkg package dynamic-graph-v3>=3.0.0: dynamic-graph-v3-3.2.0 found => Required robotpkg package hpp-fcl>=0.5: hpp-fcl-0.6.0 found => Required robotpkg package parametric-curves>=1.0.0: parametric-curves-1.2.0 found => Required robotpkg package pinocchio>=1.3.1: pinocchio-1.3.3 found => Required robotpkg package simple-humanoid-description>=1.0.1: simple-humanoid-description-1.0.1 found => Required robotpkg package sot-core-v3>=3.0.0: sot-core-v3-3.3.0 found => Required robotpkg package tsid>=1.0.0: tsid-1.1.0 found => Fetching sot-torque-control-1.2.0.tar.gz => Total size: 2020835 bytes fetch: Unable to fetch expected file sot-torque-control-1.2.0.tar.gz tnftp: Error retrieving file `404 Not Found' fetch: Unable to fetch expected file sot-torque-control-1.2.0.tar.gz => Total size: 2020835 bytes tnftp: Error retrieving file `404 Not Found' fetch: Unable to fetch expected file sot-torque-control-1.2.0.tar.gz ERROR: Could not fetch the following file: ERROR: sot-torque-control-1.2.0.tar.gz ERROR: ERROR: Please retrieve this file manually into: ERROR: /opt/robotpkg/var/lib/robotpkg/distfiles/ make[3]: *** [/opt/robotpkg/var/lib/robotpkg/distfiles/sot-torque-control-1.2.0.tar.gz] Error 1 make[2]: *** [pkg-check-installed] Error 2 => Marking sot-torque-control-1.2.0 as broken ERROR: make: *** [package] Error 2 ===> Logging bulk summary for sot-torque-control-1.2.0 => Checking leftover files => Creating bulk log files => Logging bulk metadata ===> Cleaning temporary files for sot-torque-control-1.2.0 ===> Done bulk for sot-torque-control-1.2.0 [68%] Processing wip/orocos-dot_service:orocos-dot_service-20120308 ===> Cleaning temporary files for orocos-dot_service-20120308 ===> Bulk building for orocos-dot_service-20120308 => Checking for clear installation => Installing /opt/robotpkg/var/lib/robotpkg/packages/bsd/Ubuntu-16.04-x86_64/All/digest-20080510.tgz => Installing /opt/robotpkg/var/lib/robotpkg/packages/bsd/Ubuntu-16.04-x86_64/All/tnftp-20130505~ssl.tgz => Required robotpkg package digest>=20080510: digest-20080510 found => Required robotpkg package tnftp>=20130505~ssl: tnftp-20130505~ssl found => Required system package gnupg>=1: gnupg-1.4.20 found => Required system package gzip: gzip-1.6 found => Required system package pax and tar archivers: pax found => Required system package pkg_install>=20110805.9: pkg_install-20110805.9 found => Required system package pkgrepo2deb>=1.4: pkgrepo2deb-1.4 found => Dependency digest-20080510 already installed => Installing /opt/robotpkg/var/lib/robotpkg/packages/bsd/Ubuntu-16.04-x86_64/All/orocos-rtt-2.9.0rc1.tgz => Dependency tnftp-20130505~ssl already installed => Building with no option. => Use the GNU C++ compiler: c++-compiler provided by g++>=3 => Use the GNU C compiler: c-compiler provided by gcc>=3 => Required system package boost-headers>=1.46.1: boost-headers-1.58 found => Required system package boostlib-filesystem>=1.46.1: boost-libs-1.58.0 found => Required system package boostlib-iostreams>=1.46.1: boost-libs-1.58.0 found => Required system package boostlib-math>=1.46.1: boost-libs-1.58.0 found => Required system package boostlib-thread>=1.46.1: boost-libs-1.58.0 found => Required system package cmake>=2.6: cmake-3.5.1 found => Required system package g++>=3: g++-5.4.0 found => Required system package gcc>=3: gcc-5.4.0 found => Required system package graphviz>=2: graphviz-2.38.0 found => Required system package libstdc++: libstdc++ found => Required robotpkg package orocos-rtt>=2: orocos-rtt-2.9.0rc1 found => SHA1 checksums OK => RMD160 checksums OK An unexpected error occured. The last 10 log lines are shown below. | std::list chns = tc->getPort(comp_ports[j])->getManager()->getChannels(); | ^ | make[2]: *** [CMakeFiles/rtt_dot_service.dir/src/rtt_dot_service.cpp.o] Error 1 | make[1]: *** [CMakeFiles/rtt_dot_service.dir/all] Error 2 | make: *** [all] Error 2 | CMakeFiles/rtt_dot_service.dir/build.make:65: recipe for target 'CMakeFiles/rtt_dot_service.dir/src/rtt_dot_service.cpp.o' failed | make[2]: Leaving directory '/local/robotpkg/var/tmp/robotpkg/wip/orocos-dot_service/work/rtt_dot_service-rtt_dot_service' => Marking orocos-dot_service-20120308 as broken | CMakeFiles/Makefile2:70: recipe for target 'CMakeFiles/rtt_dot_service.dir/all' failed | make[1]: Leaving directory '/local/robotpkg/var/tmp/robotpkg/wip/orocos-dot_service/work/rtt_dot_service-rtt_dot_service' | Makefile:130: recipe for target 'all' failed For details or bug reports, check the complete log file in: /local/robotpkg/var/tmp/robotpkg/wip/orocos-dot_service/work/build.log make[3]: *** [do-build] Error 2 make[2]: *** [pkg-check-installed] Error 2 ERROR: make: *** [package] Error 2 ===> Logging bulk summary for orocos-dot_service-20120308 => Checking leftover files => Creating bulk log files => Logging bulk metadata ===> Cleaning temporary files for orocos-dot_service-20120308 ===> Done bulk for orocos-dot_service-20120308 [68%] Processing wip/pal-gazebo-plugins:pal-gazebo-plugins-1.1.7 ===> Bulk building for pal-gazebo-plugins-1.1.7 Binary package for pal-gazebo-plugins-1.1.7 is up-to-date. [69%] Processing wip/sot-dyninv:sot-dyninv-2.0.0r1 ===> Bulk building for sot-dyninv-2.0.0r1 Binary package for sot-dyninv-2.0.0r1 is up-to-date. [69%] Processing wip/pal-hardware-gazebo:pal-hardware-gazebo-0.1.1r2 ===> Bulk building for pal-hardware-gazebo-0.1.1r2 Binary package for pal-hardware-gazebo-0.1.1r2 is up-to-date. [69%] Processing wip/jrl-walkgen-v3:jrl-walkgen-v3-4.0.4 ===> Cleaning temporary files for jrl-walkgen-v3-4.0.4 ===> Bulk building for jrl-walkgen-v3-4.0.4 => Checking for clear installation => Installing /opt/robotpkg/var/lib/robotpkg/packages/bsd/Ubuntu-16.04-x86_64/All/digest-20080510.tgz => Installing /opt/robotpkg/var/lib/robotpkg/packages/bsd/Ubuntu-16.04-x86_64/All/tnftp-20130505~ssl.tgz => Required robotpkg package digest>=20080510: digest-20080510 found => Required robotpkg package tnftp>=20091122: tnftp-20130505~ssl found => Required system package gnupg>=1: gnupg-1.4.20 found => Required system package gzip: gzip-1.6 found => Required system package pax and tar archivers: pax found => Required system package pkg_install>=20110805.9: pkg_install-20110805.9 found => Required system package pkgrepo2deb>=1.4: pkgrepo2deb-1.4 found => Dependency digest-20080510 already installed => Installing /opt/robotpkg/var/lib/robotpkg/wip/packages/bsd/Ubuntu-16.04-x86_64/All/eigen-quadprog-1.0.0.tgz => Installing /opt/robotpkg/var/lib/robotpkg/packages/bsd/Ubuntu-16.04-x86_64/All/hpp-fcl-0.6.0.tgz => Installing /opt/robotpkg/var/lib/robotpkg/packages/bsd/Ubuntu-16.04-x86_64/All/jrl-mal-1.19.6r1~jrl-mathtools.tgz => Installing /opt/robotpkg/var/lib/robotpkg/packages/bsd/Ubuntu-16.04-x86_64/All/pinocchio-1.3.3.tgz => Installing /opt/robotpkg/var/lib/robotpkg/wip/packages/bsd/Ubuntu-16.04-x86_64/All/simple-humanoid-description-1.0.1.tgz => Dependency tnftp-20130505~ssl already installed => Building with no option. => Use the GNU C++ compiler: c++-compiler provided by g++>=3 => Use the GNU C compiler: c-compiler provided by gcc>=3 => Use the GNU fortran compiler: fortran-compiler provided by => Required system package cmake>=2.6: cmake-3.5.1 found => Required system package doxygen>=1.5: doxygen-1.8.11 found => Required system package eigen3>=3.0.0: eigen3-3.2.92 found => Required system package g++>=3: g++-5.4.0 found => Required system package gcc>=3: gcc-5.4.0 found => Required system package gcc-fortran>=3: gcc-fortran-5.4.0 found => Required system package graphviz>=2: graphviz-2.38.0 found => Required system package libstdc++: libstdc++ found => Required system package pkg-config>=0.22: pkg-config-0.29.1 found => Required system package tinyxml>=2: tinyxml-2.6.2 found => Required system package urdfdom>=0.2.8<1: urdfdom-0.4.0 found => Required robotpkg package eigen-quadprog>=1.0.0: eigen-quadprog-1.0.0 found => Required robotpkg package hpp-fcl>=0.5: hpp-fcl-0.6.0 found => Required robotpkg package jrl-mal>=1.8.3: jrl-mal-1.19.6r1~jrl-mathtools found => Required robotpkg package pinocchio>=1.3.1: pinocchio-1.3.3 found => Required robotpkg package simple-humanoid-description>=1.0.1: simple-humanoid-description-1.0.1 found => SHA1 checksums OK => RMD160 checksums OK An unexpected error occured. The last 10 log lines are shown below. | ^ | src/CMakeFiles/jrl-walkgen.dir/build.make:65: recipe for target 'src/CMakeFiles/jrl-walkgen.dir/RobotDynamics/pinocchiorobot.cpp.o' failed | make[2]: *** [src/CMakeFiles/jrl-walkgen.dir/RobotDynamics/pinocchiorobot.cpp.o] Error 1 | make[2]: *** Waiting for unfinished jobs.... | make[2]: Leaving directory '/local/robotpkg/var/tmp/robotpkg/wip/jrl-walkgen-v3/work/jrl-walkgen-4.0.4' | CMakeFiles/Makefile2:536: recipe for target 'src/CMakeFiles/jrl-walkgen.dir/all' failed | make[1]: *** [src/CMakeFiles/jrl-walkgen.dir/all] Error 2 | make[1]: Leaving directory '/local/robotpkg/var/tmp/robotpkg/wip/jrl-walkgen-v3/work/jrl-walkgen-4.0.4' => Marking jrl-walkgen-v3-4.0.4 as broken | Makefile:163: recipe for target 'all' failed | make: *** [all] Error 2 For details or bug reports, check the complete log file in: /local/robotpkg/var/tmp/robotpkg/wip/jrl-walkgen-v3/work/build.log make[3]: *** [do-build] Error 2 make[2]: *** [pkg-check-installed] Error 2 ERROR: make: *** [package] Error 2 ===> Logging bulk summary for jrl-walkgen-v3-4.0.4 => Checking leftover files => Creating bulk log files => Logging bulk metadata ===> Cleaning temporary files for jrl-walkgen-v3-4.0.4 ===> Done bulk for jrl-walkgen-v3-4.0.4 [70%] Processing wip/py-example-adder:py27-example-adder-1.0.0 ===> Bulk building for py27-example-adder-1.0.0 Binary package for py27-example-adder-1.0.0 is up-to-date. [70%] Processing wip/py-example-adder:py32-example-adder-1.0.0 ===> Bulk building for py32-example-adder-1.0.0 Binary package for py32-example-adder-1.0.0 is up-to-date. [70%] Processing wip/py-example-adder:py34-example-adder-1.0.0 ===> Bulk building for py34-example-adder-1.0.0 Binary package for py34-example-adder-1.0.0 is up-to-date. [71%] Processing wip/py-example-adder:py35-example-adder-1.0.0 ===> Bulk building for py35-example-adder-1.0.0 Binary package for py35-example-adder-1.0.0 is up-to-date. [71%] Processing wip/py-example-adder:py36-example-adder-1.0.0 ===> Bulk building for py36-example-adder-1.0.0 Binary package for py36-example-adder-1.0.0 is up-to-date. [71%] Processing wip/py-example-adder:py37-example-adder-1.0.0 ===> Bulk building for py37-example-adder-1.0.0 Binary package for py37-example-adder-1.0.0 is up-to-date. [72%] Processing wip/move3d-studio:move3d-studio-1.4r3 ===> Cleaning temporary files for move3d-studio-1.4r3~qtstudio ===> Bulk building for move3d-studio-1.4r3~qtstudio => Checking for clear installation => Installing /opt/robotpkg/var/lib/robotpkg/packages/bsd/Ubuntu-16.04-x86_64/All/digest-20080510.tgz => Installing /opt/robotpkg/var/lib/robotpkg/packages/bsd/Ubuntu-16.04-x86_64/All/tnftp-20130505~ssl.tgz => Required robotpkg package digest>=20080510: digest-20080510 found => Required robotpkg package tnftp>=20091122: tnftp-20130505~ssl found => Required system package gnupg>=1: gnupg-1.4.20 found => Required system package gzip: gzip-1.6 found => Required system package pax and tar archivers: pax found => Required system package pkg_install>=20110805.9: pkg_install-20110805.9 found => Required system package pkgrepo2deb>=1.4: pkgrepo2deb-1.4 found => Dependency digest-20080510 already installed => Installing /opt/robotpkg/var/lib/robotpkg/packages/bsd/Ubuntu-16.04-x86_64/All/gbM-0.11~tcl.tgz WARNING: Cannot check installed version of glpk WARNING: Cannot check installed version of libXpm => Installing /opt/robotpkg/var/lib/robotpkg/wip/packages/bsd/Ubuntu-16.04-x86_64/All/libmove3d-3.22.0r1.tgz => Installing /opt/robotpkg/var/lib/robotpkg/wip/packages/bsd/Ubuntu-16.04-x86_64/All/libmove3d-hri-2.24.tgz ERROR: Required robotpkg package libmove3d-planners>=1.4.0: BROKEN => Dependency softMotion-libs-3.12~tcl already installed => Dependency tnftp-20130505~ssl already installed WARNING: Cannot check installed version of glpk WARNING: Cannot check installed version of libXpm ===> Logging bulk summary for move3d-studio-1.4r3~qtstudio => Checking leftover files => Creating bulk log files => Logging bulk metadata ===> Cleaning temporary files for move3d-studio-1.4r3~qtstudio ===> Done bulk for move3d-studio-1.4r3~qtstudio [72%] Processing wip/sot-tools-v3:sot-tools-v3-2.1.0 ===> Bulk building for sot-tools-v3-2.1.0 Binary package for sot-tools-v3-2.1.0 is up-to-date. [73%] Processing wip/py-dynamic-graph-bridge-v3:py27-dynamic-graph-bridge-v3-3.2.0 ===> Bulk building for py27-dynamic-graph-bridge-v3-3.2.0 Binary package for py27-dynamic-graph-bridge-v3-3.2.0 is up-to-date. [73%] Processing wip/py-dynamic-graph-bridge-v3:py32-dynamic-graph-bridge-v3-3.2.0 ===> Bulk building for py32-dynamic-graph-bridge-v3-3.2.0 Binary package for py32-dynamic-graph-bridge-v3-3.2.0 is up-to-date. [73%] Processing wip/py-dynamic-graph-bridge-v3:py34-dynamic-graph-bridge-v3-3.2.0 ===> Bulk building for py34-dynamic-graph-bridge-v3-3.2.0 Binary package for py34-dynamic-graph-bridge-v3-3.2.0 is up-to-date. [74%] Processing wip/py-dynamic-graph-bridge-v3:py35-dynamic-graph-bridge-v3-3.2.0 ===> Cleaning temporary files for py35-dynamic-graph-bridge-v3-3.2.0 ===> Bulk building for py35-dynamic-graph-bridge-v3-3.2.0 => Checking for clear installation => Installing /opt/robotpkg/var/lib/robotpkg/packages/bsd/Ubuntu-16.04-x86_64/All/digest-20080510.tgz => Installing /opt/robotpkg/var/lib/robotpkg/packages/bsd/Ubuntu-16.04-x86_64/All/tnftp-20130505~ssl.tgz => Required robotpkg package digest>=20080510: digest-20080510 found => Required robotpkg package tnftp>=20091122: tnftp-20130505~ssl found => Required system package gnupg>=1: gnupg-1.4.20 found => Required system package gzip: gzip-1.6 found => Required system package pax and tar archivers: pax found => Required system package pkg_install>=20110805.9: pkg_install-20110805.9 found => Required system package pkgrepo2deb>=1.4: pkgrepo2deb-1.4 found => Dependency digest-20080510 already installed => Installing /opt/robotpkg/var/lib/robotpkg/packages/bsd/Ubuntu-16.04-x86_64/All/dynamic-graph-bridge-msgs-0.2.0.tgz => Installing /opt/robotpkg/var/lib/robotpkg/wip/packages/bsd/Ubuntu-16.04-x86_64/All/dynamic-graph-v3-3.2.0.tgz ERROR: Required robotpkg package py35-dynamic-graph-v3>=3.0: BROKEN => Required system package py35-empy>=3: MISSING => Required system package ros-catkin>=0.7<0.8: MISSING => Required system package ros-common-msgs>=1.12<1.13: MISSING => Required system package ros-std-msgs>=0.5: MISSING => Installing /opt/robotpkg/var/lib/robotpkg/wip/packages/bsd/Ubuntu-16.04-x86_64/All/sot-core-v3-3.3.0.tgz => Dependency tnftp-20130505~ssl already installed ERROR: ====================================================================== ERROR: Missing system packages required for py35-dynamic-graph-bridge-v3-3.2.0: ERROR: ERROR: py35-empy>=3 (Ubuntu package python-empy (python-3.5)) ERROR: ros-catkin>=0.7<0.8 (Ubuntu package ros-kinetic-catkin) ERROR: ros-common-msgs>=1.12<1.13 (Ubuntu package ros-kinetic-common-msgs) ERROR: ros-std-msgs>=0.5 (Ubuntu package ros-kinetic-std-msgs) ERROR: ERROR: Please use the system package management tool to install these ERROR: dependencies. If a robotpkg version of a dependency is available, ERROR: you can configure robotpkg.conf to use this version instead. ERROR: ERROR: See /local/robotpkg/var/tmp/robotpkg/wip/py-dynamic-graph-bridge-v3/work/sysdep.log for details. ERROR: ====================================================================== make[2]: *** [sys-depends] Error 2 ===> Logging bulk summary for py35-dynamic-graph-bridge-v3-3.2.0 => Checking leftover files => Creating bulk log files => Logging bulk metadata ===> Cleaning temporary files for py35-dynamic-graph-bridge-v3-3.2.0 ===> Done bulk for py35-dynamic-graph-bridge-v3-3.2.0 [74%] Processing wip/py-dynamic-graph-bridge-v3:py36-dynamic-graph-bridge-v3-3.2.0 ===> Bulk building for py36-dynamic-graph-bridge-v3-3.2.0 Binary package for py36-dynamic-graph-bridge-v3-3.2.0 is up-to-date. [74%] Processing wip/py-dynamic-graph-bridge-v3:py37-dynamic-graph-bridge-v3-3.2.0 ===> Bulk building for py37-dynamic-graph-bridge-v3-3.2.0 Binary package for py37-dynamic-graph-bridge-v3-3.2.0 is up-to-date. [75%] Processing wip/cppadcodegen:CppADCodeGen-2.2.0 ===> Cleaning temporary files for CppADCodeGen-2.2.0 ===> Bulk building for CppADCodeGen-2.2.0 => Checking for clear installation => Installing /opt/robotpkg/var/lib/robotpkg/packages/bsd/Ubuntu-16.04-x86_64/All/digest-20080510.tgz => Installing /opt/robotpkg/var/lib/robotpkg/packages/bsd/Ubuntu-16.04-x86_64/All/tnftp-20130505~ssl.tgz => Required robotpkg package digest>=20080510: digest-20080510 found => Required robotpkg package tnftp>=20130505~ssl: tnftp-20130505~ssl found => Required system package gnupg>=1: gnupg-1.4.20 found => Required system package gzip: gzip-1.6 found => Required system package pax and tar archivers: pax found => Required system package pkg_install>=20110805.9: pkg_install-20110805.9 found => Required system package pkgrepo2deb>=1.4: pkgrepo2deb-1.4 found => Installing /opt/robotpkg/var/lib/robotpkg/wip/packages/bsd/Ubuntu-16.04-x86_64/All/CppAD-20180000.0.tgz => Dependency digest-20080510 already installed => Required system package llvm>=3.8.0: MISSING => Dependency tnftp-20130505~ssl already installed ERROR: ====================================================================== ERROR: Missing system packages required for CppADCodeGen-2.2.0: ERROR: ERROR: llvm>=3.8.0 ERROR: ERROR: Please use the system package management tool to install these ERROR: dependencies. If a robotpkg version of a dependency is available, ERROR: you can configure robotpkg.conf to use this version instead. ERROR: ERROR: See /local/robotpkg/var/tmp/robotpkg/wip/cppadcodegen/work/sysdep.log for details. ERROR: ====================================================================== make[2]: *** [sys-depends] Error 2 ===> Logging bulk summary for CppADCodeGen-2.2.0 => Checking leftover files => Creating bulk log files => Logging bulk metadata ===> Cleaning temporary files for CppADCodeGen-2.2.0 ===> Done bulk for CppADCodeGen-2.2.0 [75%] Processing wip/py-dynamic-graph-tutorial:py27-dynamic-graph-tutorial-1.1.1 ===> Bulk building for py27-dynamic-graph-tutorial-1.1.1 Binary package for py27-dynamic-graph-tutorial-1.1.1 is up-to-date. [76%] Processing wip/py-dynamic-graph-tutorial:py32-dynamic-graph-tutorial-1.1.1 ===> Bulk building for py32-dynamic-graph-tutorial-1.1.1 Binary package for py32-dynamic-graph-tutorial-1.1.1 is up-to-date. [76%] Processing wip/py-dynamic-graph-tutorial:py34-dynamic-graph-tutorial-1.1.1 ===> Bulk building for py34-dynamic-graph-tutorial-1.1.1 Binary package for py34-dynamic-graph-tutorial-1.1.1 is up-to-date. [76%] Processing wip/py-dynamic-graph-tutorial:py35-dynamic-graph-tutorial-1.1.1 ===> Cleaning temporary files for py35-dynamic-graph-tutorial-1.1.1 ===> Bulk building for py35-dynamic-graph-tutorial-1.1.1 => Checking for clear installation => Installing /opt/robotpkg/var/lib/robotpkg/packages/bsd/Ubuntu-16.04-x86_64/All/digest-20080510.tgz => Installing /opt/robotpkg/var/lib/robotpkg/packages/bsd/Ubuntu-16.04-x86_64/All/tnftp-20130505~ssl.tgz => Required robotpkg package digest>=20080510: digest-20080510 found => Required robotpkg package tnftp>=20091122: tnftp-20130505~ssl found => Required system package gnupg>=1: gnupg-1.4.20 found => Required system package gzip: gzip-1.6 found => Required system package pax and tar archivers: pax found => Required system package pkg_install>=20110805.9: pkg_install-20110805.9 found => Required system package pkgrepo2deb>=1.4: pkgrepo2deb-1.4 found => Dependency digest-20080510 already installed => Installing /opt/robotpkg/var/lib/robotpkg/wip/packages/bsd/Ubuntu-16.04-x86_64/All/dynamic-graph-tutorial-1.1.1.tgz => Dependency dynamic-graph-v3-3.2.0 already installed ERROR: Required robotpkg package py35-dynamic-graph-v3>=3.0: BROKEN => Dependency tnftp-20130505~ssl already installed ===> Logging bulk summary for py35-dynamic-graph-tutorial-1.1.1 => Checking leftover files => Creating bulk log files => Logging bulk metadata ===> Cleaning temporary files for py35-dynamic-graph-tutorial-1.1.1 ===> Done bulk for py35-dynamic-graph-tutorial-1.1.1 [77%] Processing wip/py-dynamic-graph-tutorial:py36-dynamic-graph-tutorial-1.1.1 ===> Bulk building for py36-dynamic-graph-tutorial-1.1.1 Binary package for py36-dynamic-graph-tutorial-1.1.1 is up-to-date. [77%] Processing wip/py-dynamic-graph-tutorial:py37-dynamic-graph-tutorial-1.1.1 ===> Bulk building for py37-dynamic-graph-tutorial-1.1.1 Binary package for py37-dynamic-graph-tutorial-1.1.1 is up-to-date. [77%] Processing wip/talos-simulation:talos-simulation-0.1.4r2 ===> Bulk building for talos-simulation-0.1.4r2 Binary package for talos-simulation-0.1.4r2 is up-to-date. [78%] Processing wip/sot-dynamic-pinocchio-v3:sot-dynamic-pinocchio-v3-3.2.4 ===> Bulk building for sot-dynamic-pinocchio-v3-3.2.4 Binary package for sot-dynamic-pinocchio-v3-3.2.4 is up-to-date. [78%] Processing wip/sot-dyninv-v3:sot-dyninv-v3-3.1.1r1 ===> Bulk building for sot-dyninv-v3-3.1.1r1 Binary package for sot-dyninv-v3-3.1.1r1 is up-to-date. [78%] Processing wip/py-sot-core-v3:py27-sot-core-v3-3.3.0 ===> Bulk building for py27-sot-core-v3-3.3.0 Binary package for py27-sot-core-v3-3.3.0 is up-to-date. [79%] Processing wip/py-sot-core-v3:py32-sot-core-v3-3.3.0 ===> Bulk building for py32-sot-core-v3-3.3.0 Binary package for py32-sot-core-v3-3.3.0 is up-to-date. [79%] Processing wip/py-sot-core-v3:py34-sot-core-v3-3.3.0 ===> Bulk building for py34-sot-core-v3-3.3.0 Binary package for py34-sot-core-v3-3.3.0 is up-to-date. [80%] Processing wip/py-sot-core-v3:py35-sot-core-v3-3.3.0 ===> Cleaning temporary files for py35-sot-core-v3-3.3.0 ===> Bulk building for py35-sot-core-v3-3.3.0 => Checking for clear installation => Installing /opt/robotpkg/var/lib/robotpkg/packages/bsd/Ubuntu-16.04-x86_64/All/digest-20080510.tgz => Installing /opt/robotpkg/var/lib/robotpkg/packages/bsd/Ubuntu-16.04-x86_64/All/tnftp-20130505~ssl.tgz => Required robotpkg package digest>=20080510: digest-20080510 found => Required robotpkg package tnftp>=20091122: tnftp-20130505~ssl found => Required system package gnupg>=1: gnupg-1.4.20 found => Required system package gzip: gzip-1.6 found => Required system package pax and tar archivers: pax found => Required system package pkg_install>=20110805.9: pkg_install-20110805.9 found => Required system package pkgrepo2deb>=1.4: pkgrepo2deb-1.4 found => Dependency digest-20080510 already installed => Installing /opt/robotpkg/var/lib/robotpkg/wip/packages/bsd/Ubuntu-16.04-x86_64/All/dynamic-graph-v3-3.2.0.tgz ERROR: Required robotpkg package py35-dynamic-graph-v3>=3.0: BROKEN => Installing /opt/robotpkg/var/lib/robotpkg/wip/packages/bsd/Ubuntu-16.04-x86_64/All/sot-core-v3-3.3.0.tgz => Dependency tnftp-20130505~ssl already installed ===> Logging bulk summary for py35-sot-core-v3-3.3.0 => Checking leftover files => Creating bulk log files => Logging bulk metadata ===> Cleaning temporary files for py35-sot-core-v3-3.3.0 ===> Done bulk for py35-sot-core-v3-3.3.0 [80%] Processing wip/py-sot-core-v3:py36-sot-core-v3-3.3.0 ===> Bulk building for py36-sot-core-v3-3.3.0 Binary package for py36-sot-core-v3-3.3.0 is up-to-date. [80%] Processing wip/py-sot-core-v3:py37-sot-core-v3-3.3.0 ===> Bulk building for py37-sot-core-v3-3.3.0 Binary package for py37-sot-core-v3-3.3.0 is up-to-date. [81%] Processing wip/py-parametric-curves:py27-parametric-curves-1.2.0 ===> Bulk building for py27-parametric-curves-1.2.0 Binary package for py27-parametric-curves-1.2.0 is up-to-date. [81%] Processing wip/py-parametric-curves:py32-parametric-curves-1.2.0 ===> Bulk building for py32-parametric-curves-1.2.0 Binary package for py32-parametric-curves-1.2.0 is up-to-date. [81%] Processing wip/py-parametric-curves:py34-parametric-curves-1.2.0 ===> Bulk building for py34-parametric-curves-1.2.0 Binary package for py34-parametric-curves-1.2.0 is up-to-date. [82%] Processing wip/py-parametric-curves:py35-parametric-curves-1.2.0 ===> Bulk building for py35-parametric-curves-1.2.0 Binary package for py35-parametric-curves-1.2.0 is up-to-date. [82%] Processing wip/py-parametric-curves:py36-parametric-curves-1.2.0 ===> Bulk building for py36-parametric-curves-1.2.0 Binary package for py36-parametric-curves-1.2.0 is up-to-date. [83%] Processing wip/py-parametric-curves:py37-parametric-curves-1.2.0 ===> Bulk building for py37-parametric-curves-1.2.0 Binary package for py37-parametric-curves-1.2.0 is up-to-date. [83%] Processing wip/sot-hrp2:sot-hrp2-1.1.2 ===> Bulk building for sot-hrp2-1.1.2 Binary package for sot-hrp2-1.1.2 is up-to-date. [83%] Processing wip/py-sot-torque-control:py27-sot-torque-control-1.1.0 ===> Cleaning temporary files for py27-sot-torque-control-1.1.0 ===> Bulk building for py27-sot-torque-control-1.1.0 => Checking for clear installation => Installing /opt/robotpkg/var/lib/robotpkg/packages/bsd/Ubuntu-16.04-x86_64/All/digest-20080510.tgz => Installing /opt/robotpkg/var/lib/robotpkg/packages/bsd/Ubuntu-16.04-x86_64/All/tnftp-20130505~ssl.tgz => Required robotpkg package digest>=20080510: digest-20080510 found => Required robotpkg package tnftp>=20091122: tnftp-20130505~ssl found => Required system package gnupg>=1: gnupg-1.4.20 found => Required system package gzip: gzip-1.6 found => Required system package pax and tar archivers: pax found => Required system package pkg_install>=20110805.9: pkg_install-20110805.9 found => Required system package pkgrepo2deb>=1.4: pkgrepo2deb-1.4 found => Dependency digest-20080510 already installed => Installing /opt/robotpkg/var/lib/robotpkg/wip/packages/bsd/Ubuntu-16.04-x86_64/All/dynamic-graph-v3-3.2.0.tgz => Installing /opt/robotpkg/var/lib/robotpkg/packages/bsd/Ubuntu-16.04-x86_64/All/hpp-fcl-0.6.0.tgz => Installing /opt/robotpkg/var/lib/robotpkg/wip/packages/bsd/Ubuntu-16.04-x86_64/All/parametric-curves-1.2.0.tgz => Installing /opt/robotpkg/var/lib/robotpkg/packages/bsd/Ubuntu-16.04-x86_64/All/pinocchio-1.3.3.tgz => Installing /opt/robotpkg/var/lib/robotpkg/wip/packages/bsd/Ubuntu-16.04-x86_64/All/py27-dynamic-graph-v3-3.2.0.tgz => Installing /opt/robotpkg/var/lib/robotpkg/wip/packages/bsd/Ubuntu-16.04-x86_64/All/py27-parametric-curves-1.2.0.tgz => Installing /opt/robotpkg/var/lib/robotpkg/packages/bsd/Ubuntu-16.04-x86_64/All/py27-pinocchio-1.3.3.tgz => Installing /opt/robotpkg/var/lib/robotpkg/wip/packages/bsd/Ubuntu-16.04-x86_64/All/py27-sot-core-v3-3.3.0.tgz => Installing /opt/robotpkg/var/lib/robotpkg/wip/packages/bsd/Ubuntu-16.04-x86_64/All/simple-humanoid-description-1.0.1.tgz => Dependency sot-core-v3-3.3.0 already installed => Installing /opt/robotpkg/var/lib/robotpkg/wip/packages/bsd/Ubuntu-16.04-x86_64/All/sot-torque-control-1.1.0.tgz => Dependency tnftp-20130505~ssl already installed => Dependency tsid-1.1.0 already installed => Building with no option. => Use the GNU C++ compiler: c++-compiler provided by g++>=3 => Use the GNU C compiler: c-compiler provided by gcc>=3 => Use python-2.7: python>=2.5<3.8 provided by python27>=2.7<2.8 => Required system package boost-headers>=1.34.1: boost-headers-1.58 found => Required system package boostlib-filesystem>=1.34.1: boost-libs-1.58.0 found => Required system package boostlib-iostreams>=1.34.1: boost-libs-1.58.0 found => Required system package boostlib-math>=1.34.1: boost-libs-1.58.0 found => Required system package boostlib-thread>=1.34.1: boost-libs-1.58.0 found => Required system package cmake>=2.6: cmake-3.5.1 found => Required system package doxygen>=1.5: doxygen-1.8.11 found => Required system package eigen3>=3.0.0: eigen3-3.2.92 found => Required system package g++>=3: g++-5.4.0 found => Required system package gcc>=3: gcc-5.4.0 found => Required system package graphviz>=2: graphviz-2.38.0 found => Required system package libstdc++: libstdc++ found => Required system package pkg-config>=0.22: pkg-config-0.29.1 found => Required system package py-sphinx>=1.1: py-sphinx-1.3.6 found => Required system package python27>=2.7<2.8: python27-2.7.12 found => Required system package tinyxml>=2: tinyxml-2.6.2 found => Required system package urdfdom>=0.2.8<1: urdfdom-0.4.0 found => Required robotpkg package dynamic-graph-v3>=3.0.0: dynamic-graph-v3-3.2.0 found => Required robotpkg package hpp-fcl>=0.5: hpp-fcl-0.6.0 found => Required robotpkg package parametric-curves>=1.0.0: parametric-curves-1.2.0 found => Required robotpkg package pinocchio>=1.3.1: pinocchio-1.3.3 found => Required robotpkg package py27-dynamic-graph-v3>=3.0: py27-dynamic-graph-v3-3.2.0 found => Required robotpkg package py27-parametric-curves>=1.0.0: py27-parametric-curves-1.2.0 found => Required robotpkg package py27-pinocchio: py27-pinocchio-1.3.3 found => Required robotpkg package py27-sot-core-v3>=3.0.0: py27-sot-core-v3-3.3.0 found => Required robotpkg package simple-humanoid-description>=1.0.1: simple-humanoid-description-1.0.1 found => Required robotpkg package sot-core-v3>=3.0.0: sot-core-v3-3.3.0 found => Required robotpkg package sot-torque-control>=1.0.0: sot-torque-control-1.1.0 found => Required robotpkg package tsid>=1.0.0: tsid-1.1.0 found => SHA1 checksums OK => RMD160 checksums OK An unexpected error occured. The last 10 log lines are shown below. | ^ | /local/robotpkg/var/tmp/robotpkg/wip/py-sot-torque-control/work/sot-torque-control-1.1.0/src/causal-filter.cpp:102:48: warning: conversion to 'int' from 'Eigen::EigenBase >::Index {aka long int}' may alter its value [-Wconversion] | int filter_order_n = filter_denominator.size(); | ^ | make[2]: Leaving directory '/local/robotpkg/var/tmp/robotpkg/wip/py-sot-torque-control/work/sot-torque-control-1.1.0' | CMakeFiles/Makefile2:550: recipe for target 'CMakeFiles/sot-torque-control.dir/all' failed | make[1]: Leaving directory '/local/robotpkg/var/tmp/robotpkg/wip/py-sot-torque-control/work/sot-torque-control-1.1.0' | Makefile:163: recipe for target 'all' failed | make[1]: *** [CMakeFiles/sot-torque-control.dir/all] Error 2 | make: *** [all] Error 2 For details or bug reports, check the complete log file in: /local/robotpkg/var/tmp/robotpkg/wip/py-sot-torque-control/work/build.log make[3]: *** [do-build] Error 2 make[2]: *** [pkg-check-installed] Error 2 => Marking py27-sot-torque-control-1.1.0 as broken ERROR: make: *** [package] Error 2 ===> Logging bulk summary for py27-sot-torque-control-1.1.0 => Checking leftover files => Creating bulk log files => Logging bulk metadata ===> Cleaning temporary files for py27-sot-torque-control-1.1.0 ===> Done bulk for py27-sot-torque-control-1.1.0 [84%] Processing wip/py-sot-torque-control:py32-sot-torque-control-1.1.0 ===> Bulk building for py32-sot-torque-control-1.1.0 Binary package for py32-sot-torque-control-1.1.0 is up-to-date. [84%] Processing wip/py-sot-torque-control:py34-sot-torque-control-1.1.0 ===> Bulk building for py34-sot-torque-control-1.1.0 Binary package for py34-sot-torque-control-1.1.0 is up-to-date. [84%] Processing wip/py-sot-torque-control:py35-sot-torque-control-1.1.0 ===> Cleaning temporary files for py35-sot-torque-control-1.1.0 ===> Bulk building for py35-sot-torque-control-1.1.0 => Checking for clear installation => Installing /opt/robotpkg/var/lib/robotpkg/packages/bsd/Ubuntu-16.04-x86_64/All/digest-20080510.tgz => Installing /opt/robotpkg/var/lib/robotpkg/packages/bsd/Ubuntu-16.04-x86_64/All/tnftp-20130505~ssl.tgz => Required robotpkg package digest>=20080510: digest-20080510 found => Required robotpkg package tnftp>=20091122: tnftp-20130505~ssl found => Required system package gnupg>=1: gnupg-1.4.20 found => Required system package gzip: gzip-1.6 found => Required system package pax and tar archivers: pax found => Required system package pkg_install>=20110805.9: pkg_install-20110805.9 found => Required system package pkgrepo2deb>=1.4: pkgrepo2deb-1.4 found => Dependency digest-20080510 already installed => Installing /opt/robotpkg/var/lib/robotpkg/wip/packages/bsd/Ubuntu-16.04-x86_64/All/dynamic-graph-v3-3.2.0.tgz => Installing /opt/robotpkg/var/lib/robotpkg/packages/bsd/Ubuntu-16.04-x86_64/All/hpp-fcl-0.6.0.tgz => Installing /opt/robotpkg/var/lib/robotpkg/wip/packages/bsd/Ubuntu-16.04-x86_64/All/parametric-curves-1.2.0.tgz => Installing /opt/robotpkg/var/lib/robotpkg/packages/bsd/Ubuntu-16.04-x86_64/All/pinocchio-1.3.3.tgz ERROR: Required robotpkg package py35-dynamic-graph-v3>=3.0: BROKEN => Installing /opt/robotpkg/var/lib/robotpkg/wip/packages/bsd/Ubuntu-16.04-x86_64/All/py35-parametric-curves-1.2.0.tgz => Installing /opt/robotpkg/var/lib/robotpkg/packages/bsd/Ubuntu-16.04-x86_64/All/py35-pinocchio-1.3.3.tgz ERROR: Required robotpkg package py35-sot-core-v3>=3.0.0: BROKEN => Installing /opt/robotpkg/var/lib/robotpkg/wip/packages/bsd/Ubuntu-16.04-x86_64/All/simple-humanoid-description-1.0.1.tgz => Installing /opt/robotpkg/var/lib/robotpkg/wip/packages/bsd/Ubuntu-16.04-x86_64/All/sot-core-v3-3.3.0.tgz => Installing /opt/robotpkg/var/lib/robotpkg/wip/packages/bsd/Ubuntu-16.04-x86_64/All/sot-torque-control-1.1.0.tgz => Dependency tnftp-20130505~ssl already installed => Dependency tsid-1.1.0 already installed ===> Logging bulk summary for py35-sot-torque-control-1.1.0 => Checking leftover files => Creating bulk log files => Logging bulk metadata ===> Cleaning temporary files for py35-sot-torque-control-1.1.0 ===> Done bulk for py35-sot-torque-control-1.1.0 [85%] Processing wip/py-sot-torque-control:py36-sot-torque-control-1.1.0 ===> Bulk building for py36-sot-torque-control-1.1.0 Binary package for py36-sot-torque-control-1.1.0 is up-to-date. [85%] Processing wip/py-sot-torque-control:py37-sot-torque-control-1.1.0 ===> Bulk building for py37-sot-torque-control-1.1.0 Binary package for py37-sot-torque-control-1.1.0 is up-to-date. [85%] Processing wip/sot-pattern-generator-v3:sot-pattern-generator-v3-3.1.0 ===> Bulk building for sot-pattern-generator-v3-3.1.0 Binary package for sot-pattern-generator-v3-3.1.0 is up-to-date. [86%] Processing wip/py-sot-tools-v3:py27-sot-tools-v3-2.1.0 ===> Bulk building for py27-sot-tools-v3-2.1.0 Binary package for py27-sot-tools-v3-2.1.0 is up-to-date. [86%] Processing wip/py-sot-tools-v3:py32-sot-tools-v3-2.1.0 ===> Bulk building for py32-sot-tools-v3-2.1.0 Binary package for py32-sot-tools-v3-2.1.0 is up-to-date. [87%] Processing wip/py-sot-tools-v3:py34-sot-tools-v3-2.1.0 ===> Bulk building for py34-sot-tools-v3-2.1.0 Binary package for py34-sot-tools-v3-2.1.0 is up-to-date. [87%] Processing wip/py-sot-tools-v3:py35-sot-tools-v3-2.1.0 ===> Cleaning temporary files for py35-sot-tools-v3-2.1.0 ===> Bulk building for py35-sot-tools-v3-2.1.0 => Checking for clear installation => Installing /opt/robotpkg/var/lib/robotpkg/packages/bsd/Ubuntu-16.04-x86_64/All/digest-20080510.tgz => Installing /opt/robotpkg/var/lib/robotpkg/packages/bsd/Ubuntu-16.04-x86_64/All/tnftp-20130505~ssl.tgz => Required robotpkg package digest>=20080510: digest-20080510 found => Required robotpkg package tnftp>=20091122: tnftp-20130505~ssl found => Required system package gnupg>=1: gnupg-1.4.20 found => Required system package gzip: gzip-1.6 found => Required system package pax and tar archivers: pax found => Required system package pkg_install>=20110805.9: pkg_install-20110805.9 found => Required system package pkgrepo2deb>=1.4: pkgrepo2deb-1.4 found => Dependency digest-20080510 already installed ERROR: Required robotpkg package py35-sot-core-v3>=3.0.0: BROKEN => Installing /opt/robotpkg/var/lib/robotpkg/wip/packages/bsd/Ubuntu-16.04-x86_64/All/sot-core-v3-3.3.0.tgz => Installing /opt/robotpkg/var/lib/robotpkg/wip/packages/bsd/Ubuntu-16.04-x86_64/All/sot-tools-v3-2.1.0.tgz => Dependency tnftp-20130505~ssl already installed ===> Logging bulk summary for py35-sot-tools-v3-2.1.0 => Checking leftover files => Creating bulk log files => Logging bulk metadata ===> Cleaning temporary files for py35-sot-tools-v3-2.1.0 ===> Done bulk for py35-sot-tools-v3-2.1.0 [87%] Processing wip/py-sot-tools-v3:py36-sot-tools-v3-2.1.0 ===> Bulk building for py36-sot-tools-v3-2.1.0 Binary package for py36-sot-tools-v3-2.1.0 is up-to-date. [88%] Processing wip/py-sot-tools-v3:py37-sot-tools-v3-2.1.0 ===> Bulk building for py37-sot-tools-v3-2.1.0 Binary package for py37-sot-tools-v3-2.1.0 is up-to-date. [88%] Processing wip/sot-hrp2-v3:sot-hrp2-v3-2.1.0 ===> Bulk building for sot-hrp2-v3-2.1.0 Binary package for sot-hrp2-v3-2.1.0 is up-to-date. [88%] Processing wip/py-sot-dynamic-pinocchio-v3:py27-sot-dynamic-pinocchio-v3-3.2.4 ===> Bulk building for py27-sot-dynamic-pinocchio-v3-3.2.4 Binary package for py27-sot-dynamic-pinocchio-v3-3.2.4 is up-to-date. [89%] Processing wip/py-sot-dynamic-pinocchio-v3:py32-sot-dynamic-pinocchio-v3-3.2.4 ===> Bulk building for py32-sot-dynamic-pinocchio-v3-3.2.4 Binary package for py32-sot-dynamic-pinocchio-v3-3.2.4 is up-to-date. [89%] Processing wip/py-sot-dynamic-pinocchio-v3:py34-sot-dynamic-pinocchio-v3-3.2.4 ===> Bulk building for py34-sot-dynamic-pinocchio-v3-3.2.4 Binary package for py34-sot-dynamic-pinocchio-v3-3.2.4 is up-to-date. [90%] Processing wip/py-sot-dynamic-pinocchio-v3:py35-sot-dynamic-pinocchio-v3-3.2.4 ===> Cleaning temporary files for py35-sot-dynamic-pinocchio-v3-3.2.4 ===> Bulk building for py35-sot-dynamic-pinocchio-v3-3.2.4 => Checking for clear installation => Installing /opt/robotpkg/var/lib/robotpkg/packages/bsd/Ubuntu-16.04-x86_64/All/digest-20080510.tgz => Installing /opt/robotpkg/var/lib/robotpkg/packages/bsd/Ubuntu-16.04-x86_64/All/tnftp-20130505~ssl.tgz => Required robotpkg package digest>=20080510: digest-20080510 found => Required robotpkg package tnftp>=20091122: tnftp-20130505~ssl found => Required system package gnupg>=1: gnupg-1.4.20 found => Required system package gzip: gzip-1.6 found => Required system package pax and tar archivers: pax found => Required system package pkg_install>=20110805.9: pkg_install-20110805.9 found => Required system package pkgrepo2deb>=1.4: pkgrepo2deb-1.4 found => Dependency digest-20080510 already installed => Installing /opt/robotpkg/var/lib/robotpkg/packages/bsd/Ubuntu-16.04-x86_64/All/hpp-fcl-0.6.0.tgz => Installing /opt/robotpkg/var/lib/robotpkg/packages/bsd/Ubuntu-16.04-x86_64/All/pinocchio-1.3.3.tgz => Installing /opt/robotpkg/var/lib/robotpkg/packages/bsd/Ubuntu-16.04-x86_64/All/py35-pinocchio-1.3.3.tgz ERROR: Required robotpkg package py35-sot-core-v3>=3.0.0: BROKEN ERROR: Required robotpkg package py35-sot-tools-v3>=2.0: BROKEN => Installing /opt/robotpkg/var/lib/robotpkg/wip/packages/bsd/Ubuntu-16.04-x86_64/All/sot-core-v3-3.3.0.tgz => Installing /opt/robotpkg/var/lib/robotpkg/wip/packages/bsd/Ubuntu-16.04-x86_64/All/sot-dynamic-pinocchio-v3-3.2.4.tgz robotpkg_add: Package `py27-eigenpy-1.5.0' conflicts with `py[0-9][0-9]-eigenpy-[0-9]*', and `py35-eigenpy-1.5.0' is installed. robotpkg_add: Installed package `py35-eigenpy-1.5.0' conflicts with `py[0-9][0-9]-eigenpy-[0-9]*' when trying to install `py27-eigenpy-1.5.0'. robotpkg_add: Can't install dependency py27-eigenpy>=1.4.1 robotpkg_add: 1 package addition failed => Installing /opt/robotpkg/var/lib/robotpkg/wip/packages/bsd/Ubuntu-16.04-x86_64/All/sot-tools-v3-2.1.0.tgz => Dependency tnftp-20130505~ssl already installed ===> Logging bulk summary for py35-sot-dynamic-pinocchio-v3-3.2.4 => Checking leftover files => Creating bulk log files => Logging bulk metadata ===> Cleaning temporary files for py35-sot-dynamic-pinocchio-v3-3.2.4 ===> Done bulk for py35-sot-dynamic-pinocchio-v3-3.2.4 [90%] Processing wip/py-sot-dynamic-pinocchio-v3:py36-sot-dynamic-pinocchio-v3-3.2.4 ===> Bulk building for py36-sot-dynamic-pinocchio-v3-3.2.4 Binary package for py36-sot-dynamic-pinocchio-v3-3.2.4 is up-to-date. [90%] Processing wip/py-sot-dynamic-pinocchio-v3:py37-sot-dynamic-pinocchio-v3-3.2.4 ===> Bulk building for py37-sot-dynamic-pinocchio-v3-3.2.4 Binary package for py37-sot-dynamic-pinocchio-v3-3.2.4 is up-to-date. [91%] Processing wip/openhrp3-hrp2:openhrp3-hrp2-1.2.0 ===> Bulk building for openhrp3-hrp2-1.2.0 Binary package for openhrp3-hrp2-1.2.0 is up-to-date. [91%] Processing wip/py-sot-dyninv-v3:py27-sot-dyninv-v3-3.1.1r1 ===> Bulk building for py27-sot-dyninv-v3-3.1.1r1 Binary package for py27-sot-dyninv-v3-3.1.1r1 is up-to-date. [91%] Processing wip/py-sot-dyninv-v3:py32-sot-dyninv-v3-3.1.1r1 ===> Bulk building for py32-sot-dyninv-v3-3.1.1r1 Binary package for py32-sot-dyninv-v3-3.1.1r1 is up-to-date. [92%] Processing wip/py-sot-dyninv-v3:py34-sot-dyninv-v3-3.1.1r1 ===> Bulk building for py34-sot-dyninv-v3-3.1.1r1 Binary package for py34-sot-dyninv-v3-3.1.1r1 is up-to-date. [92%] Processing wip/py-sot-dyninv-v3:py35-sot-dyninv-v3-3.1.1r1 ===> Cleaning temporary files for py35-sot-dyninv-v3-3.1.1r1 ===> Bulk building for py35-sot-dyninv-v3-3.1.1r1 => Checking for clear installation => Installing /opt/robotpkg/var/lib/robotpkg/packages/bsd/Ubuntu-16.04-x86_64/All/digest-20080510.tgz => Installing /opt/robotpkg/var/lib/robotpkg/packages/bsd/Ubuntu-16.04-x86_64/All/tnftp-20130505~ssl.tgz => Required robotpkg package digest>=20080510: digest-20080510 found => Required robotpkg package tnftp>=20091122: tnftp-20130505~ssl found => Required system package gnupg>=1: gnupg-1.4.20 found => Required system package gzip: gzip-1.6 found => Required system package pax and tar archivers: pax found => Required system package pkg_install>=20110805.9: pkg_install-20110805.9 found => Required system package pkgrepo2deb>=1.4: pkgrepo2deb-1.4 found => Dependency digest-20080510 already installed => Installing /opt/robotpkg/var/lib/robotpkg/wip/packages/bsd/Ubuntu-16.04-x86_64/All/dynamic-graph-v3-3.2.0.tgz ERROR: Required robotpkg package py35-dynamic-graph-v3>=3.0: BROKEN ERROR: Required robotpkg package py35-sot-core-v3>=3.0.0: BROKEN => Installing /opt/robotpkg/var/lib/robotpkg/wip/packages/bsd/Ubuntu-16.04-x86_64/All/sot-core-v3-3.3.0.tgz => Installing /opt/robotpkg/var/lib/robotpkg/wip/packages/bsd/Ubuntu-16.04-x86_64/All/sot-dyninv-v3-3.1.1r1.tgz => Dependency soth-2.0.3 already installed => Dependency tnftp-20130505~ssl already installed ===> Logging bulk summary for py35-sot-dyninv-v3-3.1.1r1 => Checking leftover files => Creating bulk log files => Logging bulk metadata ===> Cleaning temporary files for py35-sot-dyninv-v3-3.1.1r1 ===> Done bulk for py35-sot-dyninv-v3-3.1.1r1 [92%] Processing wip/py-sot-dyninv-v3:py36-sot-dyninv-v3-3.1.1r1 ===> Bulk building for py36-sot-dyninv-v3-3.1.1r1 Binary package for py36-sot-dyninv-v3-3.1.1r1 is up-to-date. [93%] Processing wip/py-sot-dyninv-v3:py37-sot-dyninv-v3-3.1.1r1 ===> Bulk building for py37-sot-dyninv-v3-3.1.1r1 Binary package for py37-sot-dyninv-v3-3.1.1r1 is up-to-date. [93%] Processing wip/py-sot-application-v3:py27-sot-application-v3-1.2.0r2 ===> Bulk building for py27-sot-application-v3-1.2.0r2 Binary package for py27-sot-application-v3-1.2.0r2 is up-to-date. [94%] Processing wip/py-sot-application-v3:py32-sot-application-v3-1.2.0r2 ===> Bulk building for py32-sot-application-v3-1.2.0r2 Binary package for py32-sot-application-v3-1.2.0r2 is up-to-date. [94%] Processing wip/py-sot-application-v3:py34-sot-application-v3-1.2.0r2 ===> Bulk building for py34-sot-application-v3-1.2.0r2 Binary package for py34-sot-application-v3-1.2.0r2 is up-to-date. [94%] Processing wip/py-sot-application-v3:py35-sot-application-v3-1.2.0r2 ===> Cleaning temporary files for py35-sot-application-v3-1.2.0r2 ===> Bulk building for py35-sot-application-v3-1.2.0r2 => Checking for clear installation => Installing /opt/robotpkg/var/lib/robotpkg/packages/bsd/Ubuntu-16.04-x86_64/All/digest-20080510.tgz => Installing /opt/robotpkg/var/lib/robotpkg/packages/bsd/Ubuntu-16.04-x86_64/All/tnftp-20130505~ssl.tgz => Required robotpkg package digest>=20080510: digest-20080510 found => Required robotpkg package tnftp>=20091122: tnftp-20130505~ssl found => Required system package gnupg>=1: gnupg-1.4.20 found => Required system package gzip: gzip-1.6 found => Required system package pax and tar archivers: pax found => Required system package pkg_install>=20110805.9: pkg_install-20110805.9 found => Required system package pkgrepo2deb>=1.4: pkgrepo2deb-1.4 found => Dependency digest-20080510 already installed => Required robotpkg package py35-sot-dynamic-pinocchio-v3>=3.1.1: N/A => Installing /opt/robotpkg/var/lib/robotpkg/wip/packages/bsd/Ubuntu-16.04-x86_64/All/sot-dynamic-pinocchio-v3-3.2.4.tgz => Installing /opt/robotpkg/var/lib/robotpkg/wip/packages/bsd/Ubuntu-16.04-x86_64/All/sot-dyninv-v3-3.1.1r1.tgz => Dependency tnftp-20130505~ssl already installed ===> Logging bulk summary for py35-sot-application-v3-1.2.0r2 => Checking leftover files => Creating bulk log files => Logging bulk metadata ===> Cleaning temporary files for py35-sot-application-v3-1.2.0r2 ===> Done bulk for py35-sot-application-v3-1.2.0r2 [95%] Processing wip/py-sot-application-v3:py36-sot-application-v3-1.2.0r2 ===> Bulk building for py36-sot-application-v3-1.2.0r2 Binary package for py36-sot-application-v3-1.2.0r2 is up-to-date. [95%] Processing wip/py-sot-application-v3:py37-sot-application-v3-1.2.0r2 ===> Bulk building for py37-sot-application-v3-1.2.0r2 Binary package for py37-sot-application-v3-1.2.0r2 is up-to-date. [95%] Processing wip/roscontrol-sot:roscontrol-sot-0.0.7 ===> Bulk building for roscontrol-sot-0.0.7 Binary package for roscontrol-sot-0.0.7 is up-to-date. [96%] Processing wip/py-sot-pattern-generator-v3:py27-sot-pattern-generator-v3-3.1.0 ===> Bulk building for py27-sot-pattern-generator-v3-3.1.0 Binary package for py27-sot-pattern-generator-v3-3.1.0 is up-to-date. [96%] Processing wip/py-sot-pattern-generator-v3:py32-sot-pattern-generator-v3-3.1.0 ===> Bulk building for py32-sot-pattern-generator-v3-3.1.0 Binary package for py32-sot-pattern-generator-v3-3.1.0 is up-to-date. [97%] Processing wip/py-sot-pattern-generator-v3:py34-sot-pattern-generator-v3-3.1.0 ===> Bulk building for py34-sot-pattern-generator-v3-3.1.0 Binary package for py34-sot-pattern-generator-v3-3.1.0 is up-to-date. [97%] Processing wip/py-sot-pattern-generator-v3:py35-sot-pattern-generator-v3-3.1.0 ===> Cleaning temporary files for py35-sot-pattern-generator-v3-3.1.0 ===> Bulk building for py35-sot-pattern-generator-v3-3.1.0 => Checking for clear installation => Installing /opt/robotpkg/var/lib/robotpkg/packages/bsd/Ubuntu-16.04-x86_64/All/digest-20080510.tgz => Installing /opt/robotpkg/var/lib/robotpkg/packages/bsd/Ubuntu-16.04-x86_64/All/tnftp-20130505~ssl.tgz => Required robotpkg package digest>=20080510: digest-20080510 found => Required robotpkg package tnftp>=20091122: tnftp-20130505~ssl found => Required system package gnupg>=1: gnupg-1.4.20 found => Required system package gzip: gzip-1.6 found => Required system package pax and tar archivers: pax found => Required system package pkg_install>=20110805.9: pkg_install-20110805.9 found => Required system package pkgrepo2deb>=1.4: pkgrepo2deb-1.4 found => Dependency digest-20080510 already installed => Installing /opt/robotpkg/var/lib/robotpkg/packages/bsd/Ubuntu-16.04-x86_64/All/hpp-fcl-0.6.0.tgz => Installing /opt/robotpkg/var/lib/robotpkg/wip/packages/bsd/Ubuntu-16.04-x86_64/All/jrl-walkgen-v3-4.0.4.tgz => Dependency pinocchio-1.3.3 already installed ERROR: Required robotpkg package py35-sot-core-v3>=3.0.0: BROKEN => Installing /opt/robotpkg/var/lib/robotpkg/wip/packages/bsd/Ubuntu-16.04-x86_64/All/sot-core-v3-3.3.0.tgz => Installing /opt/robotpkg/var/lib/robotpkg/wip/packages/bsd/Ubuntu-16.04-x86_64/All/sot-pattern-generator-v3-3.1.0.tgz => Dependency tnftp-20130505~ssl already installed ===> Logging bulk summary for py35-sot-pattern-generator-v3-3.1.0 => Checking leftover files => Creating bulk log files => Logging bulk metadata ===> Cleaning temporary files for py35-sot-pattern-generator-v3-3.1.0 ===> Done bulk for py35-sot-pattern-generator-v3-3.1.0 [97%] Processing wip/py-sot-pattern-generator-v3:py36-sot-pattern-generator-v3-3.1.0 ===> Bulk building for py36-sot-pattern-generator-v3-3.1.0 Binary package for py36-sot-pattern-generator-v3-3.1.0 is up-to-date. [98%] Processing wip/py-sot-pattern-generator-v3:py37-sot-pattern-generator-v3-3.1.0 ===> Bulk building for py37-sot-pattern-generator-v3-3.1.0 Binary package for py37-sot-pattern-generator-v3-3.1.0 is up-to-date. [98%] Processing wip/sot-talos:sot-talos-1.0.2 ===> Bulk building for sot-talos-1.0.2 Binary package for sot-talos-1.0.2 is up-to-date. [98%] Processing wip/hrp2-dev:hrp2-dev-20171009 ===> Bulk building for hrp2-dev-20171009 Binary package for hrp2-dev-20171009 is up-to-date. [99%] Processing wip/talos-metapkg-ros-control-sot:talos-metapkg-ros-control-sot-0.0.12 ===> Bulk building for talos-metapkg-ros-control-sot-0.0.12 Binary package for talos-metapkg-ros-control-sot-0.0.12 is up-to-date. [99%] Processing wip/talos-dev:talos-dev-20171009 ===> Bulk building for talos-dev-20171009 Binary package for talos-dev-20171009 is up-to-date. ===> Done bulk for rbulk wip set 771.24user 115.89system 11:49.56elapsed 125%CPU (0avgtext+0avgdata 1341388maxresident)k 1217952inputs+5240520outputs (1292major+20469572minor)pagefaults 0swaps --- Updating bulk database --------------------------------------- Collecting session logs in /local/robotpkg/var/log/bulk updated py35-dynamic-graph-tutorial-1.1.1 updated mraa-1.9.0 updated tiago-robot-0.0.35os1 updated py35-sot-core-v3-3.3.0 updated py35-sot-tools-v3-2.1.0 updated morse-ros-1.4 updated py35-sot-dyninv-v3-3.1.1r1 updated py35-sot-dynamic-pinocchio-v3-3.2.4 updated py35-sot-torque-control-1.1.0 updated py27-sot-torque-control-1.1.0 updated py35-mavlink-1.1.62 updated morse-mavlink-1.4 updated CppADCodeGen-2.2.0 updated py27-jsbsim-20150424r1 updated py35-sot-pattern-generator-v3-3.1.0 updated py35-sot-application-v3-1.2.0r2 updated octoviz-1.6.1 updated infuse-asn1-types-0.3 updated morse-hla-1.4 updated infuse-novatel-gps-driver-ros-0.1.0 updated py35-dynamic-graph-bridge-v3-3.2.0 updated py27-hla-1.1.1r1 updated orocos-dot_service-20120308 updated certi-3.5.1 updated orocos-yarp_transport-20150316~doc updated py35-dynamic-graph-v3-3.2.0 updated ros-swri-string-util-2.3.0 updated py35-rqt-dynamic-graph-1.0.0 updated ros-swri-nodelet-2.3.0 updated jrl-walkgen-v3-4.0.4 updated pyrene-motions updated roralink-0.3.0-Source updated py35-hla-1.1.1r1 updated py35-jsbsim-20150424r1 updated sot-torque-control-1.2.0 updated spark-genom-3.9~mightability+openprs+tcl+tclserv_client updated move3d-studio-1.4r3~qtstudio updated libmove3d-planners-1.4.0 updated infuse-asn1-conversions-0.4r1 processed 39 packages