robotpkg/wip bulk build results

Log for Ubuntu-14.04-x86_64 (Back)

--- Syncing bulk database ---------------------------------------- setting Ubuntu-14.04-x86_64 as running --- Updating robotpkg -------------------------------------------- Pulling /local/robotpkg/var/lib/robotpkg/wip HEAD is now at 292e2a4 [wip/sot-torque-control] Release version 1.2.0 Updating pkgtools/pkg_install ===> Updating for pkg_install-20110805.9 pkg_install-20110805.9 is already installed and up-to-date. Updating pkgtools/rbulkit ===> Updating for rbulkit-20181116.1 rbulkit-20181116.1 is already installed and up-to-date. Updating pkgtools/pkgrepo2deb ===> Updating for pkgrepo2deb-1.4 pkgrepo2deb-1.4 is already installed and up-to-date. --- Running build for bulk-rbulk-wip ------------------------------- ===> Sorting packages for rbulk wip set Scanning wip/libmove3d-hri:* Scanning wip/sot-torque-control:* Scanning wip/prf-gazebo-ros-pkgs:* Scanning pkgtools/tnftp:tnftp>=20130505~ssl Scanning wip/head-action:* Scanning wip/orocos-dot_service:* Scanning wip/certi:* Scanning wip/gdalwrap:* Scanning wip/mumps:* Scanning wip/metapod:* [wip/metapod:*] Warning: DOXYGEN_PLIST_DIR in wip/metapod is deprecated. [wip/metapod:*] Warning: use DYNAMIC_PLIST_DIRS instead. Scanning wip/sot-pattern-generator-v3:* Scanning wip/jsbsim:* Scanning wip/dptu-genom3:* Scanning wip/ros-swri-serial-util:* Scanning wip/ros-swri-string-util:* Scanning wip/can-utils:* Scanning wip/pal-gazebo-plugins:* Scanning wip/tf-lookup:* Scanning wip/ros-swri-math-util:* Scanning wip/hrp2-14-description:* Scanning wip/hrp2-computer-monitor:* Scanning wip/FRILibrary:* Scanning wip/py-sot-tools-v3:* Scanning wip/sot-talos:* Scanning wip/sot-dyninv:* Scanning wip/pal-hardware-gazebo:* Scanning wip/hrp2-dev:* Scanning wip/jrl-walkgen-v3:* Scanning wip/pal-transmissions:* Scanning wip/py-hla:* Scanning wip/py-example-adder:* Scanning wip/ompl:* Scanning wip/pyrene-motions:* Scanning wip/infuse-asn1-types:* Scanning wip/move3d-studio:* Scanning wip/talos-data:* Scanning wip/backward-ros:* Scanning wip/sot-hrp2-v3:* Scanning wip/move3d-assets:* Scanning wip/ros-swri-nodelet:* Scanning wip/sot-tools-v3:* Scanning wip/morse-hla:* Scanning wip/cppadcodegen:* Scanning wip/py-dynamic-graph-bridge-v3:* Scanning wip/pal-hardware-interfaces:* Scanning wip/hrp2-bringup:* Scanning wip/gerard-bauzil:* Scanning wip/urg:* Scanning wip/dynamic-graph-v3:* Scanning wip/py-dynamic-graph-tutorial:* Scanning wip/spark-genom:* Scanning wip/cppad:* Scanning wip/talos-metapkg-ros-control-sot:* Scanning wip/histodet:* Scanning wip/octovis:* Scanning wip/py-sot-dynamic-pinocchio-v3:* Scanning wip/rqt-dynamic-graph:* Scanning wip/openhrp3-hrp2:* Scanning wip/py-sot-dyninv-v3:* Scanning wip/talos-simulation:* Scanning wip/prf-ros-controllers:* Scanning wip/py-morse:* Scanning wip/simple-humanoid-description:* Scanning wip/infuse-envire:* Scanning wip/py-sot-application-v3:* Scanning wip/soth:* Scanning wip/infuse-novatel-gps-driver-ros:* Scanning wip/libmove3d-planners:* Scanning wip/infuse-idl:* Scanning wip/ros-swri-roscpp:* Scanning wip/roscontrol-sot:* Scanning wip/play-motion:* Scanning wip/tsid:* Scanning wip/orocos-bfl:* Scanning wip/sot-dynamic-pinocchio-v3:* Scanning wip/py-mraa:* Scanning wip/osg-dae:* Scanning wip/sot-dyninv-v3:* Scanning wip/py-jsbsim:* Scanning wip/dynamic-introspection:* Scanning wip/msgconnector:* Scanning wip/lua-rfsm:* Scanning wip/py-sot-core-v3:* Scanning wip/py-parametric-curves:* Scanning wip/roralink:* Scanning wip/talos-dev:* Scanning wip/morse-mavlink:* Scanning wip/sot-hrp2:* Scanning wip/antlr2:* Scanning wip/pal-msgs:* Scanning wip/hpp-environments:* Scanning wip/parametric-curves:* Scanning wip/example-adder:* Scanning wip/talos-moveit-config:* Scanning wip/ur5-description:* [wip/ur5-description:*] Warning: the LICENSE of wip/ur5-description is undefined. Scanning wip/orocos-yarp_transport:* Scanning middleware/orocos-rtt:orocos-rtt>=2.5 Scanning wip/infuse-asn1-conversions:* Scanning wip/infuse-msgs-ros:* Scanning wip/talos-robot:* Scanning wip/tiago-robot:* Scanning wip/libmove3d:* Scanning wip/py-sot-torque-control:* Scanning wip/mavlink:* Scanning wip/pal-gazebo-worlds:* Scanning wip/morse-ros:* Scanning wip/hrp2-machine:* Scanning wip/openhrp3-simulator-wo-rtm:* Scanning wip/py-sot-pattern-generator-v3:* Scanning wip/prf-roboticsgroup-gazebo-plugins:* Scanning wip/sot-core-v3:* Scanning wip/eigen-quadprog:* Scanning wip/dynamic-graph-tutorial:* Scanning wip/prf-ros-control:* Scanning wip/py-mavlink:* Scanning wip/libnabo:* Scanning wip/py-dynamic-graph-v3:* Scanning wip/hatponboard-lib:* Scanning wip/libhatp:* Scanning wip/py-dynamic-graph-v3:py37-dynamic-graph-v3-3.2.0 Scanning wip/py-dynamic-graph-v3:py36-dynamic-graph-v3-3.2.0 Scanning wip/py-dynamic-graph-v3:py35-dynamic-graph-v3-3.2.0 Scanning wip/py-dynamic-graph-v3:py34-dynamic-graph-v3-3.2.0 Scanning wip/py-dynamic-graph-v3:py32-dynamic-graph-v3-3.2.0 Scanning wip/py-mavlink:py37-mavlink-1.1.62 Scanning wip/py-mavlink:py36-mavlink-1.1.62 Scanning wip/py-mavlink:py35-mavlink-1.1.62 Scanning wip/py-mavlink:py34-mavlink-1.1.62 Scanning wip/py-mavlink:py32-mavlink-1.1.62 Scanning wip/py-sot-pattern-generator-v3:py37-sot-pattern-generator-v3-3.1.0 Scanning wip/py-sot-pattern-generator-v3:py36-sot-pattern-generator-v3-3.1.0 Scanning wip/py-sot-pattern-generator-v3:py35-sot-pattern-generator-v3-3.1.0 Scanning wip/py-sot-pattern-generator-v3:py34-sot-pattern-generator-v3-3.1.0 Scanning wip/py-sot-pattern-generator-v3:py32-sot-pattern-generator-v3-3.1.0 Scanning wip/py-sot-torque-control:py37-sot-torque-control-1.1.0 Scanning wip/py-sot-torque-control:py36-sot-torque-control-1.1.0 Scanning wip/py-sot-torque-control:py35-sot-torque-control-1.1.0 Scanning wip/py-sot-torque-control:py34-sot-torque-control-1.1.0 Scanning wip/py-sot-torque-control:py32-sot-torque-control-1.1.0 Scanning wip/py-parametric-curves:py37-parametric-curves-1.2.0 Scanning wip/py-parametric-curves:py36-parametric-curves-1.2.0 Scanning wip/py-parametric-curves:py35-parametric-curves-1.2.0 Scanning wip/py-parametric-curves:py34-parametric-curves-1.2.0 Scanning wip/py-parametric-curves:py32-parametric-curves-1.2.0 Scanning wip/py-sot-core-v3:py37-sot-core-v3-3.3.0 Scanning wip/py-sot-core-v3:py36-sot-core-v3-3.3.0 Scanning wip/py-sot-core-v3:py35-sot-core-v3-3.3.0 Scanning wip/py-sot-core-v3:py34-sot-core-v3-3.3.0 Scanning wip/py-sot-core-v3:py32-sot-core-v3-3.3.0 Scanning wip/py-jsbsim:py37-jsbsim-20150424r1 Scanning wip/py-jsbsim:py36-jsbsim-20150424r1 Scanning wip/py-jsbsim:py35-jsbsim-20150424r1 Scanning wip/py-jsbsim:py34-jsbsim-20150424r1 Scanning wip/py-jsbsim:py32-jsbsim-20150424r1 Scanning wip/py-sot-application-v3:py37-sot-application-v3-1.2.0r2 Scanning wip/py-sot-application-v3:py36-sot-application-v3-1.2.0r2 Scanning wip/py-sot-application-v3:py35-sot-application-v3-1.2.0r2 Scanning wip/py-sot-application-v3:py34-sot-application-v3-1.2.0r2 Scanning wip/py-sot-application-v3:py32-sot-application-v3-1.2.0r2 Scanning wip/py-morse:py37-morse-1.4 Scanning wip/py-morse:py36-morse-1.4 Scanning wip/py-morse:py35-morse-1.4 Scanning wip/py-morse:py32-morse-1.4 Scanning wip/py-sot-dyninv-v3:py37-sot-dyninv-v3-3.1.1r1 Scanning wip/py-sot-dyninv-v3:py36-sot-dyninv-v3-3.1.1r1 Scanning wip/py-sot-dyninv-v3:py35-sot-dyninv-v3-3.1.1r1 Scanning wip/py-sot-dyninv-v3:py34-sot-dyninv-v3-3.1.1r1 Scanning wip/py-sot-dyninv-v3:py32-sot-dyninv-v3-3.1.1r1 Scanning wip/rqt-dynamic-graph:py37-rqt-dynamic-graph-1.0.0 Scanning wip/rqt-dynamic-graph:py36-rqt-dynamic-graph-1.0.0 Scanning wip/rqt-dynamic-graph:py35-rqt-dynamic-graph-1.0.0 Scanning wip/rqt-dynamic-graph:py34-rqt-dynamic-graph-1.0.0 Scanning wip/rqt-dynamic-graph:py32-rqt-dynamic-graph-1.0.0 Scanning wip/py-sot-dynamic-pinocchio-v3:py37-sot-dynamic-pinocchio-v3-3.2.4 Scanning wip/py-sot-dynamic-pinocchio-v3:py36-sot-dynamic-pinocchio-v3-3.2.4 Scanning wip/py-sot-dynamic-pinocchio-v3:py35-sot-dynamic-pinocchio-v3-3.2.4 Scanning wip/py-sot-dynamic-pinocchio-v3:py34-sot-dynamic-pinocchio-v3-3.2.4 Scanning wip/py-sot-dynamic-pinocchio-v3:py32-sot-dynamic-pinocchio-v3-3.2.4 Scanning wip/py-dynamic-graph-tutorial:py37-dynamic-graph-tutorial-1.1.1 Scanning wip/py-dynamic-graph-tutorial:py36-dynamic-graph-tutorial-1.1.1 Scanning wip/py-dynamic-graph-tutorial:py35-dynamic-graph-tutorial-1.1.1 Scanning wip/py-dynamic-graph-tutorial:py34-dynamic-graph-tutorial-1.1.1 Scanning wip/py-dynamic-graph-tutorial:py32-dynamic-graph-tutorial-1.1.1 Scanning wip/py-dynamic-graph-bridge-v3:py37-dynamic-graph-bridge-v3-3.2.0 Scanning wip/py-dynamic-graph-bridge-v3:py36-dynamic-graph-bridge-v3-3.2.0 Scanning wip/py-dynamic-graph-bridge-v3:py35-dynamic-graph-bridge-v3-3.2.0 Scanning wip/py-dynamic-graph-bridge-v3:py34-dynamic-graph-bridge-v3-3.2.0 Scanning wip/py-dynamic-graph-bridge-v3:py32-dynamic-graph-bridge-v3-3.2.0 Scanning wip/py-example-adder:py37-example-adder-1.0.0 Scanning wip/py-example-adder:py36-example-adder-1.0.0 Scanning wip/py-example-adder:py35-example-adder-1.0.0 Scanning wip/py-example-adder:py34-example-adder-1.0.0 Scanning wip/py-example-adder:py32-example-adder-1.0.0 Scanning wip/py-hla:py37-hla-1.1.1r1 Scanning wip/py-hla:py36-hla-1.1.1r1 Scanning wip/py-hla:py35-hla-1.1.1r1 Scanning wip/py-hla:py34-hla-1.1.1r1 Scanning wip/py-hla:py32-hla-1.1.1r1 Scanning wip/py-sot-tools-v3:py37-sot-tools-v3-2.1.0 Scanning wip/py-sot-tools-v3:py36-sot-tools-v3-2.1.0 Scanning wip/py-sot-tools-v3:py35-sot-tools-v3-2.1.0 Scanning wip/py-sot-tools-v3:py34-sot-tools-v3-2.1.0 Scanning wip/py-sot-tools-v3:py32-sot-tools-v3-2.1.0 Scanning wip/dptu-genom3:dptu-genom3-0.2~codels+openprs+ros-client-c+ros-client-ros+ros-server+!* Scanning wip/dptu-genom3:dptu-genom3-0.2~pocolibs-client-c+codels+openprs+pocolibs-server+!* Scanned 312 packages (271 unique) [21%] Processing wip/mavlink:mavlink-20150929 ===> Bulk building for mavlink-20150929 Binary package for mavlink-20150929 is up-to-date. [21%] Processing wip/libmove3d:libmove3d-3.22.0r1 ===> Bulk building for libmove3d-3.22.0r1 Binary package for libmove3d-3.22.0r1 is up-to-date. [22%] Processing wip/morse-ros:morse-ros-1.4 ===> Cleaning temporary files for morse-ros-1.4 ===> Bulk building for morse-ros-1.4 => Checking for clear installation => Installing /opt/robotpkg/var/lib/robotpkg/packages/bsd/Ubuntu-14.04-x86_64/All/digest-20080510.tgz => Installing /opt/robotpkg/var/lib/robotpkg/packages/bsd/Ubuntu-14.04-x86_64/All/tnftp-20130505~ssl.tgz => Required robotpkg package digest>=20080510: digest-20080510 found => Required robotpkg package tnftp>=20091122: tnftp-20130505~ssl found => Required system package gnupg>=1: gnupg-1.4.16 found => Required system package gzip: gzip-1.6 found => Required system package patch>=2.0: patch-2.7.1 found => Required system package pax and tar archivers: pax found => Required system package pkg_install>=20110805.9: pkg_install-20110805.9 found => Required system package pkgrepo2deb>=1.4: pkgrepo2deb-1.4 found => Dependency digest-20080510 already installed => Installing /opt/robotpkg/var/lib/robotpkg/packages/bsd/Ubuntu-14.04-x86_64/All/morse-1.4~doc.tgz => Required system package py34-catkin-pkg>=0.2: MISSING => Dependency tnftp-20130505~ssl already installed ERROR: ====================================================================== ERROR: Missing system packages required for morse-ros-1.4: ERROR: ERROR: py34-catkin-pkg>=0.2 (Ubuntu package python-catkin-pkg) ERROR: ERROR: Please use the system package management tool to install these ERROR: dependencies. If a robotpkg version of a dependency is available, ERROR: you can configure robotpkg.conf to use this version instead. ERROR: ERROR: See /local/robotpkg/var/tmp/robotpkg/wip/morse-ros/work/sysdep.log for details. ERROR: ====================================================================== make[2]: *** [sys-depends] Error 2 ===> Logging bulk summary for morse-ros-1.4 => Checking leftover files => Creating bulk log files => Logging bulk metadata ===> Cleaning temporary files for morse-ros-1.4 ===> Done bulk for morse-ros-1.4 [22%] Processing wip/openhrp3-simulator-wo-rtm:openhrp3-simulator-wo-rtm-1.2.0 ===> Bulk building for openhrp3-simulator-wo-rtm-1.2.0 Binary package for openhrp3-simulator-wo-rtm-1.2.0 is up-to-date. [22%] Processing wip/hrp2-machine:hrp2-machine-1.0.2 ===> Bulk building for hrp2-machine-1.0.2 Binary package for hrp2-machine-1.0.2 is up-to-date. [23%] Processing wip/eigen-quadprog:eigen-quadprog-1.0.0 ===> Bulk building for eigen-quadprog-1.0.0 Binary package for eigen-quadprog-1.0.0 is up-to-date. [24%] Processing wip/py-mavlink:py34-mavlink-1.1.62 ===> Cleaning temporary files for py34-mavlink-1.1.62 ===> Bulk building for py34-mavlink-1.1.62 => Checking for clear installation => Installing /opt/robotpkg/var/lib/robotpkg/packages/bsd/Ubuntu-14.04-x86_64/All/digest-20080510.tgz => Installing /opt/robotpkg/var/lib/robotpkg/packages/bsd/Ubuntu-14.04-x86_64/All/tnftp-20130505~ssl.tgz => Required robotpkg package digest>=20080510: digest-20080510 found => Required robotpkg package tnftp>=20091122: tnftp-20130505~ssl found => Required system package git>=1.6: git-1.9.1 found => Required system package gnupg>=1: gnupg-1.4.16 found => Required system package gzip: gzip-1.6 found => Required system package pax and tar archivers: pax found => Required system package pkg_install>=20110805.9: pkg_install-20110805.9 found => Required system package pkgrepo2deb>=1.4: pkgrepo2deb-1.4 found => Dependency digest-20080510 already installed => Dependency tnftp-20130505~ssl already installed => Building with no option. => Use the GNU C compiler: c-compiler provided by gcc>=3 => Use python-3.4: python>=2.5<3.8 provided by python34>=3.4<3.5 => Required system package gcc>=3: gcc-4.8 found => Required system package python34>=3.4<3.5: python34-3.4.3 found => SHA1 checksums OK => RMD160 checksums OK => Compiling python files File "/opt/openrobots/lib/python3.4/site-packages/pymavlink/generator/lib/genxmlif/__init__.py", line 81 raise AttributeError, "Unknown XML interface: %s" %(xmlIf) ^ SyntaxError: invalid syntax File "/opt/openrobots/lib/python3.4/site-packages/pymavlink/generator/lib/genxmlif/xmlif4Dom.py", line 58 print "Using 4Dom interface module..." ^ SyntaxError: Missing parentheses in call to 'print' File "/opt/openrobots/lib/python3.4/site-packages/pymavlink/generator/lib/genxmlif/xmlifApi.py", line 370 raise AttributeError, "Attribute %s not found!" %(repr(tupleOrAttrName)) ^ SyntaxError: invalid syntax File "/opt/openrobots/lib/python3.4/site-packages/pymavlink/generator/lib/genxmlif/xmlifDom.py", line 69 print "Xinclude: %s" %href ^ SyntaxError: Missing parentheses in call to 'print' File "/opt/openrobots/lib/python3.4/site-packages/pymavlink/generator/lib/genxmlif/xmlifElementTree.py", line 72 print "Using elementtree interface module..." ^ SyntaxError: Missing parentheses in call to 'print' File "/opt/openrobots/lib/python3.4/site-packages/pymavlink/generator/lib/genxmlif/xmlifMinidom.py", line 63 print "Using minidom interface module..." ^ SyntaxError: Missing parentheses in call to 'print' File "/opt/openrobots/lib/python3.4/site-packages/pymavlink/generator/lib/genxmlif/xmlifUtils.py", line 193 raise LookupError, "Prefix for namespaceURI '%s' not found!" % (ns) ^ SyntaxError: invalid syntax File "/opt/openrobots/lib/python3.4/site-packages/pymavlink/generator/lib/genxmlif/xmliftest.py", line 12 print xmlTree.printTree(prettyPrint=1) ^ SyntaxError: invalid syntax File "/opt/openrobots/lib/python3.4/site-packages/pymavlink/generator/lib/minixsv/minixsvWrapper.py", line 36 print validSyntaxText ^ SyntaxError: Missing parentheses in call to 'print' File "/opt/openrobots/lib/python3.4/site-packages/pymavlink/generator/lib/minixsv/pyxsval.py", line 93 raise KeyError, "xmlIfKey %s already implemented!" %(xmlIfKey) ^ SyntaxError: invalid syntax File "/opt/openrobots/lib/python3.4/site-packages/pymavlink/generator/lib/minixsv/xsvalBase.py", line 135 except TagException, errInst: ^ SyntaxError: invalid syntax File "/opt/openrobots/lib/python3.4/site-packages/pymavlink/generator/lib/minixsv/xsvalErrorHandler.py", line 122 print string.join (self.infoDict.keys(), "n") ^ SyntaxError: invalid syntax File "/opt/openrobots/lib/python3.4/site-packages/pymavlink/generator/lib/minixsv/xsvalSchema.py", line 431 except TagException, errInst: ^ SyntaxError: invalid syntax File "/opt/openrobots/lib/python3.4/site-packages/pymavlink/generator/lib/minixsv/xsvalSimpleTypes.py", line 78 except BaseTypeError, errstr: ^ SyntaxError: invalid syntax File "/opt/openrobots/lib/python3.4/site-packages/pymavlink/generator/lib/minixsv/xsvalUtils.py", line 48 r"Cc" : ur"x00-x1fx7f-x9f", ^ SyntaxError: invalid syntax File "/opt/openrobots/lib/python3.4/site-packages/pymavlink/generator/lib/genxmlif/__init__.py", line 81 raise AttributeError, "Unknown XML interface: %s" %(xmlIf) ^ SyntaxError: invalid syntax File "/opt/openrobots/lib/python3.4/site-packages/pymavlink/generator/lib/genxmlif/xmlif4Dom.py", line 58 print "Using 4Dom interface module..." ^ SyntaxError: Missing parentheses in call to 'print' File "/opt/openrobots/lib/python3.4/site-packages/pymavlink/generator/lib/genxmlif/xmlifApi.py", line 370 raise AttributeError, "Attribute %s not found!" %(repr(tupleOrAttrName)) ^ SyntaxError: invalid syntax File "/opt/openrobots/lib/python3.4/site-packages/pymavlink/generator/lib/genxmlif/xmlifDom.py", line 69 print "Xinclude: %s" %href ^ SyntaxError: Missing parentheses in call to 'print' File "/opt/openrobots/lib/python3.4/site-packages/pymavlink/generator/lib/genxmlif/xmlifElementTree.py", line 72 print "Using elementtree interface module..." ^ SyntaxError: Missing parentheses in call to 'print' File "/opt/openrobots/lib/python3.4/site-packages/pymavlink/generator/lib/genxmlif/xmlifMinidom.py", line 63 print "Using minidom interface module..." ^ SyntaxError: Missing parentheses in call to 'print' File "/opt/openrobots/lib/python3.4/site-packages/pymavlink/generator/lib/genxmlif/xmlifUtils.py", line 193 raise LookupError, "Prefix for namespaceURI '%s' not found!" % (ns) ^ SyntaxError: invalid syntax File "/opt/openrobots/lib/python3.4/site-packages/pymavlink/generator/lib/genxmlif/xmliftest.py", line 12 print xmlTree.printTree(prettyPrint=1) ^ SyntaxError: invalid syntax File "/opt/openrobots/lib/python3.4/site-packages/pymavlink/generator/lib/minixsv/minixsvWrapper.py", line 36 print validSyntaxText ^ SyntaxError: Missing parentheses in call to 'print' File "/opt/openrobots/lib/python3.4/site-packages/pymavlink/generator/lib/minixsv/pyxsval.py", line 93 raise KeyError, "xmlIfKey %s already implemented!" %(xmlIfKey) ^ SyntaxError: invalid syntax File "/opt/openrobots/lib/python3.4/site-packages/pymavlink/generator/lib/minixsv/xsvalBase.py", line 135 except TagException, errInst: ^ SyntaxError: invalid syntax File "/opt/openrobots/lib/python3.4/site-packages/pymavlink/generator/lib/minixsv/xsvalErrorHandler.py", line 122 print string.join (self.infoDict.keys(), "n") ^ SyntaxError: invalid syntax File "/opt/openrobots/lib/python3.4/site-packages/pymavlink/generator/lib/minixsv/xsvalSchema.py", line 431 except TagException, errInst: ^ SyntaxError: invalid syntax File "/opt/openrobots/lib/python3.4/site-packages/pymavlink/generator/lib/minixsv/xsvalSimpleTypes.py", line 78 except BaseTypeError, errstr: ^ SyntaxError: invalid syntax File "/opt/openrobots/lib/python3.4/site-packages/pymavlink/generator/lib/minixsv/xsvalUtils.py", line 48 r"Cc" : ur"x00-x1fx7f-x9f", ^ SyntaxError: invalid syntax robotpkg_create: can't stat `/opt/openrobots/lib/python3.4/site-packages/mavnative.so' robotpkg_create: can't stat `/opt/openrobots/lib/python3.4/site-packages/pymavlink/generator/lib/genxmlif/__pycache__/__init__.cpython-34.pyc' robotpkg_create: can't stat `/opt/openrobots/lib/python3.4/site-packages/pymavlink/generator/lib/genxmlif/__pycache__/__init__.cpython-34.pyo' robotpkg_create: can't stat `/opt/openrobots/lib/python3.4/site-packages/pymavlink/generator/lib/genxmlif/__pycache__/xmlif4Dom.cpython-34.pyc' robotpkg_create: can't stat `/opt/openrobots/lib/python3.4/site-packages/pymavlink/generator/lib/genxmlif/__pycache__/xmlif4Dom.cpython-34.pyo' robotpkg_create: can't stat `/opt/openrobots/lib/python3.4/site-packages/pymavlink/generator/lib/genxmlif/__pycache__/xmlifApi.cpython-34.pyc' robotpkg_create: can't stat `/opt/openrobots/lib/python3.4/site-packages/pymavlink/generator/lib/genxmlif/__pycache__/xmlifApi.cpython-34.pyo' robotpkg_create: can't stat `/opt/openrobots/lib/python3.4/site-packages/pymavlink/generator/lib/genxmlif/__pycache__/xmlifDom.cpython-34.pyc' robotpkg_create: can't stat `/opt/openrobots/lib/python3.4/site-packages/pymavlink/generator/lib/genxmlif/__pycache__/xmlifDom.cpython-34.pyo' robotpkg_create: can't stat `/opt/openrobots/lib/python3.4/site-packages/pymavlink/generator/lib/genxmlif/__pycache__/xmlifElementTree.cpython-34.pyc' robotpkg_create: can't stat `/opt/openrobots/lib/python3.4/site-packages/pymavlink/generator/lib/genxmlif/__pycache__/xmlifElementTree.cpython-34.pyo' robotpkg_create: can't stat `/opt/openrobots/lib/python3.4/site-packages/pymavlink/generator/lib/genxmlif/__pycache__/xmlifMinidom.cpython-34.pyc' robotpkg_create: can't stat `/opt/openrobots/lib/python3.4/site-packages/pymavlink/generator/lib/genxmlif/__pycache__/xmlifMinidom.cpython-34.pyo' robotpkg_create: can't stat `/opt/openrobots/lib/python3.4/site-packages/pymavlink/generator/lib/genxmlif/__pycache__/xmlifUtils.cpython-34.pyc' robotpkg_create: can't stat `/opt/openrobots/lib/python3.4/site-packages/pymavlink/generator/lib/genxmlif/__pycache__/xmlifUtils.cpython-34.pyo' robotpkg_create: can't stat `/opt/openrobots/lib/python3.4/site-packages/pymavlink/generator/lib/genxmlif/__pycache__/xmliftest.cpython-34.pyc' robotpkg_create: can't stat `/opt/openrobots/lib/python3.4/site-packages/pymavlink/generator/lib/genxmlif/__pycache__/xmliftest.cpython-34.pyo' robotpkg_create: can't stat `/opt/openrobots/lib/python3.4/site-packages/pymavlink/generator/lib/minixsv/__pycache__/minixsvWrapper.cpython-34.pyc' robotpkg_create: can't stat `/opt/openrobots/lib/python3.4/site-packages/pymavlink/generator/lib/minixsv/__pycache__/minixsvWrapper.cpython-34.pyo' robotpkg_create: can't stat `/opt/openrobots/lib/python3.4/site-packages/pymavlink/generator/lib/minixsv/__pycache__/pyxsval.cpython-34.pyc' robotpkg_create: can't stat `/opt/openrobots/lib/python3.4/site-packages/pymavlink/generator/lib/minixsv/__pycache__/pyxsval.cpython-34.pyo' robotpkg_create: can't stat `/opt/openrobots/lib/python3.4/site-packages/pymavlink/generator/lib/minixsv/__pycache__/xsvalBase.cpython-34.pyc' robotpkg_create: can't stat `/opt/openrobots/lib/python3.4/site-packages/pymavlink/generator/lib/minixsv/__pycache__/xsvalBase.cpython-34.pyo' robotpkg_create: can't stat `/opt/openrobots/lib/python3.4/site-packages/pymavlink/generator/lib/minixsv/__pycache__/xsvalErrorHandler.cpython-34.pyc' robotpkg_create: can't stat `/opt/openrobots/lib/python3.4/site-packages/pymavlink/generator/lib/minixsv/__pycache__/xsvalErrorHandler.cpython-34.pyo' robotpkg_create: can't stat `/opt/openrobots/lib/python3.4/site-packages/pymavlink/generator/lib/minixsv/__pycache__/xsvalSchema.cpython-34.pyc' robotpkg_create: can't stat `/opt/openrobots/lib/python3.4/site-packages/pymavlink/generator/lib/minixsv/__pycache__/xsvalSchema.cpython-34.pyo' robotpkg_create: can't stat `/opt/openrobots/lib/python3.4/site-packages/pymavlink/generator/lib/minixsv/__pycache__/xsvalSimpleTypes.cpython-34.pyc' robotpkg_create: can't stat `/opt/openrobots/lib/python3.4/site-packages/pymavlink/generator/lib/minixsv/__pycache__/xsvalSimpleTypes.cpython-34.pyo' robotpkg_create: can't stat `/opt/openrobots/lib/python3.4/site-packages/pymavlink/generator/lib/minixsv/__pycache__/xsvalUtils.cpython-34.pyc' robotpkg_create: can't stat `/opt/openrobots/lib/python3.4/site-packages/pymavlink/generator/lib/minixsv/__pycache__/xsvalUtils.cpython-34.pyo' => Registering installation for py34-mavlink-1.1.62 robotpkg_admin: py34-mavlink-1.1.62: File `/opt/openrobots/lib/python3.4/site-packages/mavnative.so' is in +CONTENTS but not on filesystem! robotpkg_admin: py34-mavlink-1.1.62: File `/opt/openrobots/lib/python3.4/site-packages/pymavlink/generator/lib/genxmlif/__pycache__/__init__.cpython-34.pyc' is in +CONTENTS but not on filesystem! robotpkg_admin: py34-mavlink-1.1.62: File `/opt/openrobots/lib/python3.4/site-packages/pymavlink/generator/lib/genxmlif/__pycache__/__init__.cpython-34.pyo' is in +CONTENTS but not on filesystem! robotpkg_admin: py34-mavlink-1.1.62: File `/opt/openrobots/lib/python3.4/site-packages/pymavlink/generator/lib/genxmlif/__pycache__/xmlif4Dom.cpython-34.pyc' is in +CONTENTS but not on filesystem! robotpkg_admin: py34-mavlink-1.1.62: File `/opt/openrobots/lib/python3.4/site-packages/pymavlink/generator/lib/genxmlif/__pycache__/xmlif4Dom.cpython-34.pyo' is in +CONTENTS but not on filesystem! robotpkg_admin: py34-mavlink-1.1.62: File `/opt/openrobots/lib/python3.4/site-packages/pymavlink/generator/lib/genxmlif/__pycache__/xmlifApi.cpython-34.pyc' is in +CONTENTS but not on filesystem! robotpkg_admin: py34-mavlink-1.1.62: File `/opt/openrobots/lib/python3.4/site-packages/pymavlink/generator/lib/genxmlif/__pycache__/xmlifApi.cpython-34.pyo' is in +CONTENTS but not on filesystem! robotpkg_admin: py34-mavlink-1.1.62: File `/opt/openrobots/lib/python3.4/site-packages/pymavlink/generator/lib/genxmlif/__pycache__/xmlifDom.cpython-34.pyc' is in +CONTENTS but not on filesystem! robotpkg_admin: py34-mavlink-1.1.62: File `/opt/openrobots/lib/python3.4/site-packages/pymavlink/generator/lib/genxmlif/__pycache__/xmlifDom.cpython-34.pyo' is in +CONTENTS but not on filesystem! robotpkg_admin: py34-mavlink-1.1.62: File `/opt/openrobots/lib/python3.4/site-packages/pymavlink/generator/lib/genxmlif/__pycache__/xmlifElementTree.cpython-34.pyc' is in +CONTENTS but not on filesystem! robotpkg_admin: py34-mavlink-1.1.62: File `/opt/openrobots/lib/python3.4/site-packages/pymavlink/generator/lib/genxmlif/__pycache__/xmlifElementTree.cpython-34.pyo' is in +CONTENTS but not on filesystem! robotpkg_admin: py34-mavlink-1.1.62: File `/opt/openrobots/lib/python3.4/site-packages/pymavlink/generator/lib/genxmlif/__pycache__/xmlifMinidom.cpython-34.pyc' is in +CONTENTS but not on filesystem! robotpkg_admin: py34-mavlink-1.1.62: File `/opt/openrobots/lib/python3.4/site-packages/pymavlink/generator/lib/genxmlif/__pycache__/xmlifMinidom.cpython-34.pyo' is in +CONTENTS but not on filesystem! robotpkg_admin: py34-mavlink-1.1.62: File `/opt/openrobots/lib/python3.4/site-packages/pymavlink/generator/lib/genxmlif/__pycache__/xmlifUtils.cpython-34.pyc' is in +CONTENTS but not on filesystem! robotpkg_admin: py34-mavlink-1.1.62: File `/opt/openrobots/lib/python3.4/site-packages/pymavlink/generator/lib/genxmlif/__pycache__/xmlifUtils.cpython-34.pyo' is in +CONTENTS but not on filesystem! robotpkg_admin: py34-mavlink-1.1.62: File `/opt/openrobots/lib/python3.4/site-packages/pymavlink/generator/lib/genxmlif/__pycache__/xmliftest.cpython-34.pyc' is in +CONTENTS but not on filesystem! robotpkg_admin: py34-mavlink-1.1.62: File `/opt/openrobots/lib/python3.4/site-packages/pymavlink/generator/lib/genxmlif/__pycache__/xmliftest.cpython-34.pyo' is in +CONTENTS but not on filesystem! robotpkg_admin: py34-mavlink-1.1.62: File `/opt/openrobots/lib/python3.4/site-packages/pymavlink/generator/lib/minixsv/__pycache__/minixsvWrapper.cpython-34.pyc' is in +CONTENTS but not on filesystem! robotpkg_admin: py34-mavlink-1.1.62: File `/opt/openrobots/lib/python3.4/site-packages/pymavlink/generator/lib/minixsv/__pycache__/minixsvWrapper.cpython-34.pyo' is in +CONTENTS but not on filesystem! robotpkg_admin: py34-mavlink-1.1.62: File `/opt/openrobots/lib/python3.4/site-packages/pymavlink/generator/lib/minixsv/__pycache__/pyxsval.cpython-34.pyc' is in +CONTENTS but not on filesystem! robotpkg_admin: py34-mavlink-1.1.62: File `/opt/openrobots/lib/python3.4/site-packages/pymavlink/generator/lib/minixsv/__pycache__/pyxsval.cpython-34.pyo' is in +CONTENTS but not on filesystem! robotpkg_admin: py34-mavlink-1.1.62: File `/opt/openrobots/lib/python3.4/site-packages/pymavlink/generator/lib/minixsv/__pycache__/xsvalBase.cpython-34.pyc' is in +CONTENTS but not on filesystem! robotpkg_admin: py34-mavlink-1.1.62: File `/opt/openrobots/lib/python3.4/site-packages/pymavlink/generator/lib/minixsv/__pycache__/xsvalBase.cpython-34.pyo' is in +CONTENTS but not on filesystem! robotpkg_admin: py34-mavlink-1.1.62: File `/opt/openrobots/lib/python3.4/site-packages/pymavlink/generator/lib/minixsv/__pycache__/xsvalErrorHandler.cpython-34.pyc' is in +CONTENTS but not on filesystem! robotpkg_admin: py34-mavlink-1.1.62: File `/opt/openrobots/lib/python3.4/site-packages/pymavlink/generator/lib/minixsv/__pycache__/xsvalErrorHandler.cpython-34.pyo' is in +CONTENTS but not on filesystem! robotpkg_admin: py34-mavlink-1.1.62: File `/opt/openrobots/lib/python3.4/site-packages/pymavlink/generator/lib/minixsv/__pycache__/xsvalSchema.cpython-34.pyc' is in +CONTENTS but not on filesystem! robotpkg_admin: py34-mavlink-1.1.62: File `/opt/openrobots/lib/python3.4/site-packages/pymavlink/generator/lib/minixsv/__pycache__/xsvalSchema.cpython-34.pyo' is in +CONTENTS but not on filesystem! robotpkg_admin: py34-mavlink-1.1.62: File `/opt/openrobots/lib/python3.4/site-packages/pymavlink/generator/lib/minixsv/__pycache__/xsvalSimpleTypes.cpython-34.pyc' is in +CONTENTS but not on filesystem! robotpkg_admin: py34-mavlink-1.1.62: File `/opt/openrobots/lib/python3.4/site-packages/pymavlink/generator/lib/minixsv/__pycache__/xsvalSimpleTypes.cpython-34.pyo' is in +CONTENTS but not on filesystem! robotpkg_admin: py34-mavlink-1.1.62: File `/opt/openrobots/lib/python3.4/site-packages/pymavlink/generator/lib/minixsv/__pycache__/xsvalUtils.cpython-34.pyc' is in +CONTENTS but not on filesystem! robotpkg_admin: py34-mavlink-1.1.62: File `/opt/openrobots/lib/python3.4/site-packages/pymavlink/generator/lib/minixsv/__pycache__/xsvalUtils.cpython-34.pyo' is in +CONTENTS but not on filesystem! robotpkg_create: can't stat `/opt/openrobots/lib/python3.4/site-packages/mavnative.so' robotpkg_create: can't stat `/opt/openrobots/lib/python3.4/site-packages/pymavlink/generator/lib/genxmlif/__pycache__/__init__.cpython-34.pyc' robotpkg_create: can't stat `/opt/openrobots/lib/python3.4/site-packages/pymavlink/generator/lib/genxmlif/__pycache__/__init__.cpython-34.pyo' robotpkg_create: can't stat `/opt/openrobots/lib/python3.4/site-packages/pymavlink/generator/lib/genxmlif/__pycache__/xmlif4Dom.cpython-34.pyc' robotpkg_create: can't stat `/opt/openrobots/lib/python3.4/site-packages/pymavlink/generator/lib/genxmlif/__pycache__/xmlif4Dom.cpython-34.pyo' robotpkg_create: can't stat `/opt/openrobots/lib/python3.4/site-packages/pymavlink/generator/lib/genxmlif/__pycache__/xmlifApi.cpython-34.pyc' robotpkg_create: can't stat `/opt/openrobots/lib/python3.4/site-packages/pymavlink/generator/lib/genxmlif/__pycache__/xmlifApi.cpython-34.pyo' robotpkg_create: can't stat `/opt/openrobots/lib/python3.4/site-packages/pymavlink/generator/lib/genxmlif/__pycache__/xmlifDom.cpython-34.pyc' robotpkg_create: can't stat `/opt/openrobots/lib/python3.4/site-packages/pymavlink/generator/lib/genxmlif/__pycache__/xmlifDom.cpython-34.pyo' robotpkg_create: can't stat `/opt/openrobots/lib/python3.4/site-packages/pymavlink/generator/lib/genxmlif/__pycache__/xmlifElementTree.cpython-34.pyc' robotpkg_create: can't stat `/opt/openrobots/lib/python3.4/site-packages/pymavlink/generator/lib/genxmlif/__pycache__/xmlifElementTree.cpython-34.pyo' robotpkg_create: can't stat `/opt/openrobots/lib/python3.4/site-packages/pymavlink/generator/lib/genxmlif/__pycache__/xmlifMinidom.cpython-34.pyc' robotpkg_create: can't stat `/opt/openrobots/lib/python3.4/site-packages/pymavlink/generator/lib/genxmlif/__pycache__/xmlifMinidom.cpython-34.pyo' robotpkg_create: can't stat `/opt/openrobots/lib/python3.4/site-packages/pymavlink/generator/lib/genxmlif/__pycache__/xmlifUtils.cpython-34.pyc' robotpkg_create: can't stat `/opt/openrobots/lib/python3.4/site-packages/pymavlink/generator/lib/genxmlif/__pycache__/xmlifUtils.cpython-34.pyo' robotpkg_create: can't stat `/opt/openrobots/lib/python3.4/site-packages/pymavlink/generator/lib/genxmlif/__pycache__/xmliftest.cpython-34.pyc' robotpkg_create: can't stat `/opt/openrobots/lib/python3.4/site-packages/pymavlink/generator/lib/genxmlif/__pycache__/xmliftest.cpython-34.pyo' robotpkg_create: can't stat `/opt/openrobots/lib/python3.4/site-packages/pymavlink/generator/lib/minixsv/__pycache__/minixsvWrapper.cpython-34.pyc' robotpkg_create: can't stat `/opt/openrobots/lib/python3.4/site-packages/pymavlink/generator/lib/minixsv/__pycache__/minixsvWrapper.cpython-34.pyo' robotpkg_create: can't stat `/opt/openrobots/lib/python3.4/site-packages/pymavlink/generator/lib/minixsv/__pycache__/pyxsval.cpython-34.pyc' robotpkg_create: can't stat `/opt/openrobots/lib/python3.4/site-packages/pymavlink/generator/lib/minixsv/__pycache__/pyxsval.cpython-34.pyo' robotpkg_create: can't stat `/opt/openrobots/lib/python3.4/site-packages/pymavlink/generator/lib/minixsv/__pycache__/xsvalBase.cpython-34.pyc' robotpkg_create: can't stat `/opt/openrobots/lib/python3.4/site-packages/pymavlink/generator/lib/minixsv/__pycache__/xsvalBase.cpython-34.pyo' robotpkg_create: can't stat `/opt/openrobots/lib/python3.4/site-packages/pymavlink/generator/lib/minixsv/__pycache__/xsvalErrorHandler.cpython-34.pyc' robotpkg_create: can't stat `/opt/openrobots/lib/python3.4/site-packages/pymavlink/generator/lib/minixsv/__pycache__/xsvalErrorHandler.cpython-34.pyo' robotpkg_create: can't stat `/opt/openrobots/lib/python3.4/site-packages/pymavlink/generator/lib/minixsv/__pycache__/xsvalSchema.cpython-34.pyc' robotpkg_create: can't stat `/opt/openrobots/lib/python3.4/site-packages/pymavlink/generator/lib/minixsv/__pycache__/xsvalSchema.cpython-34.pyo' robotpkg_create: can't stat `/opt/openrobots/lib/python3.4/site-packages/pymavlink/generator/lib/minixsv/__pycache__/xsvalSimpleTypes.cpython-34.pyc' robotpkg_create: can't stat `/opt/openrobots/lib/python3.4/site-packages/pymavlink/generator/lib/minixsv/__pycache__/xsvalSimpleTypes.cpython-34.pyo' robotpkg_create: can't stat `/opt/openrobots/lib/python3.4/site-packages/pymavlink/generator/lib/minixsv/__pycache__/xsvalUtils.cpython-34.pyc' robotpkg_create: can't stat `/opt/openrobots/lib/python3.4/site-packages/pymavlink/generator/lib/minixsv/__pycache__/xsvalUtils.cpython-34.pyo' robotpkg_create: lstat failed for file lib/python3.4/site-packages/mavnative.so: No such file or directory make[3]: *** [pkg-tarup] Error 2 => Unlinking package in /opt/robotpkg/var/lib/robotpkg/wip/packages/bsd/Ubuntu-14.04-x86_64/All => Unlinking package in /opt/robotpkg/var/lib/robotpkg/wip/packages/bsd/Ubuntu-14.04-x86_64/pub => Unlinking package in /opt/robotpkg/var/lib/robotpkg/wip/packages/bsd/Ubuntu-14.04-x86_64/jrl => Unlinking package in /opt/robotpkg/var/lib/robotpkg/wip/packages/bsd/Ubuntu-14.04-x86_64/pal => Updating debian binary packages make[2]: *** [package-failed] Error 2 => Marking py34-mavlink-1.1.62 as broken ERROR: make: *** [package] Error 2 robotpkg_delete: Couldn't remove /opt/openrobots/lib/python3.4/site-packages/mavnative.so robotpkg_delete: Couldn't remove /opt/openrobots/lib/python3.4/site-packages/pymavlink/generator/lib/genxmlif/__pycache__/__init__.cpython-34.pyc robotpkg_delete: Couldn't remove /opt/openrobots/lib/python3.4/site-packages/pymavlink/generator/lib/genxmlif/__pycache__/__init__.cpython-34.pyo robotpkg_delete: Couldn't remove /opt/openrobots/lib/python3.4/site-packages/pymavlink/generator/lib/genxmlif/__pycache__/xmlif4Dom.cpython-34.pyc robotpkg_delete: Couldn't remove /opt/openrobots/lib/python3.4/site-packages/pymavlink/generator/lib/genxmlif/__pycache__/xmlif4Dom.cpython-34.pyo robotpkg_delete: Couldn't remove /opt/openrobots/lib/python3.4/site-packages/pymavlink/generator/lib/genxmlif/__pycache__/xmlifApi.cpython-34.pyc robotpkg_delete: Couldn't remove /opt/openrobots/lib/python3.4/site-packages/pymavlink/generator/lib/genxmlif/__pycache__/xmlifApi.cpython-34.pyo robotpkg_delete: Couldn't remove /opt/openrobots/lib/python3.4/site-packages/pymavlink/generator/lib/genxmlif/__pycache__/xmlifDom.cpython-34.pyc robotpkg_delete: Couldn't remove /opt/openrobots/lib/python3.4/site-packages/pymavlink/generator/lib/genxmlif/__pycache__/xmlifDom.cpython-34.pyo robotpkg_delete: Couldn't remove /opt/openrobots/lib/python3.4/site-packages/pymavlink/generator/lib/genxmlif/__pycache__/xmlifElementTree.cpython-34.pyc robotpkg_delete: Couldn't remove /opt/openrobots/lib/python3.4/site-packages/pymavlink/generator/lib/genxmlif/__pycache__/xmlifElementTree.cpython-34.pyo robotpkg_delete: Couldn't remove /opt/openrobots/lib/python3.4/site-packages/pymavlink/generator/lib/genxmlif/__pycache__/xmlifMinidom.cpython-34.pyc robotpkg_delete: Couldn't remove /opt/openrobots/lib/python3.4/site-packages/pymavlink/generator/lib/genxmlif/__pycache__/xmlifMinidom.cpython-34.pyo robotpkg_delete: Couldn't remove /opt/openrobots/lib/python3.4/site-packages/pymavlink/generator/lib/genxmlif/__pycache__/xmlifUtils.cpython-34.pyc robotpkg_delete: Couldn't remove /opt/openrobots/lib/python3.4/site-packages/pymavlink/generator/lib/genxmlif/__pycache__/xmlifUtils.cpython-34.pyo robotpkg_delete: Couldn't remove /opt/openrobots/lib/python3.4/site-packages/pymavlink/generator/lib/genxmlif/__pycache__/xmliftest.cpython-34.pyc robotpkg_delete: Couldn't remove /opt/openrobots/lib/python3.4/site-packages/pymavlink/generator/lib/genxmlif/__pycache__/xmliftest.cpython-34.pyo robotpkg_delete: Couldn't remove /opt/openrobots/lib/python3.4/site-packages/pymavlink/generator/lib/minixsv/__pycache__/minixsvWrapper.cpython-34.pyc robotpkg_delete: Couldn't remove /opt/openrobots/lib/python3.4/site-packages/pymavlink/generator/lib/minixsv/__pycache__/minixsvWrapper.cpython-34.pyo robotpkg_delete: Couldn't remove /opt/openrobots/lib/python3.4/site-packages/pymavlink/generator/lib/minixsv/__pycache__/pyxsval.cpython-34.pyc robotpkg_delete: Couldn't remove /opt/openrobots/lib/python3.4/site-packages/pymavlink/generator/lib/minixsv/__pycache__/pyxsval.cpython-34.pyo robotpkg_delete: Couldn't remove /opt/openrobots/lib/python3.4/site-packages/pymavlink/generator/lib/minixsv/__pycache__/xsvalBase.cpython-34.pyc robotpkg_delete: Couldn't remove /opt/openrobots/lib/python3.4/site-packages/pymavlink/generator/lib/minixsv/__pycache__/xsvalBase.cpython-34.pyo robotpkg_delete: Couldn't remove /opt/openrobots/lib/python3.4/site-packages/pymavlink/generator/lib/minixsv/__pycache__/xsvalErrorHandler.cpython-34.pyc robotpkg_delete: Couldn't remove /opt/openrobots/lib/python3.4/site-packages/pymavlink/generator/lib/minixsv/__pycache__/xsvalErrorHandler.cpython-34.pyo robotpkg_delete: Couldn't remove /opt/openrobots/lib/python3.4/site-packages/pymavlink/generator/lib/minixsv/__pycache__/xsvalSchema.cpython-34.pyc robotpkg_delete: Couldn't remove /opt/openrobots/lib/python3.4/site-packages/pymavlink/generator/lib/minixsv/__pycache__/xsvalSchema.cpython-34.pyo robotpkg_delete: Couldn't remove /opt/openrobots/lib/python3.4/site-packages/pymavlink/generator/lib/minixsv/__pycache__/xsvalSimpleTypes.cpython-34.pyc robotpkg_delete: Couldn't remove /opt/openrobots/lib/python3.4/site-packages/pymavlink/generator/lib/minixsv/__pycache__/xsvalSimpleTypes.cpython-34.pyo robotpkg_delete: Couldn't remove /opt/openrobots/lib/python3.4/site-packages/pymavlink/generator/lib/minixsv/__pycache__/xsvalUtils.cpython-34.pyc robotpkg_delete: Couldn't remove /opt/openrobots/lib/python3.4/site-packages/pymavlink/generator/lib/minixsv/__pycache__/xsvalUtils.cpython-34.pyo robotpkg_delete: Directory `/opt/openrobots/share/mavlink' disappeared, skipping ===> Logging bulk summary for py34-mavlink-1.1.62 => Checking leftover files WARNING: 1 files leftover. => Creating bulk log files => Logging bulk metadata ===> Cleaning temporary files for py34-mavlink-1.1.62 ===> Done bulk for py34-mavlink-1.1.62 [24%] Processing wip/py-mavlink:py27-mavlink-1.1.62 ===> Bulk building for py27-mavlink-1.1.62 Binary package for py27-mavlink-1.1.62 is up-to-date. [25%] Processing wip/py-mavlink:py32-mavlink-1.1.62 ===> Bulk building for py32-mavlink-1.1.62 Binary package for py32-mavlink-1.1.62 is up-to-date. [25%] Processing wip/py-mavlink:py35-mavlink-1.1.62 ===> Bulk building for py35-mavlink-1.1.62 Binary package for py35-mavlink-1.1.62 is up-to-date. [25%] Processing wip/py-mavlink:py36-mavlink-1.1.62 ===> Bulk building for py36-mavlink-1.1.62 Binary package for py36-mavlink-1.1.62 is up-to-date. [26%] Processing wip/py-mavlink:py37-mavlink-1.1.62 ===> Bulk building for py37-mavlink-1.1.62 Binary package for py37-mavlink-1.1.62 is up-to-date. [26%] Processing wip/prf-ros-control:prf-ros-control-0.2.6r3 ===> Bulk building for prf-ros-control-0.2.6r3 Binary package for prf-ros-control-0.2.6r3 is up-to-date. [28%] Processing wip/libhatp:libhatp-1.3.0 ===> Bulk building for libhatp-1.3.0 Binary package for libhatp-1.3.0 is up-to-date. [30%] Processing wip/libmove3d-hri:libmove3d-hri-2.24 ===> Bulk building for libmove3d-hri-2.24 Binary package for libmove3d-hri-2.24 is up-to-date. [30%] Processing wip/prf-gazebo-ros-pkgs:prf-gazebo-ros-pkgs-2.6.7r4 ===> Cleaning temporary files for prf-gazebo-ros-pkgs-2.6.7r4 ===> Bulk building for prf-gazebo-ros-pkgs-2.6.7r4 => Checking for clear installation => Installing /opt/robotpkg/var/lib/robotpkg/packages/bsd/Ubuntu-14.04-x86_64/All/digest-20080510.tgz => Installing /opt/robotpkg/var/lib/robotpkg/packages/bsd/Ubuntu-14.04-x86_64/All/tnftp-20130505~ssl.tgz => Required robotpkg package digest>=20080510: digest-20080510 found => Required robotpkg package tnftp>=20130505~ssl: tnftp-20130505~ssl found => Required system package gnupg>=1: gnupg-1.4.16 found => Required system package gzip: gzip-1.6 found => Required system package pax and tar archivers: pax found => Required system package pkg_install>=20110805.9: pkg_install-20110805.9 found => Required system package pkgrepo2deb>=1.4: pkgrepo2deb-1.4 found => Dependency digest-20080510 already installed => Installing /opt/robotpkg/var/lib/robotpkg/wip/packages/bsd/Ubuntu-14.04-x86_64/All/prf-ros-control-0.2.6r3.tgz => Dependency tnftp-20130505~ssl already installed => Building with no option. => Use the GNU C++ compiler: c++-compiler provided by g++>=3 => Use the GNU C compiler: c-compiler provided by gcc>=3 => Use python-2.7: python>=2.5<3.8 provided by python27>=2.7<2.8 => Use ros indigo: ros>=groovy ros>=hydro provided by ros-indigo => Required system package boost-headers>=1.34.1: boost-headers-1.54 found => Required system package boostlib-filesystem>=1.34.1: boost-libs-1.54.0 found => Required system package boostlib-iostreams>=1.34.1: boost-libs-1.54.0 found => Required system package boostlib-math>=1.34.1: boost-libs-1.54.0 found => Required system package boostlib-thread>=1.34.1: boost-libs-1.54.0 found => Required system package cmake>=2.8.3: cmake-2.8.12.2 found => Required system package eigen3>=3.0.0: eigen3-3.2.0 found => Required system package g++>=3: g++-4.8 found => Required system package gazebo>=1: gazebo-2.2.3 found => Required system package gcc>=3: gcc-4.8 found => Required system package googletest: googletest found => Required system package libogre>=1.0: libogre-1.8.1 found => Required system package libstdc++: libstdc++ found => Required system package pkg-config>=0.22: pkg-config-0.26 found => Required system package py27-empy>=3: py27-empy-3.3 found => Required system package py27-nose>=0.10: py27-nose-1.3.1 found => Required system package python27>=2.7<2.8: python27-2.7.6 found => Required system package ros-actionlib>=1.11<1.12: ros-actionlib-1.11.13 found => Required system package ros-catkin>=0.6<0.7: ros-catkin-0.6.19 found => Required system package ros-class-loader>=0.3<0.4: ros-class-loader-0.3.9 found => Required system package ros-comm>=1.11<1.12: ros-comm-1.11.21 found => Required system package ros-common-msgs>=1.11<1.12: ros-common-msgs-1.11.10 found => Required system package ros-control-toolbox>=1.13<1.15: ros-control-toolbox-1.13.3 found => Required system package ros-genmsg>=0.5<0.6: ros-genmsg-0.5.8 found => Required system package ros-geometry>=1.11<1.12: ros-geometry-1.11.9 found => Required system package ros-message-generation>=0.2<0.3: ros-message-generation-0.2.10 found => Required system package ros-message-runtime>=0.4<0.5: ros-message-runtime-0.4.12 found => Required system package ros-pluginlib>=1.10<1.11: ros-pluginlib-1.10.7 found => Required system package ros-ros>=1.11<1.12: ros-ros-1.11.14 found => Required system package ros-std-msgs>=0.5: ros-std-msgs-0.5.10 found => Required system package ros-urdf>=1.11<1.12: ros-urdf-1.11.15 found => Required robotpkg package prf-ros-control>=0.2: prf-ros-control-0.2.6r3 found => SHA1 checksums OK => RMD160 checksums OK An unexpected error occured. The last 10 log lines are shown below. | ignition::math::Pose3d pose; | ^ | /local/robotpkg/var/tmp/robotpkg/wip/prf-gazebo-ros-pkgs/work/gazebo_ros_pkgs-2.6.7/gazebo_plugins/src/gazebo_ros_block_laser.cpp:399:3: error: 'pose' was not declared in this scope | pose.Pos().X() = 0.5*sin(0.01*this->sim_time_.Double()); | ^ | make[2]: *** [gazebo_plugins/CMakeFiles/gazebo_ros_block_laser.dir/src/gazebo_ros_block_laser.cpp.o] Error 1 | make[1]: *** [gazebo_plugins/CMakeFiles/gazebo_ros_block_laser.dir/all] Error 2 | make[2]: Leaving directory `/local/robotpkg/var/tmp/robotpkg/wip/prf-gazebo-ros-pkgs/work/gazebo_ros_pkgs-2.6.7/build' | make[1]: Leaving directory `/local/robotpkg/var/tmp/robotpkg/wip/prf-gazebo-ros-pkgs/work/gazebo_ros_pkgs-2.6.7/build' | make: *** [all] Error 2 For details or bug reports, check the complete log file in: /local/robotpkg/var/tmp/robotpkg/wip/prf-gazebo-ros-pkgs/work/build.log make[3]: *** [do-build] Error 2 => Marking prf-gazebo-ros-pkgs-2.6.7r4 as broken make[2]: *** [pkg-check-installed] Error 2 ERROR: make: *** [package] Error 2 ===> Logging bulk summary for prf-gazebo-ros-pkgs-2.6.7r4 => Checking leftover files => Creating bulk log files => Logging bulk metadata ===> Cleaning temporary files for prf-gazebo-ros-pkgs-2.6.7r4 ===> Done bulk for prf-gazebo-ros-pkgs-2.6.7r4 [30%] Processing wip/head-action:head-action-0.0.1r4 ===> Bulk building for head-action-0.0.1r4 Binary package for head-action-0.0.1r4 is up-to-date. [31%] Processing wip/certi:certi-3.5.1 ===> Bulk building for certi-3.5.1 Binary package for certi-3.5.1 is up-to-date. [31%] Processing wip/gdalwrap:gdalwrap-0.1.10 ===> Cleaning temporary files for gdalwrap-0.1.10 ===> Bulk building for gdalwrap-0.1.10 => Checking for clear installation => Installing /opt/robotpkg/var/lib/robotpkg/packages/bsd/Ubuntu-14.04-x86_64/All/digest-20080510.tgz => Installing /opt/robotpkg/var/lib/robotpkg/packages/bsd/Ubuntu-14.04-x86_64/All/tnftp-20130505~ssl.tgz => Required robotpkg package digest>=20080510: digest-20080510 found => Required robotpkg package tnftp>=20091122: tnftp-20130505~ssl found => Required system package gnupg>=1: gnupg-1.4.16 found => Required system package gzip: gzip-1.6 found => Required system package pax and tar archivers: pax found => Required system package pkg_install>=20110805.9: pkg_install-20110805.9 found => Required system package pkgrepo2deb>=1.4: pkgrepo2deb-1.4 found => Dependency digest-20080510 already installed => Required system package gdal>=1.6: MISSING => Dependency tnftp-20130505~ssl already installed ERROR: ====================================================================== ERROR: Missing system packages required for gdalwrap-0.1.10: ERROR: ERROR: gdal>=1.6 (Ubuntu package libgdal1-dev) ERROR: ERROR: Please use the system package management tool to install these ERROR: dependencies. If a robotpkg version of a dependency is available, ERROR: you can configure robotpkg.conf to use this version instead. ERROR: ERROR: See /local/robotpkg/var/tmp/robotpkg/wip/gdalwrap/work/sysdep.log for details. ERROR: ====================================================================== make[2]: *** [sys-depends] Error 2 ===> Logging bulk summary for gdalwrap-0.1.10 => Checking leftover files => Creating bulk log files => Logging bulk metadata ===> Cleaning temporary files for gdalwrap-0.1.10 ===> Done bulk for gdalwrap-0.1.10 [32%] Processing wip/mumps:mumps-4.10.0 ===> Bulk building for mumps-4.10.0 Binary package for mumps-4.10.0 is up-to-date. [32%] Processing wip/metapod:metapod-1.0.10 Warning: DOXYGEN_PLIST_DIR in wip/metapod is deprecated. Warning: use DYNAMIC_PLIST_DIRS instead. ===> Bulk building for metapod-1.0.10 Binary package for metapod-1.0.10 is up-to-date. [32%] Processing wip/jsbsim:jsbsim-20150424 ===> Bulk building for jsbsim-20150424 Binary package for jsbsim-20150424 is up-to-date. [33%] Processing wip/dptu-genom3:dptu-genom3-0.2~pocolibs-client-c+codels+openprs+pocolibs-server+!* ===> Bulk building for dptu-genom3-0.2~codels+openprs+pocolibs-client-c+pocolibs-server Binary package for dptu-genom3-0.2~codels+openprs+pocolibs-client-c+pocolibs-server is up-to-date. [33%] Processing wip/dptu-genom3:dptu-genom3-0.2~codels+openprs+ros-client-c+ros-client-ros+ros-server+!* ===> Bulk building for dptu-genom3-0.2~codels+openprs+ros-client-c+ros-client-ros+ros-server Binary package for dptu-genom3-0.2~codels+openprs+ros-client-c+ros-client-ros+ros-server is up-to-date. [33%] Processing wip/ros-swri-serial-util:ros-swri-serial-util-2.3.0 ===> Bulk building for ros-swri-serial-util-2.3.0 Binary package for ros-swri-serial-util-2.3.0 is up-to-date. [34%] Processing wip/ros-swri-string-util:ros-swri-string-util-2.3.0 ===> Cleaning temporary files for ros-swri-string-util-2.3.0 ===> Bulk building for ros-swri-string-util-2.3.0 => Checking for clear installation => Installing /opt/robotpkg/var/lib/robotpkg/packages/bsd/Ubuntu-14.04-x86_64/All/digest-20080510.tgz => Installing /opt/robotpkg/var/lib/robotpkg/packages/bsd/Ubuntu-14.04-x86_64/All/tnftp-20130505~ssl.tgz => Required robotpkg package digest>=20080510: digest-20080510 found => Required robotpkg package tnftp>=20130505~ssl: tnftp-20130505~ssl found => Required system package gnupg>=1: gnupg-1.4.16 found => Required system package gzip: gzip-1.6 found => Required system package pax and tar archivers: pax found => Required system package pkg_install>=20110805.9: pkg_install-20110805.9 found => Required system package pkgrepo2deb>=1.4: pkgrepo2deb-1.4 found => Dependency digest-20080510 already installed => Installing /opt/robotpkg/var/lib/robotpkg/packages/bsd/Ubuntu-14.04-x86_64/All/ros-catkin-0.7.14.tgz => Dependency tnftp-20130505~ssl already installed => Building with no option. => Use the GNU C++ compiler: c++-compiler provided by g++>=3 => Use the GNU C compiler: c-compiler provided by gcc>=3 => Use python-2.7: python>=2.5<3.8 provided by python27>=2.7<2.8 => Use ros melodic: ros==melodic provided by ros-melodic => Required system package cmake>=2.8.3: cmake-2.8.12.2 found => Required system package g++>=3: g++-4.8 found => Required system package gcc>=3: gcc-4.8 found => Required system package googletest: googletest found => Required system package libstdc++: libstdc++ found => Required system package pkg-config>=0.22: pkg-config-0.26 found => Required system package py27-empy>=3: py27-empy-3.3 found => Required system package py27-nose>=0.10: py27-nose-1.3.1 found => Required system package python27>=2.7<2.8: python27-2.7.6 found => Required robotpkg package ros-catkin>=0.7<0.8: ros-catkin-0.7.14 found => SHA1 checksums OK => RMD160 checksums OK An unexpected error occured. The last 10 log lines are shown below. | | Add the installation prefix of "rostest" to CMAKE_PREFIX_PATH or set | "rostest_DIR" to a directory containing one of the above files. If | "rostest" provides a separate development package or SDK, be sure it has | been installed. | | | -- Configuring incomplete, errors occurred! | See also "/local/robotpkg/var/tmp/robotpkg/wip/ros-swri-string-util/work/marti_common-2.3.0/swri_string_util/CMakeFiles/CMakeOutput.log". | See also "/local/robotpkg/var/tmp/robotpkg/wip/ros-swri-string-util/work/marti_common-2.3.0/swri_string_util/CMakeFiles/CMakeError.log". For details or bug reports, check the complete log file in: /local/robotpkg/var/tmp/robotpkg/wip/ros-swri-string-util/work/configure.log make[3]: *** [do-configure-cmake] Error 1 make[2]: *** [pkg-check-installed] Error 2 => Marking ros-swri-string-util-2.3.0 as broken ERROR: make: *** [package] Error 2 ===> Logging bulk summary for ros-swri-string-util-2.3.0 => Checking leftover files => Creating bulk log files => Logging bulk metadata ===> Cleaning temporary files for ros-swri-string-util-2.3.0 ===> Done bulk for ros-swri-string-util-2.3.0 [34%] Processing wip/can-utils:can-utils-2018.02.0 ===> Bulk building for can-utils-2018.02.0 Binary package for can-utils-2018.02.0 is up-to-date. [35%] Processing wip/tf-lookup:tf-lookup-0.0.1r1 ===> Bulk building for tf-lookup-0.0.1r1 Binary package for tf-lookup-0.0.1r1 is up-to-date. [35%] Processing wip/ros-swri-math-util:ros-swri-math-util-2.3.0 ===> Bulk building for ros-swri-math-util-2.3.0 Binary package for ros-swri-math-util-2.3.0 is up-to-date. [35%] Processing wip/hrp2-14-description:hrp2-14-description-1.0.5 ===> Bulk building for hrp2-14-description-1.0.5 Binary package for hrp2-14-description-1.0.5 is up-to-date. [36%] Processing wip/hrp2-computer-monitor:hrp2-computer-monitor-1.0.2 ===> Bulk building for hrp2-computer-monitor-1.0.2 Binary package for hrp2-computer-monitor-1.0.2 is up-to-date. [36%] Processing wip/FRILibrary:FRILibrary-1.2r1 ===> Bulk building for FRILibrary-1.2r1 Binary package for FRILibrary-1.2r1 is up-to-date. [36%] Processing wip/pal-transmissions:pal-transmissions-0.2.2r2 ===> Bulk building for pal-transmissions-0.2.2r2 Binary package for pal-transmissions-0.2.2r2 is up-to-date. [37%] Processing wip/py-hla:py27-hla-1.1.1r1 ===> Cleaning temporary files for py27-hla-1.1.1r1 ===> Bulk building for py27-hla-1.1.1r1 => Checking for clear installation => Installing /opt/robotpkg/var/lib/robotpkg/packages/bsd/Ubuntu-14.04-x86_64/All/digest-20080510.tgz => Installing /opt/robotpkg/var/lib/robotpkg/packages/bsd/Ubuntu-14.04-x86_64/All/tnftp-20130505~ssl.tgz => Required robotpkg package digest>=20080510: digest-20080510 found => Required robotpkg package tnftp>=20091122: tnftp-20130505~ssl found => Required system package gnupg>=1: gnupg-1.4.16 found => Required system package gzip: gzip-1.6 found => Required system package patch>=2.0: patch-2.7.1 found => Required system package pax and tar archivers: pax found => Required system package pkg_install>=20110805.9: pkg_install-20110805.9 found => Required system package pkgrepo2deb>=1.4: pkgrepo2deb-1.4 found => Installing /opt/robotpkg/var/lib/robotpkg/packages/bsd/Ubuntu-14.04-x86_64/All/certi-20130312r1.tgz => Dependency digest-20080510 already installed => Dependency tnftp-20130505~ssl already installed => Building with no option. => Use the GNU C++ compiler: c++-compiler provided by g++>=3 => Use the GNU C compiler: c-compiler provided by gcc>=3 => Use python-2.7: python>=2.5<3.8 provided by python27>=2.7<2.8 => Required system package cmake>=2.6: cmake-2.8.12.2 found => Required system package g++>=3: g++-4.8 found => Required system package gcc>=3: gcc-4.8 found => Required system package libstdc++: libstdc++ found => Required system package python27>=2.7<2.8: python27-2.7.6 found => Required robotpkg package certi>=3.4.0: certi-20130312r1 found ERROR: ====================================================================== ERROR: A package matching `certi>=3.4.0' ERROR: should be installed but some files are missing. ERROR: ERROR: searching in /opt/openrobots ERROR: found: /opt/openrobots/bin/rtia ERROR: missing: /opt/openrobots/include/hla13/RTI.hh ERROR: ERROR: Please reinstall the package in ../../wip/certi ERROR: ====================================================================== make[2]: *** [do-depends] Error 1 ERROR: make: *** [depends] Error 2 ===> Logging bulk summary for py27-hla-1.1.1r1 => Checking leftover files => Creating bulk log files => Logging bulk metadata ===> Cleaning temporary files for py27-hla-1.1.1r1 ===> Done bulk for py27-hla-1.1.1r1 [37%] Processing wip/py-hla:py32-hla-1.1.1r1 ===> Bulk building for py32-hla-1.1.1r1 Binary package for py32-hla-1.1.1r1 is up-to-date. [38%] Processing wip/py-hla:py34-hla-1.1.1r1 ===> Cleaning temporary files for py34-hla-1.1.1r1 ===> Bulk building for py34-hla-1.1.1r1 => Checking for clear installation => Installing /opt/robotpkg/var/lib/robotpkg/packages/bsd/Ubuntu-14.04-x86_64/All/digest-20080510.tgz => Installing /opt/robotpkg/var/lib/robotpkg/packages/bsd/Ubuntu-14.04-x86_64/All/tnftp-20130505~ssl.tgz => Required robotpkg package digest>=20080510: digest-20080510 found => Required robotpkg package tnftp>=20091122: tnftp-20130505~ssl found => Required system package gnupg>=1: gnupg-1.4.16 found => Required system package gzip: gzip-1.6 found => Required system package patch>=2.0: patch-2.7.1 found => Required system package pax and tar archivers: pax found => Required system package pkg_install>=20110805.9: pkg_install-20110805.9 found => Required system package pkgrepo2deb>=1.4: pkgrepo2deb-1.4 found => Installing /opt/robotpkg/var/lib/robotpkg/packages/bsd/Ubuntu-14.04-x86_64/All/certi-20130312r1.tgz => Dependency digest-20080510 already installed => Dependency tnftp-20130505~ssl already installed => Building with no option. => Use the GNU C++ compiler: c++-compiler provided by g++>=3 => Use the GNU C compiler: c-compiler provided by gcc>=3 => Use python-3.4: python>=2.5<3.8 provided by python34>=3.4<3.5 => Required system package cmake>=2.6: cmake-2.8.12.2 found => Required system package g++>=3: g++-4.8 found => Required system package gcc>=3: gcc-4.8 found => Required system package libstdc++: libstdc++ found => Required system package python34>=3.4<3.5: python34-3.4.3 found => Required robotpkg package certi>=3.4.0: certi-20130312r1 found ERROR: ====================================================================== ERROR: A package matching `certi>=3.4.0' ERROR: should be installed but some files are missing. ERROR: ERROR: searching in /opt/openrobots ERROR: found: /opt/openrobots/bin/rtia ERROR: missing: /opt/openrobots/include/hla13/RTI.hh ERROR: ERROR: Please reinstall the package in ../../wip/certi ERROR: ====================================================================== make[2]: *** [do-depends] Error 1 ERROR: make: *** [depends] Error 2 ===> Logging bulk summary for py34-hla-1.1.1r1 => Checking leftover files => Creating bulk log files => Logging bulk metadata ===> Cleaning temporary files for py34-hla-1.1.1r1 ===> Done bulk for py34-hla-1.1.1r1 [38%] Processing wip/py-hla:py35-hla-1.1.1r1 ===> Bulk building for py35-hla-1.1.1r1 Binary package for py35-hla-1.1.1r1 is up-to-date. [38%] Processing wip/py-hla:py36-hla-1.1.1r1 ===> Bulk building for py36-hla-1.1.1r1 Binary package for py36-hla-1.1.1r1 is up-to-date. [39%] Processing wip/py-hla:py37-hla-1.1.1r1 ===> Bulk building for py37-hla-1.1.1r1 Binary package for py37-hla-1.1.1r1 is up-to-date. [39%] Processing wip/ompl:ompl-1.0.0 ===> Bulk building for ompl-1.0.0 Binary package for ompl-1.0.0 is up-to-date. [39%] Processing wip/pyrene-motions:pyrene-motions ===> Cleaning temporary files for pyrene-motions ===> Bulk building for pyrene-motions => Checking for clear installation => Installing /opt/robotpkg/var/lib/robotpkg/packages/bsd/Ubuntu-14.04-x86_64/All/digest-20080510.tgz => Installing /opt/robotpkg/var/lib/robotpkg/packages/bsd/Ubuntu-14.04-x86_64/All/tnftp-20130505~ssl.tgz => Required robotpkg package digest>=20080510: digest-20080510 found => Required robotpkg package tnftp>=20091122: tnftp-20130505~ssl found => Required system package gnupg>=1: gnupg-1.4.16 found => Required system package gzip: gzip-1.6 found => Required system package pax and tar archivers: pax found => Required system package pkg_install>=20110805.9: pkg_install-20110805.9 found => Required system package pkgrepo2deb>=1.4: pkgrepo2deb-1.4 found => Dependency digest-20080510 already installed => Dependency tnftp-20130505~ssl already installed => Building with no option. => Use the GNU C++ compiler: c++-compiler provided by g++>=3 => Use the GNU C compiler: c-compiler provided by gcc>=3 => Required system package cmake>=2.6: cmake-2.8.12.2 found => Required system package g++>=3: g++-4.8 found => Required system package gcc>=3: gcc-4.8 found => Required system package libstdc++: libstdc++ found => Required system package pkg-config>=0.22: pkg-config-0.26 found => SHA1 checksums OK => RMD160 checksums OK => Adding run-time search paths to pkg-config files => Registering installation for pyrene-motions make[3]: *** [pkg-tarup] Error 1 => Unlinking package in /opt/robotpkg/var/lib/robotpkg/wip/packages/bsd/Ubuntu-14.04-x86_64/All => Unlinking package in /opt/robotpkg/var/lib/robotpkg/wip/packages/bsd/Ubuntu-14.04-x86_64/pub => Unlinking package in /opt/robotpkg/var/lib/robotpkg/wip/packages/bsd/Ubuntu-14.04-x86_64/jrl => Unlinking package in /opt/robotpkg/var/lib/robotpkg/wip/packages/bsd/Ubuntu-14.04-x86_64/pal => Updating debian binary packages make[3]: *** [deb-package] Error 1 make[2]: *** [package-failed] Error 2 => Marking pyrene-motions as broken ERROR: make: *** [package] Error 2 ===> Logging bulk summary for pyrene-motions => Checking leftover files WARNING: 56 files leftover. => Creating bulk log files => Logging bulk metadata ===> Cleaning temporary files for pyrene-motions ===> Done bulk for pyrene-motions [40%] Processing wip/infuse-asn1-types:infuse-asn1-types-0.3 ===> Cleaning temporary files for infuse-asn1-types-0.3 ===> Bulk building for infuse-asn1-types-0.3 => Checking for clear installation => Installing /opt/robotpkg/var/lib/robotpkg/packages/bsd/Ubuntu-14.04-x86_64/All/digest-20080510.tgz => Installing /opt/robotpkg/var/lib/robotpkg/packages/bsd/Ubuntu-14.04-x86_64/All/tnftp-20130505~ssl.tgz => Required robotpkg package digest>=20080510: digest-20080510 found => Required robotpkg package tnftp>=20091122: tnftp-20130505~ssl found => Required system package gnupg>=1: gnupg-1.4.16 found => Required system package gzip: gzip-1.6 found => Required system package pax and tar archivers: pax found => Required system package pkg_install>=20110805.9: pkg_install-20110805.9 found => Required system package pkgrepo2deb>=1.4: pkgrepo2deb-1.4 found => Dependency digest-20080510 already installed => Required system package mono>=4.2: MISSING => Dependency tnftp-20130505~ssl already installed ERROR: ====================================================================== ERROR: Missing system packages required for infuse-asn1-types-0.3: ERROR: ERROR: mono>=4.2 (Ubuntu package mono-devel) ERROR: ERROR: Please use the system package management tool to install these ERROR: dependencies. If a robotpkg version of a dependency is available, ERROR: you can configure robotpkg.conf to use this version instead. ERROR: ERROR: See /local/robotpkg/var/tmp/robotpkg/wip/infuse-asn1-types/work/sysdep.log for details. ERROR: ====================================================================== make[2]: *** [sys-depends] Error 2 ===> Logging bulk summary for infuse-asn1-types-0.3 => Checking leftover files => Creating bulk log files => Logging bulk metadata ===> Cleaning temporary files for infuse-asn1-types-0.3 ===> Done bulk for infuse-asn1-types-0.3 [40%] Processing wip/talos-data:talos-data-0.0.20 ===> Bulk building for talos-data-0.0.20 Binary package for talos-data-0.0.20 is up-to-date. [40%] Processing wip/backward-ros:backward-ros-0.1.4r3 ===> Cleaning temporary files for backward-ros-0.1.4r3 ===> Bulk building for backward-ros-0.1.4r3 => Checking for clear installation => Installing /opt/robotpkg/var/lib/robotpkg/packages/bsd/Ubuntu-14.04-x86_64/All/digest-20080510.tgz => Installing /opt/robotpkg/var/lib/robotpkg/packages/bsd/Ubuntu-14.04-x86_64/All/tnftp-20130505~ssl.tgz => Required robotpkg package digest>=20080510: digest-20080510 found => Required robotpkg package tnftp>=20091122: tnftp-20130505~ssl found => Required system package gnupg>=1: gnupg-1.4.16 found => Required system package gzip: gzip-1.6 found => Required system package pax and tar archivers: pax found => Required system package pkg_install>=20110805.9: pkg_install-20110805.9 found => Required system package pkgrepo2deb>=1.4: pkgrepo2deb-1.4 found => Dependency digest-20080510 already installed => Dependency tnftp-20130505~ssl already installed => Building with no option. => Use the GNU C++ compiler: c++-compiler provided by g++>=3 => Use the GNU C compiler: c-compiler provided by gcc>=3 => Use python-2.7: python>=2.5<3.8 provided by python27>=2.7<2.8 => Use ros indigo: ros>=groovy provided by ros-indigo => Required system package cmake>=2.8.3: cmake-2.8.12.2 found => Required system package g++>=3: g++-4.8 found => Required system package gcc>=3: gcc-4.8 found => Required system package googletest: googletest found => Required system package libstdc++: libstdc++ found => Required system package pkg-config>=0.22: pkg-config-0.26 found => Required system package py27-empy>=3: py27-empy-3.3 found => Required system package py27-nose>=0.10: py27-nose-1.3.1 found => Required system package python27>=2.7<2.8: python27-2.7.6 found => Required system package ros-catkin>=0.6<0.7: ros-catkin-0.6.19 found => Required system package ros-comm>=1.11<1.12: ros-comm-1.11.21 found => SHA1 checksums OK => RMD160 checksums OK An unexpected error occured. The last 10 log lines are shown below. | CMake Error in CMakeLists.txt: | Cannot find source file: | | IMPORTED | | Tried extensions .c .C .c++ .cc .cpp .cxx .m .M .mm .h .hh .h++ .hm .hpp | .hxx .in .txx | | | -- Build files have been written to: /local/robotpkg/var/tmp/robotpkg/wip/backward-ros/work/backward_ros-0.1.4 For details or bug reports, check the complete log file in: /local/robotpkg/var/tmp/robotpkg/wip/backward-ros/work/configure.log make[3]: *** [do-configure-cmake] Error 1 make[2]: *** [pkg-check-installed] Error 2 => Marking backward-ros-0.1.4r3 as broken ERROR: make: *** [package] Error 2 ===> Logging bulk summary for backward-ros-0.1.4r3 => Checking leftover files => Creating bulk log files => Logging bulk metadata ===> Cleaning temporary files for backward-ros-0.1.4r3 ===> Done bulk for backward-ros-0.1.4r3 [41%] Processing wip/move3d-assets:move3d-assets-20120125 ===> Bulk building for move3d-assets-20120125 Binary package for move3d-assets-20120125 is up-to-date. [41%] Processing wip/ros-swri-nodelet:ros-swri-nodelet-2.3.0 ===> Cleaning temporary files for ros-swri-nodelet-2.3.0 ===> Bulk building for ros-swri-nodelet-2.3.0 => Checking for clear installation => Installing /opt/robotpkg/var/lib/robotpkg/packages/bsd/Ubuntu-14.04-x86_64/All/digest-20080510.tgz => Installing /opt/robotpkg/var/lib/robotpkg/packages/bsd/Ubuntu-14.04-x86_64/All/tnftp-20130505~ssl.tgz => Required robotpkg package digest>=20080510: digest-20080510 found => Required robotpkg package tnftp>=20130505~ssl: tnftp-20130505~ssl found => Required system package gnupg>=1: gnupg-1.4.16 found => Required system package gzip: gzip-1.6 found => Required system package pax and tar archivers: pax found => Required system package pkg_install>=20110805.9: pkg_install-20110805.9 found => Required system package pkgrepo2deb>=1.4: pkgrepo2deb-1.4 found => Dependency digest-20080510 already installed => Installing /opt/robotpkg/var/lib/robotpkg/packages/bsd/Ubuntu-14.04-x86_64/All/ros-catkin-0.7.14.tgz => Installing /opt/robotpkg/var/lib/robotpkg/packages/bsd/Ubuntu-14.04-x86_64/All/ros-comm-1.14.3.tgz => Installing /opt/robotpkg/var/lib/robotpkg/packages/bsd/Ubuntu-14.04-x86_64/All/ros-nodelet-core-1.9.16.tgz => Dependency ros-std-msgs-0.5.11 already installed => Dependency tnftp-20130505~ssl already installed => Building with no option. => Use the GNU C++ compiler: c++-compiler provided by g++>=3 => Use the GNU C compiler: c-compiler provided by gcc>=3 => Use python-2.7: python>=2.5<3.8 provided by python27>=2.7<2.8 => Use ros melodic: ros==melodic provided by ros-melodic => Required system package cmake>=2.8.3: cmake-2.8.12.2 found => Required system package g++>=3: g++-4.8 found => Required system package gcc>=3: gcc-4.8 found => Required system package googletest: googletest found => Required system package libstdc++: libstdc++ found => Required system package pkg-config>=0.22: pkg-config-0.26 found => Required system package py27-empy>=3: py27-empy-3.3 found => Required system package py27-nose>=0.10: py27-nose-1.3.1 found => Required system package python27>=2.7<2.8: python27-2.7.6 found => Required robotpkg package ros-catkin>=0.7<0.8: ros-catkin-0.7.14 found => Required robotpkg package ros-comm>=1.13<1.15: ros-comm-1.14.3 found => Required robotpkg package ros-nodelet-core>=1.9<1.10: ros-nodelet-core-1.9.16 found => Required robotpkg package ros-std-msgs>=0.5: ros-std-msgs-0.5.11 found => SHA1 checksums OK => RMD160 checksums OK An unexpected error occured. The last 10 log lines are shown below. | from /local/robotpkg/var/tmp/robotpkg/wip/ros-swri-nodelet/work/marti_common-2.3.0/swri_nodelet/src/test_nodelet.cpp:57: | /opt/openrobots/include/class_loader/class_loader.hpp: In member function 'void class_loader::ClassLoader::onPluginDeletion(Base*)': | /opt/openrobots/include/class_loader/class_loader.hpp:253:9: error: 'nullptr' was not declared in this scope | if (nullptr == obj) { | ^ | make[2]: *** [CMakeFiles/swri_nodelet_test.dir/src/test_nodelet.cpp.o] Error 1 | make[2]: Leaving directory `/local/robotpkg/var/tmp/robotpkg/wip/ros-swri-nodelet/work/marti_common-2.3.0/swri_nodelet' | make[1]: *** [CMakeFiles/swri_nodelet_test.dir/all] Error 2 | make: *** [all] Error 2 | make[1]: Leaving directory `/local/robotpkg/var/tmp/robotpkg/wip/ros-swri-nodelet/work/marti_common-2.3.0/swri_nodelet' For details or bug reports, check the complete log file in: /local/robotpkg/var/tmp/robotpkg/wip/ros-swri-nodelet/work/build.log make[3]: *** [do-build] Error 2 make[2]: *** [pkg-check-installed] Error 2 => Marking ros-swri-nodelet-2.3.0 as broken ERROR: make: *** [package] Error 2 ===> Logging bulk summary for ros-swri-nodelet-2.3.0 => Checking leftover files => Creating bulk log files => Logging bulk metadata ===> Cleaning temporary files for ros-swri-nodelet-2.3.0 ===> Done bulk for ros-swri-nodelet-2.3.0 [42%] Processing wip/morse-hla:morse-hla-1.4 ===> Cleaning temporary files for morse-hla-1.4 ===> Bulk building for morse-hla-1.4 => Checking for clear installation => Installing /opt/robotpkg/var/lib/robotpkg/packages/bsd/Ubuntu-14.04-x86_64/All/digest-20080510.tgz => Installing /opt/robotpkg/var/lib/robotpkg/packages/bsd/Ubuntu-14.04-x86_64/All/tnftp-20130505~ssl.tgz => Required robotpkg package digest>=20080510: digest-20080510 found => Required robotpkg package tnftp>=20091122: tnftp-20130505~ssl found => Required system package gnupg>=1: gnupg-1.4.16 found => Required system package gzip: gzip-1.6 found => Required system package patch>=2.0: patch-2.7.1 found => Required system package pax and tar archivers: pax found => Required system package pkg_install>=20110805.9: pkg_install-20110805.9 found => Required system package pkgrepo2deb>=1.4: pkgrepo2deb-1.4 found => Dependency digest-20080510 already installed => Installing /opt/robotpkg/var/lib/robotpkg/packages/bsd/Ubuntu-14.04-x86_64/All/morse-1.4~doc.tgz ERROR: Required robotpkg package py34-hla>=1.1.1: BROKEN => Dependency tnftp-20130505~ssl already installed ===> Logging bulk summary for morse-hla-1.4 => Checking leftover files => Creating bulk log files => Logging bulk metadata ===> Cleaning temporary files for morse-hla-1.4 ===> Done bulk for morse-hla-1.4 [42%] Processing wip/pal-hardware-interfaces:pal-hardware-interfaces-0.0.3 ===> Bulk building for pal-hardware-interfaces-0.0.3 Binary package for pal-hardware-interfaces-0.0.3 is up-to-date. [42%] Processing wip/hrp2-bringup:hrp2-bringup-1.0.6 ===> Bulk building for hrp2-bringup-1.0.6 Binary package for hrp2-bringup-1.0.6 is up-to-date. [43%] Processing wip/gerard-bauzil:gerard-bauzil-1.0.1 ===> Bulk building for gerard-bauzil-1.0.1 Binary package for gerard-bauzil-1.0.1 is up-to-date. [43%] Processing wip/urg:urg-0.8.18 ===> Bulk building for urg-0.8.18 Binary package for urg-0.8.18 is up-to-date. [43%] Processing wip/spark-genom:spark-genom-3.9 ===> Cleaning temporary files for spark-genom-3.9~mightability+openprs+tcl+tclserv_client ===> Bulk building for spark-genom-3.9~mightability+openprs+tcl+tclserv_client => Checking for clear installation => Installing /opt/robotpkg/var/lib/robotpkg/packages/bsd/Ubuntu-14.04-x86_64/All/digest-20080510.tgz => Installing /opt/robotpkg/var/lib/robotpkg/packages/bsd/Ubuntu-14.04-x86_64/All/tnftp-20130505~ssl.tgz => Required robotpkg package digest>=20080510: digest-20080510 found => Required robotpkg package tnftp>=20091122: tnftp-20130505~ssl found => Required system package gnupg>=1: gnupg-1.4.16 found => Required system package gzip: gzip-1.6 found => Required system package patch>=2.0: patch-2.7.1 found => Required system package pax and tar archivers: pax found => Required system package pkg_install>=20110805.9: pkg_install-20110805.9 found => Required system package pkgrepo2deb>=1.4: pkgrepo2deb-1.4 found => Dependency digest-20080510 already installed => Installing /opt/robotpkg/var/lib/robotpkg/packages/bsd/Ubuntu-14.04-x86_64/All/genBasic-genom-0.4r1~openprs+tcl+tclserv_client.tgz => Installing /opt/robotpkg/var/lib/robotpkg/packages/bsd/Ubuntu-14.04-x86_64/All/genHum-genom-1.1r1~openprs+tcl+tclserv_client.tgz => Installing /opt/robotpkg/var/lib/robotpkg/packages/bsd/Ubuntu-14.04-x86_64/All/genManip-genom-0.9~openprs+tcl+tclserv_client.tgz => Dependency genom-2.12~doc already installed => Installing /opt/robotpkg/var/lib/robotpkg/wip/packages/bsd/Ubuntu-14.04-x86_64/All/libmove3d-3.22.0r1.tgz => Installing /opt/robotpkg/var/lib/robotpkg/wip/packages/bsd/Ubuntu-14.04-x86_64/All/libmove3d-hri-2.24.tgz => Installing /opt/robotpkg/var/lib/robotpkg/packages/bsd/Ubuntu-14.04-x86_64/All/libt3d-2.6~doc.tgz => Dependency libtclserv_client-0.5r1 already installed => Installing /opt/robotpkg/var/lib/robotpkg/packages/bsd/Ubuntu-14.04-x86_64/All/mkdep-2.9.tgz => Installing /opt/robotpkg/var/lib/robotpkg/packages/bsd/Ubuntu-14.04-x86_64/All/mocap-genom-1.3~openprs+tcl+tclserv_client.tgz => Installing /opt/robotpkg/var/lib/robotpkg/packages/bsd/Ubuntu-14.04-x86_64/All/niut-genom-0.6~openprs+tcl+tclserv_client.tgz => Dependency pocolibs-2.17 already installed => Installing /opt/robotpkg/var/lib/robotpkg/packages/bsd/Ubuntu-14.04-x86_64/All/pom-genom-0.7~openprs+tcl+tclserv_client.tgz => Dependency tclserv-2.8.1 already installed => Dependency tnftp-20130505~ssl already installed => Dependency transgen-1.1b1 already installed => Installing /opt/robotpkg/var/lib/robotpkg/packages/bsd/Ubuntu-14.04-x86_64/All/viman-genom-1.6~openprs+tcl+tclserv_client.tgz => Building with the following options: => Use the GNU C++ compiler: c++-compiler provided by g++>=3 => Use the GNU C compiler: c-compiler provided by gcc>=3 => Use tcl-8.6: tcl>=8.4 provided by tcl86>=8.6<8.7 => Required system package autoconf>=2.59: autoconf-2.69 found => Required system package boost-headers>=1.34.1: boost-headers-1.54 found => Required system package g++>=3: g++-4.8 found => Required system package gcc>=3: gcc-4.8 found => Required system package GNU m4>=1.4: gm4-1.4.17 found => Required system package libstdc++: libstdc++ found => Required system package libtool>=1.5.22: libtool-2.4.2 found => Required system package perl>=5: perl-5 found => Required system package pkg-config>=0.22: pkg-config-0.26 found => Required system package tcl86>=8.6<8.7: tcl86-8.6 found => Required robotpkg package genBasic-genom>=0.1: genBasic-genom-0.4r1~openprs+tcl+tclserv_client found => Required robotpkg package genHum-genom>=1.1: genHum-genom-1.1r1~openprs+tcl+tclserv_client found => Required robotpkg package genManip-genom>=0.9: genManip-genom-0.9~openprs+tcl+tclserv_client found => Required robotpkg package genom>=2.9: genom-2.12~doc found => Required robotpkg package libmove3d>=3.22.0: libmove3d-3.22.0r1 found => Required robotpkg package libmove3d-hri>=2.24: libmove3d-hri-2.24 found => Required robotpkg package libt3d>=2.6: libt3d-2.6~doc found => Required robotpkg package libtclserv_client>=0.3: libtclserv_client-0.5r1 found => Required robotpkg package mkdep>=2.6: mkdep-2.9 found => Required robotpkg package mocap-genom>=1.3: mocap-genom-1.3~openprs+tcl+tclserv_client found => Required robotpkg package niut-genom>=0.6: niut-genom-0.6~openprs+tcl+tclserv_client found => Required robotpkg package pocolibs>=2.17: pocolibs-2.17 found => Required robotpkg package pom-genom>=0.5r1: pom-genom-0.7~openprs+tcl+tclserv_client found => Required robotpkg package tclserv>=2.7: tclserv-2.8.1 found => Required robotpkg package transgen>=1.1b0: transgen-1.1b1 found => Required robotpkg package viman-genom>=1.4: viman-genom-1.6~openprs+tcl+tclserv_client found => SHA1 checksums OK => RMD160 checksums OK => Applying robotpkg patches for spark-genom-3.9~mightability+openprs+tcl+tclserv_client => Generating spark module An unexpected error occured. The last 10 log lines are shown below. | _override_vars_wip_libmove3d=PKGREQD PKGREQD PKGREQD | --- | Running set -e;cd /local/robotpkg/var/tmp/robotpkg/wip/spark-genom/work/spark-genom-3.9 && | /usr/bin/env CONFIG_SHELL=/bin/sh LIBS='' 'CPPFLAGS=' 'CFLAGS=-pipe -O3 -DNDEBUG' 'LDFLAGS=' 'CXXFLAGS=-pipe -O3 -DNDEBUG' PREFIX='/opt/openrobots' HOME=/local/robotpkg/var/tmp/robotpkg/wip/spark-genom/work PATH='/opt/openrobots/bin:/opt/openrobots/sbin:/usr/local/sbin:/usr/local/bin:/usr/bin:/usr/sbin:/sbin:/bin' LD_LIBRARY_PATH='' | /opt/openrobots/bin/genom -DUSE_MIGHTABILITY_MAPS -o -t -x spark | Package libmove3d-planners was not found in the pkg-config search path. | Perhaps you should add the directory containing `libmove3d-planners.pc' | to the PKG_CONFIG_PATH environment variable | No package 'libmove3d-planners' found | error running /usr/bin/pkg-config For details or bug reports, check the complete log file in: /local/robotpkg/var/tmp/robotpkg/wip/spark-genom/work/configure.log make[3]: *** [genom-generate] Error 1 => Marking spark-genom-3.9~mightability+openprs+tcl+tclserv_client as broken make[2]: *** [pkg-check-installed] Error 2 ERROR: make: *** [package] Error 2 ===> Logging bulk summary for spark-genom-3.9~mightability+openprs+tcl+tclserv_client => Checking leftover files => Creating bulk log files => Logging bulk metadata ===> Cleaning temporary files for spark-genom-3.9~mightability+openprs+tcl+tclserv_client ===> Done bulk for spark-genom-3.9~mightability+openprs+tcl+tclserv_client [44%] Processing wip/dynamic-graph-v3:dynamic-graph-v3-3.2.0 ===> Bulk building for dynamic-graph-v3-3.2.0 Binary package for dynamic-graph-v3-3.2.0 is up-to-date. [44%] Processing wip/cppad:CppAD-20180000.0 ===> Cleaning temporary files for CppAD-20180000.0 ===> Bulk building for CppAD-20180000.0 => Checking for clear installation => Installing /opt/robotpkg/var/lib/robotpkg/packages/bsd/Ubuntu-14.04-x86_64/All/digest-20080510.tgz => Installing /opt/robotpkg/var/lib/robotpkg/packages/bsd/Ubuntu-14.04-x86_64/All/tnftp-20130505~ssl.tgz => Required robotpkg package digest>=20080510: digest-20080510 found => Required robotpkg package tnftp>=20130505~ssl: tnftp-20130505~ssl found => Required system package gnupg>=1: gnupg-1.4.16 found => Required system package gzip: gzip-1.6 found => Required system package pax and tar archivers: pax found => Required system package pkg_install>=20110805.9: pkg_install-20110805.9 found => Required system package pkgrepo2deb>=1.4: pkgrepo2deb-1.4 found => Required system package cmake>=3.1: MISSING => Dependency digest-20080510 already installed => Dependency tnftp-20130505~ssl already installed ERROR: ====================================================================== ERROR: Missing system packages required for CppAD-20180000.0: ERROR: ERROR: cmake>=3.1 ERROR: ERROR: Please use the system package management tool to install these ERROR: dependencies. If a robotpkg version of a dependency is available, ERROR: you can configure robotpkg.conf to use this version instead. ERROR: ERROR: See /local/robotpkg/var/tmp/robotpkg/wip/cppad/work/sysdep.log for details. ERROR: ====================================================================== make[2]: *** [sys-depends] Error 2 ===> Logging bulk summary for CppAD-20180000.0 => Checking leftover files => Creating bulk log files => Logging bulk metadata ===> Cleaning temporary files for CppAD-20180000.0 ===> Done bulk for CppAD-20180000.0 [45%] Processing wip/histodet:histodet-1.0r2 ===> Bulk building for histodet-1.0r2 Binary package for histodet-1.0r2 is up-to-date. [45%] Processing wip/octovis:octoviz-1.6.1 ===> Cleaning temporary files for octoviz-1.6.1 ===> Bulk building for octoviz-1.6.1 => Checking for clear installation => Installing /opt/robotpkg/var/lib/robotpkg/packages/bsd/Ubuntu-14.04-x86_64/All/digest-20080510.tgz => Installing /opt/robotpkg/var/lib/robotpkg/packages/bsd/Ubuntu-14.04-x86_64/All/tnftp-20130505~ssl.tgz => Required robotpkg package digest>=20080510: digest-20080510 found => Required robotpkg package tnftp>=20130505~ssl: tnftp-20130505~ssl found => Required system package gnupg>=1: gnupg-1.4.16 found => Required system package gzip: gzip-1.6 found => Required system package pax and tar archivers: pax found => Required system package pkg_install>=20110805.9: pkg_install-20110805.9 found => Required system package pkgrepo2deb>=1.4: pkgrepo2deb-1.4 found => Dependency digest-20080510 already installed => Required system package libqglviewer>=2.3: MISSING => Installing /opt/robotpkg/var/lib/robotpkg/packages/bsd/Ubuntu-14.04-x86_64/All/octomap-1.6.1.tgz => Dependency tnftp-20130505~ssl already installed ERROR: ====================================================================== ERROR: Missing system packages required for octoviz-1.6.1: ERROR: ERROR: libqglviewer>=2.3 (Ubuntu package libqglviewer-qt4-dev) ERROR: ERROR: Please use the system package management tool to install these ERROR: dependencies. If a robotpkg version of a dependency is available, ERROR: you can configure robotpkg.conf to use this version instead. ERROR: ERROR: See /local/robotpkg/var/tmp/robotpkg/wip/octovis/work/sysdep.log for details. ERROR: ====================================================================== make[2]: *** [sys-depends] Error 2 ===> Logging bulk summary for octoviz-1.6.1 => Checking leftover files => Creating bulk log files => Logging bulk metadata ===> Cleaning temporary files for octoviz-1.6.1 ===> Done bulk for octoviz-1.6.1 [45%] Processing wip/rqt-dynamic-graph:py27-rqt-dynamic-graph-1.0.0 ===> Bulk building for py27-rqt-dynamic-graph-1.0.0 Binary package for py27-rqt-dynamic-graph-1.0.0 is up-to-date. [46%] Processing wip/rqt-dynamic-graph:py32-rqt-dynamic-graph-1.0.0 ===> Bulk building for py32-rqt-dynamic-graph-1.0.0 Binary package for py32-rqt-dynamic-graph-1.0.0 is up-to-date. [46%] Processing wip/rqt-dynamic-graph:py34-rqt-dynamic-graph-1.0.0 ===> Cleaning temporary files for py34-rqt-dynamic-graph-1.0.0 ===> Bulk building for py34-rqt-dynamic-graph-1.0.0 => Checking for clear installation => Installing /opt/robotpkg/var/lib/robotpkg/packages/bsd/Ubuntu-14.04-x86_64/All/digest-20080510.tgz => Installing /opt/robotpkg/var/lib/robotpkg/packages/bsd/Ubuntu-14.04-x86_64/All/tnftp-20130505~ssl.tgz => Required robotpkg package digest>=20080510: digest-20080510 found => Required robotpkg package tnftp>=20091122: tnftp-20130505~ssl found => Required system package gnupg>=1: gnupg-1.4.16 found => Required system package gzip: gzip-1.6 found => Required system package pax and tar archivers: pax found => Required system package pkg_install>=20110805.9: pkg_install-20110805.9 found => Required system package pkgrepo2deb>=1.4: pkgrepo2deb-1.4 found => Dependency digest-20080510 already installed => Required system package py34-empy>=3: MISSING => Required system package ros-catkin>=0.6<0.7: MISSING => Required system package ros-rqt>=0.2<0.5: MISSING => Dependency tnftp-20130505~ssl already installed ERROR: ====================================================================== ERROR: Missing system packages required for py34-rqt-dynamic-graph-1.0.0: ERROR: ERROR: py34-empy>=3 (Ubuntu package python-empy (python-3.4)) ERROR: ros-catkin>=0.6<0.7 (Ubuntu package ros-indigo-catkin) ERROR: ros-rqt>=0.2<0.5 (Ubuntu package ros-indigo-rqt) ERROR: ERROR: Please use the system package management tool to install these ERROR: dependencies. If a robotpkg version of a dependency is available, ERROR: you can configure robotpkg.conf to use this version instead. ERROR: ERROR: See /local/robotpkg/var/tmp/robotpkg/wip/rqt-dynamic-graph/work/sysdep.log for details. ERROR: ====================================================================== make[2]: *** [sys-depends] Error 2 ===> Logging bulk summary for py34-rqt-dynamic-graph-1.0.0 => Checking leftover files => Creating bulk log files => Logging bulk metadata ===> Cleaning temporary files for py34-rqt-dynamic-graph-1.0.0 ===> Done bulk for py34-rqt-dynamic-graph-1.0.0 [46%] Processing wip/rqt-dynamic-graph:py35-rqt-dynamic-graph-1.0.0 ===> Bulk building for py35-rqt-dynamic-graph-1.0.0 Binary package for py35-rqt-dynamic-graph-1.0.0 is up-to-date. [47%] Processing wip/rqt-dynamic-graph:py36-rqt-dynamic-graph-1.0.0 ===> Bulk building for py36-rqt-dynamic-graph-1.0.0 Binary package for py36-rqt-dynamic-graph-1.0.0 is up-to-date. [47%] Processing wip/rqt-dynamic-graph:py37-rqt-dynamic-graph-1.0.0 ===> Bulk building for py37-rqt-dynamic-graph-1.0.0 Binary package for py37-rqt-dynamic-graph-1.0.0 is up-to-date. [47%] Processing wip/prf-ros-controllers:prf-ros-controllers-0.3.5r3 ===> Cleaning temporary files for prf-ros-controllers-0.3.5r3 ===> Bulk building for prf-ros-controllers-0.3.5r3 => Checking for clear installation => Installing /opt/robotpkg/var/lib/robotpkg/packages/bsd/Ubuntu-14.04-x86_64/All/digest-20080510.tgz => Installing /opt/robotpkg/var/lib/robotpkg/packages/bsd/Ubuntu-14.04-x86_64/All/tnftp-20130505~ssl.tgz => Required robotpkg package digest>=20080510: digest-20080510 found => Required robotpkg package tnftp>=20130505~ssl: tnftp-20130505~ssl found => Required system package gnupg>=1: gnupg-1.4.16 found => Required system package gzip: gzip-1.6 found => Required system package pax and tar archivers: pax found => Required system package pkg_install>=20110805.9: pkg_install-20110805.9 found => Required system package pkgrepo2deb>=1.4: pkgrepo2deb-1.4 found => Dependency digest-20080510 already installed => Installing /opt/robotpkg/var/lib/robotpkg/wip/packages/bsd/Ubuntu-14.04-x86_64/All/pal-hardware-interfaces-0.0.3.tgz => Dependency prf-ros-control-0.2.6r3 already installed => Required system package ros-four-wheel-steering-msgs>=1: MISSING => Required system package ros-urdf-geometry-parser>=0.0.1: MISSING => Dependency tnftp-20130505~ssl already installed ERROR: ====================================================================== ERROR: Missing system packages required for prf-ros-controllers-0.3.5r3: ERROR: ERROR: ros-four-wheel-steering-msgs>=1 (Ubuntu package ros-indigo-four-wheel-steering-msgs) ERROR: ros-urdf-geometry-parser>=0.0.1 (Ubuntu package ros-indigo-urdf-geometry-parser) ERROR: ERROR: Please use the system package management tool to install these ERROR: dependencies. If a robotpkg version of a dependency is available, ERROR: you can configure robotpkg.conf to use this version instead. ERROR: ERROR: See /local/robotpkg/var/tmp/robotpkg/wip/prf-ros-controllers/work/sysdep.log for details. ERROR: ====================================================================== make[2]: *** [sys-depends] Error 2 ===> Logging bulk summary for prf-ros-controllers-0.3.5r3 => Checking leftover files => Creating bulk log files => Logging bulk metadata ===> Cleaning temporary files for prf-ros-controllers-0.3.5r3 ===> Done bulk for prf-ros-controllers-0.3.5r3 [48%] Processing wip/py-morse:py32-morse-1.4 ===> Bulk building for py32-morse-1.4 Binary package for py32-morse-1.4 is up-to-date. [48%] Processing wip/py-morse:py34-morse-1.4 ===> Bulk building for py34-morse-1.4 Binary package for py34-morse-1.4 is up-to-date. [49%] Processing wip/py-morse:py35-morse-1.4 ===> Bulk building for py35-morse-1.4 Binary package for py35-morse-1.4 is up-to-date. [49%] Processing wip/py-morse:py36-morse-1.4 ===> Bulk building for py36-morse-1.4 Binary package for py36-morse-1.4 is up-to-date. [49%] Processing wip/py-morse:py37-morse-1.4 ===> Bulk building for py37-morse-1.4 Binary package for py37-morse-1.4 is up-to-date. [50%] Processing wip/simple-humanoid-description:simple-humanoid-description-1.0.1 ===> Bulk building for simple-humanoid-description-1.0.1 Binary package for simple-humanoid-description-1.0.1 is up-to-date. [50%] Processing wip/infuse-envire:infuse-envire-0.1.1 ===> Cleaning temporary files for infuse-envire-0.1.1 ===> Bulk building for infuse-envire-0.1.1 => Checking for clear installation => Installing /opt/robotpkg/var/lib/robotpkg/packages/bsd/Ubuntu-14.04-x86_64/All/digest-20080510.tgz => Installing /opt/robotpkg/var/lib/robotpkg/packages/bsd/Ubuntu-14.04-x86_64/All/tnftp-20130505~ssl.tgz => Required robotpkg package digest>=20080510: digest-20080510 found => Required robotpkg package tnftp>=20091122: tnftp-20130505~ssl found => Required system package gnupg>=1: gnupg-1.4.16 found => Required system package gzip: gzip-1.6 found => Required system package pax and tar archivers: pax found => Required system package pkg_install>=20110805.9: pkg_install-20110805.9 found => Required system package pkgrepo2deb>=1.4: pkgrepo2deb-1.4 found => Dependency digest-20080510 already installed => Dependency tnftp-20130505~ssl already installed => Building with no option. => Use the GNU C++ compiler: c++-compiler provided by g++>=3 => Use the GNU C compiler: c-compiler provided by gcc>=3 => Required system package cmake>=2.6: cmake-2.8.12.2 found => Required system package eigen3>=3.0.0: eigen3-3.2.0 found => Required system package g++>=3: g++-4.8 found => Required system package gcc>=3: gcc-4.8 found => Required system package libstdc++: libstdc++ found => Required system package pkg-config>=0.22: pkg-config-0.26 found => SHA1 checksums OK => RMD160 checksums OK An unexpected error occured. The last 10 log lines are shown below. | NODENAME=fluffy64-ubuntu1404 | --- | Running set -e; | cd /local/robotpkg/var/tmp/robotpkg/wip/infuse-envire/work/infuse-envire-0.1.1 && cd /local/robotpkg/var/tmp/robotpkg/wip/infuse-envire/work/infuse-envire-0.1.1 && /usr/bin/env 'CPPFLAGS=' 'CFLAGS=-pipe -O3 -DNDEBUG' 'LDFLAGS=' 'CXXFLAGS=-pipe -O3 -DNDEBUG' PREFIX='/opt/openrobots' HOME=/local/robotpkg/var/tmp/robotpkg/wip/infuse-envire/work PATH='/opt/openrobots/sbin:/usr/local/sbin:/usr/local/bin:/usr/bin:/usr/sbin:/sbin:/bin' LD_LIBRARY_PATH='' /usr/bin/cmake '-DCMAKE_MODULE_PATH=' '-DCMAKE_PREFIX_PATH=' --no-warn-unused-cli -DUNIX=1 -DCMAKE_VERBOSE_MAKEFILE=ON -DCMAKE_BUILD_TYPE=Release -DCMAKE_INSTALL_PREFIX:PATH=/opt/openrobots -DCMAKE_INSTALL_RPATH:PATH=/opt/openrobots/lib -DCMAKE_INSTALL_RPATH_USE_LINK_PATH=TRUE CMAKE_EXE_LINKER_FLAGS=' ' -DCMAKE_MAKE_PROGRAM=make -DCMAKE_C_FLAGS=' -pipe -O3 -DNDEBUG' -DCMAKE_C_FLAGS_DEBUG= -DCMAKE_C_FLAGS_RELEASE= -DCMAKE_CXX_FLAGS=' -pipe -O3 -DNDEBUG' -DCMAKE_CXX_FLAGS_DEBUG= -DCMAKE_CXX_FLAGS_RELEASE= -DPKGINFODIR=info -DPKGMANDIR=man .; | Not searching for unused variables given on the command line. | CMake Error at CMakeLists.txt:1 (cmake_minimum_required): | -- Configuring incomplete, errors occurred! | CMake 3.5 or higher is required. You are running version 2.8.12.2 | | For details or bug reports, check the complete log file in: /local/robotpkg/var/tmp/robotpkg/wip/infuse-envire/work/configure.log make[3]: *** [do-configure-cmake] Error 1 make[2]: *** [pkg-check-installed] Error 2 => Marking infuse-envire-0.1.1 as broken ERROR: make: *** [package] Error 2 ===> Logging bulk summary for infuse-envire-0.1.1 => Checking leftover files => Creating bulk log files => Logging bulk metadata ===> Cleaning temporary files for infuse-envire-0.1.1 ===> Done bulk for infuse-envire-0.1.1 [50%] Processing wip/soth:soth-2.0.3 ===> Bulk building for soth-2.0.3 Binary package for soth-2.0.3 is up-to-date. [51%] Processing wip/infuse-novatel-gps-driver-ros:infuse-novatel-gps-driver-ros-0.1.0 ===> Cleaning temporary files for infuse-novatel-gps-driver-ros-0.1.0 ===> Bulk building for infuse-novatel-gps-driver-ros-0.1.0 => Checking for clear installation => Installing /opt/robotpkg/var/lib/robotpkg/packages/bsd/Ubuntu-14.04-x86_64/All/digest-20080510.tgz => Installing /opt/robotpkg/var/lib/robotpkg/packages/bsd/Ubuntu-14.04-x86_64/All/tnftp-20130505~ssl.tgz => Required robotpkg package digest>=20080510: digest-20080510 found => Required robotpkg package tnftp>=20091122: tnftp-20130505~ssl found => Required system package gnupg>=1: gnupg-1.4.16 found => Required system package gzip: gzip-1.6 found => Required system package pax and tar archivers: pax found => Required system package pkg_install>=20110805.9: pkg_install-20110805.9 found => Required system package pkgrepo2deb>=1.4: pkgrepo2deb-1.4 found => Dependency digest-20080510 already installed WARNING: Cannot check installed version of libpcap => Required system package ros-diagnostics>=1.8<1.9: MISSING => Required system package ros-gps-umd>=0.2.0: MISSING => Required system package ros-swri-math-util>=2.3.0: MISSING => Required system package ros-swri-nodelet>=2.3.0: MISSING => Required system package ros-swri-roscpp>=2.3.0: MISSING => Required system package ros-swri-serial-util>=2.3.0: MISSING => Required system package ros-swri-string-util>=2.3.0: MISSING => Dependency tnftp-20130505~ssl already installed ERROR: ====================================================================== ERROR: Missing system packages required for infuse-novatel-gps-driver-ros-0.1.0: ERROR: ERROR: ros-diagnostics>=1.8<1.9 (Ubuntu package ros-indigo-diagnostics) ERROR: ros-gps-umd>=0.2.0 (Ubuntu package ros-indigo-gps-umd) ERROR: ros-swri-math-util>=2.3.0 (Ubuntu package ros-indigo-swri-math-util) ERROR: ros-swri-nodelet>=2.3.0 (Ubuntu package ros-indigo-swri-nodelet) ERROR: ros-swri-roscpp>=2.3.0 (Ubuntu package ros-indigo-swri-roscpp) ERROR: ros-swri-serial-util>=2.3.0 (Ubuntu package ros-indigo-swri-serial-util) ERROR: ros-swri-string-util>=2.3.0 (Ubuntu package ros-indigo-swri-string-util) ERROR: ERROR: Please use the system package management tool to install these ERROR: dependencies. If a robotpkg version of a dependency is available, ERROR: you can configure robotpkg.conf to use this version instead. ERROR: ERROR: See /local/robotpkg/var/tmp/robotpkg/wip/infuse-novatel-gps-driver-ros/work/sysdep.log for details. ERROR: ====================================================================== make[2]: *** [sys-depends] Error 2 ===> Logging bulk summary for infuse-novatel-gps-driver-ros-0.1.0 => Checking leftover files => Creating bulk log files => Logging bulk metadata ===> Cleaning temporary files for infuse-novatel-gps-driver-ros-0.1.0 ===> Done bulk for infuse-novatel-gps-driver-ros-0.1.0 [51%] Processing wip/libmove3d-planners:libmove3d-planners-1.4.0 ===> Cleaning temporary files for libmove3d-planners-1.4.0 ===> Bulk building for libmove3d-planners-1.4.0 => Checking for clear installation => Installing /opt/robotpkg/var/lib/robotpkg/packages/bsd/Ubuntu-14.04-x86_64/All/digest-20080510.tgz => Installing /opt/robotpkg/var/lib/robotpkg/packages/bsd/Ubuntu-14.04-x86_64/All/tnftp-20130505~ssl.tgz => Required robotpkg package digest>=20080510: digest-20080510 found => Required robotpkg package tnftp>=20091122: tnftp-20130505~ssl found => Required system package gnupg>=1: gnupg-1.4.16 found => Required system package gzip: gzip-1.6 found => Required system package pax and tar archivers: pax found => Required system package pkg_install>=20110805.9: pkg_install-20110805.9 found => Required system package pkgrepo2deb>=1.4: pkgrepo2deb-1.4 found => Dependency digest-20080510 already installed WARNING: Cannot check installed version of libXpm => Installing /opt/robotpkg/var/lib/robotpkg/wip/packages/bsd/Ubuntu-14.04-x86_64/All/libmove3d-3.22.0r1.tgz => Installing /opt/robotpkg/var/lib/robotpkg/wip/packages/bsd/Ubuntu-14.04-x86_64/All/libmove3d-hri-2.24.tgz => Dependency tnftp-20130505~ssl already installed => Building with no option. => Use the GNU C++ compiler: c++-compiler provided by g++>=3 => Use the GNU C compiler: c-compiler provided by gcc>=3 => Required system package boost-headers>=1.34.1: boost-headers-1.54 found => Required system package boostlib-filesystem{>=1.34.1<1.49,>=1.50}: boost-lib-filesystem-1.54.0 found => Required system package boostlib-iostreams{>=1.34.1<1.49,>=1.50}: boost-lib-iostreams-1.54.0 found => Required system package boostlib-math{>=1.34.1<1.49,>=1.50}: boost-lib-math-1.54.0 found => Required system package boostlib-thread{>=1.34.1<1.49,>=1.50}: boost-lib-thread-1.54.0 found => Required system package cmake>=2.6: cmake-2.8.12.2 found => Required system package eigen3>=3.0.0: eigen3-3.2.0 found => Required system package g++>=3: g++-4.8 found => Required system package gcc>=3: gcc-4.8 found => Required system package glu>=7: glu-9.0.0 found => Required system package libXpm>=3.5.7: libXpm found => Required system package libstdc++: libstdc++ found => Required system package pkg-config>=0.22: pkg-config-0.26 found WARNING: Cannot check installed version of libXpm => Required robotpkg package libmove3d>=3.22.0: libmove3d-3.22.0r1 found => Required robotpkg package libmove3d-hri>=2.24: libmove3d-hri-2.24 found => SHA1 checksums OK => RMD160 checksums OK An unexpected error occured. The last 10 log lines are shown below. | CMakeLists.txt:284 (PKG_CHECK_MODULES) | | | -- checking for module 'liblog4cxx' | -- found liblog4cxx, version 0.10.0 | -- Found LOG4CXX: /usr/lib/liblog4cxx.so | include dirs: /usr/include;/usr/include/libxml2;/usr/include;/usr/include/eigen3;/usr/include;/opt/openrobots/include;/opt/openrobots/include | -- Configuring incomplete, errors occurred! | See also "/local/robotpkg/var/tmp/robotpkg/wip/libmove3d-planners/work/libmove3d-planners-1.4.0/CMakeFiles/CMakeOutput.log". | See also "/local/robotpkg/var/tmp/robotpkg/wip/libmove3d-planners/work/libmove3d-planners-1.4.0/CMakeFiles/CMakeError.log". For details or bug reports, check the complete log file in: /local/robotpkg/var/tmp/robotpkg/wip/libmove3d-planners/work/configure.log make[3]: *** [do-configure-cmake] Error 1 make[2]: *** [pkg-check-installed] Error 2 => Marking libmove3d-planners-1.4.0 as broken ERROR: make: *** [package] Error 2 ===> Logging bulk summary for libmove3d-planners-1.4.0 => Checking leftover files => Creating bulk log files => Logging bulk metadata ===> Cleaning temporary files for libmove3d-planners-1.4.0 ===> Done bulk for libmove3d-planners-1.4.0 [52%] Processing wip/infuse-idl:infuse-idl-0.1.1 ===> Bulk building for infuse-idl-0.1.1 Binary package for infuse-idl-0.1.1 is up-to-date. [52%] Processing wip/ros-swri-roscpp:ros-swri-roscpp-2.3.0 ===> Bulk building for ros-swri-roscpp-2.3.0 Binary package for ros-swri-roscpp-2.3.0 is up-to-date. [53%] Processing wip/play-motion:play-motion-0.4.5 ===> Cleaning temporary files for play-motion-0.4.5 ===> Bulk building for play-motion-0.4.5 => Checking for clear installation => Installing /opt/robotpkg/var/lib/robotpkg/packages/bsd/Ubuntu-14.04-x86_64/All/digest-20080510.tgz => Installing /opt/robotpkg/var/lib/robotpkg/packages/bsd/Ubuntu-14.04-x86_64/All/tnftp-20130505~ssl.tgz => Required robotpkg package digest>=20080510: digest-20080510 found => Required robotpkg package tnftp>=20130505~ssl: tnftp-20130505~ssl found => Required system package gnupg>=1: gnupg-1.4.16 found => Required system package gzip: gzip-1.6 found => Required system package pax and tar archivers: pax found => Required system package pkg_install>=20110805.9: pkg_install-20110805.9 found => Required system package pkgrepo2deb>=1.4: pkgrepo2deb-1.4 found => Dependency digest-20080510 already installed => Installing /opt/robotpkg/var/lib/robotpkg/wip/packages/bsd/Ubuntu-14.04-x86_64/All/prf-ros-control-0.2.6r3.tgz => Dependency tnftp-20130505~ssl already installed => Building with no option. => Use the GNU C++ compiler: c++-compiler provided by g++>=3 => Use the GNU C compiler: c-compiler provided by gcc>=3 => Use python-2.7: python>=2.5<3.8 provided by python27>=2.7<2.8 => Use ros indigo: ros>=groovy provided by ros-indigo => Required system package boost-headers>=1.34.1: boost-headers-1.54 found => Required system package boostlib-thread>=1.34.1: boost-libs-1.54.0 found => Required system package cmake>=2.8.3: cmake-2.8.12.2 found => Required system package g++>=3: g++-4.8 found => Required system package gcc>=3: gcc-4.8 found => Required system package googletest: googletest found => Required system package libstdc++: libstdc++ found => Required system package pkg-config>=0.22: pkg-config-0.26 found => Required system package py27-empy>=3: py27-empy-3.3 found => Required system package py27-nose>=0.10: py27-nose-1.3.1 found => Required system package python27>=2.7<2.8: python27-2.7.6 found => Required system package ros-catkin>=0.6<0.7: ros-catkin-0.6.19 found => Required system package ros-comm>=1.11<1.12: ros-comm-1.11.21 found => Required system package ros-common-msgs>=1.11<1.12: ros-common-msgs-1.11.10 found => Required system package ros-genmsg>=0.5<0.6: ros-genmsg-0.5.8 found => Required system package ros-message-generation>=0.2<0.3: ros-message-generation-0.2.10 found => Required system package ros-message-runtime>=0.4<0.5: ros-message-runtime-0.4.12 found => Required system package ros-std-msgs>=0.5: ros-std-msgs-0.5.10 found => Required robotpkg package prf-ros-control>=0.2: prf-ros-control-0.2.6r3 found => SHA1 checksums OK => RMD160 checksums OK An unexpected error occured. The last 10 log lines are shown below. | containing one of the above files. If "moveit_ros_planning_interface" | -- Configuring incomplete, errors occurred! | See also "/local/robotpkg/var/tmp/robotpkg/wip/play-motion/work/play_motion-0.4.5/build/CMakeFiles/CMakeOutput.log". | provides a separate development package or SDK, be sure it has been | installed. | See also "/local/robotpkg/var/tmp/robotpkg/wip/play-motion/work/play_motion-0.4.5/build/CMakeFiles/CMakeError.log". | Call Stack (most recent call first): | play_motion/CMakeLists.txt:6 (find_package) | | For details or bug reports, check the complete log file in: /local/robotpkg/var/tmp/robotpkg/wip/play-motion/work/configure.log make[3]: *** [do-configure-cmake] Error 1 make[2]: *** [pkg-check-installed] Error 2 => Marking play-motion-0.4.5 as broken ERROR: make: *** [package] Error 2 ===> Logging bulk summary for play-motion-0.4.5 => Checking leftover files => Creating bulk log files => Logging bulk metadata ===> Cleaning temporary files for play-motion-0.4.5 ===> Done bulk for play-motion-0.4.5 [53%] Processing wip/tsid:tsid-1.1.0 ===> Bulk building for tsid-1.1.0 Binary package for tsid-1.1.0 is up-to-date. [53%] Processing wip/orocos-bfl:orocos-bfl-0.8.0 ===> Bulk building for orocos-bfl-0.8.0 Binary package for orocos-bfl-0.8.0 is up-to-date. [54%] Processing wip/py-mraa:mraa-1.9.0 ===> Cleaning temporary files for mraa-1.9.0 ===> Bulk building for mraa-1.9.0 => Checking for clear installation => Installing /opt/robotpkg/var/lib/robotpkg/packages/bsd/Ubuntu-14.04-x86_64/All/digest-20080510.tgz => Installing /opt/robotpkg/var/lib/robotpkg/packages/bsd/Ubuntu-14.04-x86_64/All/tnftp-20130505~ssl.tgz => Required robotpkg package digest>=20080510: digest-20080510 found => Required robotpkg package tnftp>=20130505~ssl: tnftp-20130505~ssl found => Required system package gnupg>=1: gnupg-1.4.16 found => Required system package gzip: gzip-1.6 found => Required system package pax and tar archivers: pax found => Required system package pkg_install>=20110805.9: pkg_install-20110805.9 found => Required system package pkgrepo2deb>=1.4: pkgrepo2deb-1.4 found => Dependency digest-20080510 already installed => Required system package libjson-c>=0.10: MISSING => Dependency tnftp-20130505~ssl already installed ERROR: ====================================================================== ERROR: Missing system packages required for mraa-1.9.0: ERROR: ERROR: libjson-c>=0.10 ERROR: ERROR: Please use the system package management tool to install these ERROR: dependencies. If a robotpkg version of a dependency is available, ERROR: you can configure robotpkg.conf to use this version instead. ERROR: ERROR: See /local/robotpkg/var/tmp/robotpkg/wip/py-mraa/work/sysdep.log for details. ERROR: ====================================================================== make[2]: *** [sys-depends] Error 2 ===> Logging bulk summary for mraa-1.9.0 => Checking leftover files => Creating bulk log files => Logging bulk metadata ===> Cleaning temporary files for mraa-1.9.0 ===> Done bulk for mraa-1.9.0 [54%] Processing wip/osg-dae:osg-dae-3.2.1r2 ===> Bulk building for osg-dae-3.2.1r2 Binary package for osg-dae-3.2.1r2 is up-to-date. [54%] Processing wip/py-jsbsim:py27-jsbsim-20150424r1 ===> Cleaning temporary files for py27-jsbsim-20150424r1 ===> Bulk building for py27-jsbsim-20150424r1 => Checking for clear installation => Installing /opt/robotpkg/var/lib/robotpkg/packages/bsd/Ubuntu-14.04-x86_64/All/digest-20080510.tgz => Installing /opt/robotpkg/var/lib/robotpkg/packages/bsd/Ubuntu-14.04-x86_64/All/tnftp-20130505~ssl.tgz => Required robotpkg package digest>=20080510: digest-20080510 found => Required robotpkg package tnftp>=20091122: tnftp-20130505~ssl found => Required system package cvs>=1: cvs-1.12.1311 found => Required system package gnupg>=1: gnupg-1.4.16 found => Required system package gzip: gzip-1.6 found => Required system package pax and tar archivers: pax found => Required system package pkg_install>=20110805.9: pkg_install-20110805.9 found => Required system package pkgrepo2deb>=1.4: pkgrepo2deb-1.4 found => Dependency digest-20080510 already installed => Installing /opt/robotpkg/var/lib/robotpkg/wip/packages/bsd/Ubuntu-14.04-x86_64/All/jsbsim-20150424.tgz => Dependency tnftp-20130505~ssl already installed => Building with no option. => Use the GNU C++ compiler: c++-compiler provided by g++>=3 => Use the GNU C compiler: c-compiler provided by gcc>=3 => Use python-2.7: python>=2.5<3.8 provided by python27>=2.7<2.8 => Required system package cmake>=2.6: cmake-2.8.12.2 found => Required system package g++>=3: g++-4.8 found => Required system package gcc>=3: gcc-4.8 found => Required system package libstdc++: libstdc++ found => Required system package python27>=2.7<2.8: python27-2.7.6 found => Required robotpkg package jsbsim>=1.0: jsbsim-20150424 found => SHA1 checksums OK => RMD160 checksums OK An unexpected error occured. The last 10 log lines are shown below. | Could NOT find Cython (missing: CYTHON_EXECUTABLE) | Call Stack (most recent call first): | /usr/share/cmake-2.8/Modules/FindPackageHandleStandardArgs.cmake:315 (_FPHSA_FAILURE_MESSAGE) | CMakeModules/FindCython.cmake:42 (FIND_PACKAGE_HANDLE_STANDARD_ARGS) | CMakeModules/UseCython.cmake:74 (find_package) | CMakeLists.txt:6 (include) | | | -- Configuring incomplete, errors occurred! | See also "/local/robotpkg/var/tmp/robotpkg/wip/py-jsbsim/work/jsbsim-20150424/tests/CMakeFiles/CMakeOutput.log". For details or bug reports, check the complete log file in: /local/robotpkg/var/tmp/robotpkg/wip/py-jsbsim/work/configure.log make[3]: *** [do-configure-cmake] Error 1 => Marking py27-jsbsim-20150424r1 as broken make[2]: *** [pkg-check-installed] Error 2 ERROR: make: *** [package] Error 2 ===> Logging bulk summary for py27-jsbsim-20150424r1 => Checking leftover files => Creating bulk log files => Logging bulk metadata ===> Cleaning temporary files for py27-jsbsim-20150424r1 ===> Done bulk for py27-jsbsim-20150424r1 [55%] Processing wip/py-jsbsim:py32-jsbsim-20150424r1 ===> Bulk building for py32-jsbsim-20150424r1 Binary package for py32-jsbsim-20150424r1 is up-to-date. [55%] Processing wip/py-jsbsim:py34-jsbsim-20150424r1 ===> Cleaning temporary files for py34-jsbsim-20150424r1 ===> Bulk building for py34-jsbsim-20150424r1 => Checking for clear installation => Installing /opt/robotpkg/var/lib/robotpkg/packages/bsd/Ubuntu-14.04-x86_64/All/digest-20080510.tgz => Installing /opt/robotpkg/var/lib/robotpkg/packages/bsd/Ubuntu-14.04-x86_64/All/tnftp-20130505~ssl.tgz => Required robotpkg package digest>=20080510: digest-20080510 found => Required robotpkg package tnftp>=20091122: tnftp-20130505~ssl found => Required system package cvs>=1: cvs-1.12.1311 found => Required system package gnupg>=1: gnupg-1.4.16 found => Required system package gzip: gzip-1.6 found => Required system package pax and tar archivers: pax found => Required system package pkg_install>=20110805.9: pkg_install-20110805.9 found => Required system package pkgrepo2deb>=1.4: pkgrepo2deb-1.4 found => Dependency digest-20080510 already installed => Installing /opt/robotpkg/var/lib/robotpkg/wip/packages/bsd/Ubuntu-14.04-x86_64/All/jsbsim-20150424.tgz => Dependency tnftp-20130505~ssl already installed => Building with no option. => Use the GNU C++ compiler: c++-compiler provided by g++>=3 => Use the GNU C compiler: c-compiler provided by gcc>=3 => Use python-3.4: python>=2.5<3.8 provided by python34>=3.4<3.5 => Required system package cmake>=2.6: cmake-2.8.12.2 found => Required system package g++>=3: g++-4.8 found => Required system package gcc>=3: gcc-4.8 found => Required system package libstdc++: libstdc++ found => Required system package python34>=3.4<3.5: python34-3.4.3 found => Required robotpkg package jsbsim>=1.0: jsbsim-20150424 found => SHA1 checksums OK => RMD160 checksums OK An unexpected error occured. The last 10 log lines are shown below. | Could NOT find Cython (missing: CYTHON_EXECUTABLE) | Call Stack (most recent call first): | /usr/share/cmake-2.8/Modules/FindPackageHandleStandardArgs.cmake:315 (_FPHSA_FAILURE_MESSAGE) | CMakeModules/FindCython.cmake:42 (FIND_PACKAGE_HANDLE_STANDARD_ARGS) | CMakeModules/UseCython.cmake:74 (find_package) | CMakeLists.txt:6 (include) | | | -- Configuring incomplete, errors occurred! | See also "/local/robotpkg/var/tmp/robotpkg/wip/py-jsbsim/work/jsbsim-20150424/tests/CMakeFiles/CMakeOutput.log". For details or bug reports, check the complete log file in: /local/robotpkg/var/tmp/robotpkg/wip/py-jsbsim/work/configure.log make[3]: *** [do-configure-cmake] Error 1 => Marking py34-jsbsim-20150424r1 as broken make[2]: *** [pkg-check-installed] Error 2 ERROR: make: *** [package] Error 2 ===> Logging bulk summary for py34-jsbsim-20150424r1 => Checking leftover files => Creating bulk log files => Logging bulk metadata ===> Cleaning temporary files for py34-jsbsim-20150424r1 ===> Done bulk for py34-jsbsim-20150424r1 [56%] Processing wip/py-jsbsim:py35-jsbsim-20150424r1 ===> Bulk building for py35-jsbsim-20150424r1 Binary package for py35-jsbsim-20150424r1 is up-to-date. [56%] Processing wip/py-jsbsim:py36-jsbsim-20150424r1 ===> Bulk building for py36-jsbsim-20150424r1 Binary package for py36-jsbsim-20150424r1 is up-to-date. [56%] Processing wip/py-jsbsim:py37-jsbsim-20150424r1 ===> Bulk building for py37-jsbsim-20150424r1 Binary package for py37-jsbsim-20150424r1 is up-to-date. [57%] Processing wip/msgconnector:msgconnector-2.13.0 ===> Bulk building for msgconnector-2.13.0~bridge-print+liboro+openprs+yarp Binary package for msgconnector-2.13.0~bridge-print+liboro+openprs+yarp is up-to-date. [57%] Processing wip/dynamic-introspection:dynamic-introspection-1.0.5 ===> Cleaning temporary files for dynamic-introspection-1.0.5 ===> Bulk building for dynamic-introspection-1.0.5 => Checking for clear installation => Installing /opt/robotpkg/var/lib/robotpkg/packages/bsd/Ubuntu-14.04-x86_64/All/digest-20080510.tgz => Installing /opt/robotpkg/var/lib/robotpkg/packages/bsd/Ubuntu-14.04-x86_64/All/tnftp-20130505~ssl.tgz => Required robotpkg package digest>=20080510: digest-20080510 found => Required robotpkg package tnftp>=20130505~ssl: tnftp-20130505~ssl found => Required system package gnupg>=1: gnupg-1.4.16 found => Required system package gzip: gzip-1.6 found => Required system package patch>=2.0: patch-2.7.1 found => Required system package pax and tar archivers: pax found => Required system package pkg_install>=20110805.9: pkg_install-20110805.9 found => Required system package pkgrepo2deb>=1.4: pkgrepo2deb-1.4 found ERROR: Required robotpkg package backward-ros>=0.1.4: BROKEN => Dependency digest-20080510 already installed => Dependency tnftp-20130505~ssl already installed ===> Logging bulk summary for dynamic-introspection-1.0.5 => Checking leftover files => Creating bulk log files => Logging bulk metadata ===> Cleaning temporary files for dynamic-introspection-1.0.5 ===> Done bulk for dynamic-introspection-1.0.5 [57%] Processing wip/lua-rfsm:lua-rfsm-20131212.44fcec2db5r2 ===> Bulk building for lua-rfsm-20131212.44fcec2db5r2 Binary package for lua-rfsm-20131212.44fcec2db5r2 is up-to-date. [58%] Processing wip/roralink:roralink-0.3.0-Source ===> Cleaning temporary files for roralink-0.3.0-Source ===> Bulk building for roralink-0.3.0-Source => Checking for clear installation => Installing /opt/robotpkg/var/lib/robotpkg/packages/bsd/Ubuntu-14.04-x86_64/All/digest-20080510.tgz => Installing /opt/robotpkg/var/lib/robotpkg/packages/bsd/Ubuntu-14.04-x86_64/All/tnftp-20130505~ssl.tgz => Required robotpkg package digest>=20080510: digest-20080510 found => Required robotpkg package tnftp>=20091122: tnftp-20130505~ssl found => Required system package gnupg>=1: gnupg-1.4.16 found => Required system package gzip: gzip-1.6 found => Required system package pax and tar archivers: pax found => Required system package pkg_install>=20110805.9: pkg_install-20110805.9 found => Required system package pkgrepo2deb>=1.4: pkgrepo2deb-1.4 found => Dependency digest-20080510 already installed => Dependency tnftp-20130505~ssl already installed => Building with no option. => Use the GNU C compiler: c-compiler provided by gcc>=3 => Required system package cmake>=2.6: cmake-2.8.12.2 found => Required system package gcc>=3: gcc-4.8 found => Fetching roralink-0.3.0-Source.tar.gz => Total size: 12237 bytes fetch: Unable to fetch expected file roralink-0.3.0-Source.tar.gz tnftp: Error retrieving file `404 Not Found' fetch: Unable to fetch expected file roralink-0.3.0-Source.tar.gz => Total size: 12237 bytes tnftp: Error retrieving file `404 Not Found' fetch: Unable to fetch expected file roralink-0.3.0-Source.tar.gz ERROR: Could not fetch the following file: ERROR: roralink-0.3.0-Source.tar.gz ERROR: ERROR: Please retrieve this file manually into: ERROR: /opt/robotpkg/var/lib/robotpkg/distfiles/ make[3]: *** [/opt/robotpkg/var/lib/robotpkg/distfiles/roralink-0.3.0-Source.tar.gz] Error 1 make[2]: *** [pkg-check-installed] Error 2 => Marking roralink-0.3.0-Source as broken ERROR: make: *** [package] Error 2 ===> Logging bulk summary for roralink-0.3.0-Source => Checking leftover files => Creating bulk log files => Logging bulk metadata ===> Cleaning temporary files for roralink-0.3.0-Source ===> Done bulk for roralink-0.3.0-Source [58%] Processing wip/morse-mavlink:morse-mavlink-1.4 ===> Cleaning temporary files for morse-mavlink-1.4 ===> Bulk building for morse-mavlink-1.4 => Checking for clear installation => Installing /opt/robotpkg/var/lib/robotpkg/packages/bsd/Ubuntu-14.04-x86_64/All/digest-20080510.tgz => Installing /opt/robotpkg/var/lib/robotpkg/packages/bsd/Ubuntu-14.04-x86_64/All/tnftp-20130505~ssl.tgz => Required robotpkg package digest>=20080510: digest-20080510 found => Required robotpkg package tnftp>=20091122: tnftp-20130505~ssl found => Required system package gnupg>=1: gnupg-1.4.16 found => Required system package gzip: gzip-1.6 found => Required system package patch>=2.0: patch-2.7.1 found => Required system package pax and tar archivers: pax found => Required system package pkg_install>=20110805.9: pkg_install-20110805.9 found => Required system package pkgrepo2deb>=1.4: pkgrepo2deb-1.4 found => Dependency digest-20080510 already installed => Installing /opt/robotpkg/var/lib/robotpkg/wip/packages/bsd/Ubuntu-14.04-x86_64/All/mavlink-20150929.tgz => Installing /opt/robotpkg/var/lib/robotpkg/packages/bsd/Ubuntu-14.04-x86_64/All/morse-1.4~doc.tgz ERROR: Required robotpkg package py34-mavlink>=1.1.62: BROKEN => Dependency tnftp-20130505~ssl already installed ===> Logging bulk summary for morse-mavlink-1.4 => Checking leftover files => Creating bulk log files => Logging bulk metadata ===> Cleaning temporary files for morse-mavlink-1.4 ===> Done bulk for morse-mavlink-1.4 [59%] Processing wip/antlr2:antlr2-2.7.7 ===> Bulk building for antlr2-2.7.7 Binary package for antlr2-2.7.7 is up-to-date. [59%] Processing wip/pal-msgs:pal-msgs-0.11.3 ===> Bulk building for pal-msgs-0.11.3 Binary package for pal-msgs-0.11.3 is up-to-date. [59%] Processing wip/hpp-environments:hpp-environments-4.2.0 ===> Bulk building for hpp-environments-4.2.0 Binary package for hpp-environments-4.2.0 is up-to-date. [60%] Processing wip/parametric-curves:parametric-curves-1.2.0 ===> Bulk building for parametric-curves-1.2.0 Binary package for parametric-curves-1.2.0 is up-to-date. [60%] Processing wip/example-adder:example-adder-1.0.0 ===> Bulk building for example-adder-1.0.0 Binary package for example-adder-1.0.0 is up-to-date. [60%] Processing wip/talos-moveit-config:talos-moveit-config-0.2.6r1 ===> Bulk building for talos-moveit-config-0.2.6r1 Binary package for talos-moveit-config-0.2.6r1 is up-to-date. [61%] Processing wip/ur5-description:ur5-description-1.0.1 Warning: the LICENSE of wip/ur5-description is undefined. Warning: the LICENSE of wip/ur5-description is undefined. ===> Cleaning temporary files for ur5-description-1.0.1 ===> Bulk building for ur5-description-1.0.1 => Checking for clear installation Warning: the LICENSE of wip/ur5-description is undefined. => Installing /opt/robotpkg/var/lib/robotpkg/packages/bsd/Ubuntu-14.04-x86_64/All/digest-20080510.tgz => Installing /opt/robotpkg/var/lib/robotpkg/packages/bsd/Ubuntu-14.04-x86_64/All/tnftp-20130505~ssl.tgz Warning: the LICENSE of wip/ur5-description is undefined. => Required robotpkg package digest>=20080510: digest-20080510 found => Required robotpkg package tnftp>=20130505~ssl: tnftp-20130505~ssl found => Required system package gnupg>=1: gnupg-1.4.16 found => Required system package gzip: gzip-1.6 found => Required system package pax and tar archivers: pax found => Required system package pkg_install>=20110805.9: pkg_install-20110805.9 found => Required system package pkgrepo2deb>=1.4: pkgrepo2deb-1.4 found Warning: the LICENSE of wip/ur5-description is undefined. Warning: the LICENSE of wip/ur5-description is undefined. => Dependency digest-20080510 already installed => Dependency tnftp-20130505~ssl already installed Warning: the LICENSE of wip/ur5-description is undefined. => Building with no option. => Use the GNU C++ compiler: c++-compiler provided by g++>=3 => Use the GNU C compiler: c-compiler provided by gcc>=3 => Required system package cmake>=2.6: cmake-2.8.12.2 found => Required system package g++>=3: g++-4.8 found => Required system package gcc>=3: gcc-4.8 found => Required system package libstdc++: libstdc++ found => Required system package pkg-config>=0.22: pkg-config-0.26 found Warning: the LICENSE of wip/ur5-description is undefined. Warning: the LICENSE of wip/ur5-description is undefined. Warning: the LICENSE of wip/ur5-description is undefined. => SHA1 checksums OK => RMD160 checksums OK Warning: the LICENSE of wip/ur5-description is undefined. => Adding run-time search paths to pkg-config files robotpkg_create: can't stat `/opt/openrobots/share/doc/ur5_description/doxygen-html/arrowdown.png' robotpkg_create: can't stat `/opt/openrobots/share/doc/ur5_description/doxygen-html/arrowright.png' robotpkg_create: can't stat `/opt/openrobots/share/doc/ur5_description/doxygen-html/doc.png' robotpkg_create: can't stat `/opt/openrobots/share/doc/ur5_description/doxygen-html/folderclosed.png' robotpkg_create: can't stat `/opt/openrobots/share/doc/ur5_description/doxygen-html/folderopen.png' robotpkg_create: can't stat `/opt/openrobots/share/doc/ur5_description/doxygen-html/navtreedata.js' robotpkg_create: can't stat `/opt/openrobots/share/doc/ur5_description/doxygen-html/search/searchdata.js' robotpkg_create: can't stat `/opt/openrobots/share/doc/ur5_description/doxygen-html/splitbar.png' => Registering installation for ur5-description-1.0.1 robotpkg_admin: ur5-description-1.0.1: File `/opt/openrobots/share/doc/ur5_description/doxygen-html/arrowdown.png' is in +CONTENTS but not on filesystem! robotpkg_admin: ur5-description-1.0.1: File `/opt/openrobots/share/doc/ur5_description/doxygen-html/arrowright.png' is in +CONTENTS but not on filesystem! robotpkg_admin: ur5-description-1.0.1: File `/opt/openrobots/share/doc/ur5_description/doxygen-html/doc.png' is in +CONTENTS but not on filesystem! robotpkg_admin: ur5-description-1.0.1: File `/opt/openrobots/share/doc/ur5_description/doxygen-html/folderclosed.png' is in +CONTENTS but not on filesystem! robotpkg_admin: ur5-description-1.0.1: File `/opt/openrobots/share/doc/ur5_description/doxygen-html/folderopen.png' is in +CONTENTS but not on filesystem! robotpkg_admin: ur5-description-1.0.1: File `/opt/openrobots/share/doc/ur5_description/doxygen-html/navtreedata.js' is in +CONTENTS but not on filesystem! robotpkg_admin: ur5-description-1.0.1: File `/opt/openrobots/share/doc/ur5_description/doxygen-html/search/searchdata.js' is in +CONTENTS but not on filesystem! robotpkg_admin: ur5-description-1.0.1: File `/opt/openrobots/share/doc/ur5_description/doxygen-html/splitbar.png' is in +CONTENTS but not on filesystem! Warning: the LICENSE of wip/ur5-description is undefined. robotpkg_create: can't stat `/opt/openrobots/share/doc/ur5_description/doxygen-html/arrowdown.png' robotpkg_create: can't stat `/opt/openrobots/share/doc/ur5_description/doxygen-html/arrowright.png' robotpkg_create: can't stat `/opt/openrobots/share/doc/ur5_description/doxygen-html/doc.png' robotpkg_create: can't stat `/opt/openrobots/share/doc/ur5_description/doxygen-html/folderclosed.png' robotpkg_create: can't stat `/opt/openrobots/share/doc/ur5_description/doxygen-html/folderopen.png' robotpkg_create: can't stat `/opt/openrobots/share/doc/ur5_description/doxygen-html/navtreedata.js' robotpkg_create: can't stat `/opt/openrobots/share/doc/ur5_description/doxygen-html/search/searchdata.js' robotpkg_create: can't stat `/opt/openrobots/share/doc/ur5_description/doxygen-html/splitbar.png' robotpkg_create: lstat failed for file share/doc/ur5_description/doxygen-html/arrowdown.png: No such file or directory make[3]: *** [pkg-tarup] Error 2 Warning: the LICENSE of wip/ur5-description is undefined. => Unlinking package in /opt/robotpkg/var/lib/robotpkg/wip/packages/bsd/Ubuntu-14.04-x86_64/All => Unlinking package in /opt/robotpkg/var/lib/robotpkg/wip/packages/bsd/Ubuntu-14.04-x86_64/pub => Unlinking package in /opt/robotpkg/var/lib/robotpkg/wip/packages/bsd/Ubuntu-14.04-x86_64/jrl => Unlinking package in /opt/robotpkg/var/lib/robotpkg/wip/packages/bsd/Ubuntu-14.04-x86_64/pal => Updating debian binary packages make[2]: *** [package-failed] Error 2 => Marking ur5-description-1.0.1 as broken ERROR: make: *** [package] Error 2 Warning: the LICENSE of wip/ur5-description is undefined. robotpkg_delete: Couldn't remove /opt/openrobots/share/doc/ur5_description/doxygen-html/arrowdown.png robotpkg_delete: Couldn't remove /opt/openrobots/share/doc/ur5_description/doxygen-html/arrowright.png robotpkg_delete: Couldn't remove /opt/openrobots/share/doc/ur5_description/doxygen-html/doc.png robotpkg_delete: Couldn't remove /opt/openrobots/share/doc/ur5_description/doxygen-html/folderclosed.png robotpkg_delete: Couldn't remove /opt/openrobots/share/doc/ur5_description/doxygen-html/folderopen.png robotpkg_delete: Couldn't remove /opt/openrobots/share/doc/ur5_description/doxygen-html/navtreedata.js robotpkg_delete: Couldn't remove /opt/openrobots/share/doc/ur5_description/doxygen-html/search/searchdata.js robotpkg_delete: Couldn't remove /opt/openrobots/share/doc/ur5_description/doxygen-html/splitbar.png ===> Logging bulk summary for ur5-description-1.0.1 => Checking leftover files WARNING: 16 files leftover. => Creating bulk log files => Logging bulk metadata Warning: the LICENSE of wip/ur5-description is undefined. Warning: the LICENSE of wip/ur5-description is undefined. Warning: the LICENSE of wip/ur5-description is undefined. ===> Cleaning temporary files for ur5-description-1.0.1 ===> Done bulk for ur5-description-1.0.1 [61%] Processing wip/orocos-yarp_transport:orocos-yarp_transport-20150316 ===> Cleaning temporary files for orocos-yarp_transport-20150316~doc ===> Bulk building for orocos-yarp_transport-20150316~doc => Checking for clear installation => Installing /opt/robotpkg/var/lib/robotpkg/packages/bsd/Ubuntu-14.04-x86_64/All/digest-20080510.tgz => Installing /opt/robotpkg/var/lib/robotpkg/packages/bsd/Ubuntu-14.04-x86_64/All/tnftp-20130505~ssl.tgz => Required robotpkg package digest>=20080510: digest-20080510 found => Required robotpkg package tnftp>=20091122: tnftp-20130505~ssl found => Required system package git>=1.6: git-1.9.1 found => Required system package gnupg>=1: gnupg-1.4.16 found => Required system package gzip: gzip-1.6 found => Required system package pax and tar archivers: pax found => Required system package pkg_install>=20110805.9: pkg_install-20110805.9 found => Required system package pkgrepo2deb>=1.4: pkgrepo2deb-1.4 found => Dependency digest-20080510 already installed WARNING: Cannot check installed version of docbook => Installing /opt/robotpkg/var/lib/robotpkg/packages/bsd/Ubuntu-14.04-x86_64/All/orocos-rtt-2.9.0rc1.tgz => Dependency tnftp-20130505~ssl already installed => Installing /opt/robotpkg/var/lib/robotpkg/packages/bsd/Ubuntu-14.04-x86_64/All/yarp-2.3.64r3~gui.tgz => Building with the following options: => Use the GNU C++ compiler: c++-compiler provided by g++>=3 => Use the GNU C compiler: c-compiler provided by gcc>=3 => Required system package ace>=5.6: ace-6.0.3 found => Required system package cmake>=2.6: cmake-2.8.12.2 found => Required system package docbook>=0.6: docbook found => Required system package g++>=3: g++-4.8 found => Required system package gcc>=3: gcc-4.8 found => Required system package libstdc++: libstdc++ found WARNING: Cannot check installed version of docbook => Required robotpkg package orocos-rtt>=2.5: orocos-rtt-2.9.0rc1 found => Required robotpkg package yarp>=2.2: yarp-2.3.64r3~gui found => SHA1 checksums OK => RMD160 checksums OK An unexpected error occured. The last 10 log lines are shown below. | make[1]: *** [CMakeFiles/yarp-transport.dir/all] Error 2 | make[1]: *** Waiting for unfinished jobs.... | Linking CXX shared library orocos/gnulinux/yarp/plugins/libyarp-service-gnulinux.so | /usr/bin/cmake -E cmake_link_script CMakeFiles/yarp-service.dir/link.txt --verbose=1 | /usr/bin/g++ -fPIC -pipe -O3 -DNDEBUG -Wl,-z,defs -shared -Wl,-soname,libyarp-service-gnulinux.so -o orocos/gnulinux/yarp/plugins/libyarp-service-gnulinux.so CMakeFiles/yarp-service.dir/service/Yarp-service.cpp.o /opt/openrobots/lib/liborocos-rtt-gnulinux.so.2.9.0 -lboost_filesystem -lboost_system -lboost_serialization -lxerces-c -lpthread -lrt -ldl -Wl,-rpath,/opt/openrobots/lib::::::::::::::::::::::::::::::::::::::::::::::::::::::::::::::::::::::::::::::::::::::::::::::::::::::::::::::::::::::::::::::::::::::::::::::::::::::::::::::::::::::::::::::::::::::::::::::::::::::::::::::::::::::::::::::::::::::::::::::::::::::::::::::::::: | make[2]: Leaving directory `/local/robotpkg/var/tmp/robotpkg/wip/orocos-yarp_transport/work/orocos-yarp_transport-20150316' | /usr/bin/cmake -E cmake_progress_report /local/robotpkg/var/tmp/robotpkg/wip/orocos-yarp_transport/work/orocos-yarp_transport-20150316/CMakeFiles 1 | [100%] Built target yarp-service | make[1]: Leaving directory `/local/robotpkg/var/tmp/robotpkg/wip/orocos-yarp_transport/work/orocos-yarp_transport-20150316' | make: *** [all] Error 2 For details or bug reports, check the complete log file in: /local/robotpkg/var/tmp/robotpkg/wip/orocos-yarp_transport/work/build.log make[3]: *** [do-build] Error 2 make[2]: *** [pkg-check-installed] Error 2 => Marking orocos-yarp_transport-20150316~doc as broken ERROR: make: *** [package] Error 2 ===> Logging bulk summary for orocos-yarp_transport-20150316~doc => Checking leftover files => Creating bulk log files => Logging bulk metadata ===> Cleaning temporary files for orocos-yarp_transport-20150316~doc ===> Done bulk for orocos-yarp_transport-20150316~doc [61%] Processing wip/infuse-asn1-conversions:infuse-asn1-conversions-0.4r1 ===> Cleaning temporary files for infuse-asn1-conversions-0.4r1 ===> Bulk building for infuse-asn1-conversions-0.4r1 => Checking for clear installation => Installing /opt/robotpkg/var/lib/robotpkg/packages/bsd/Ubuntu-14.04-x86_64/All/digest-20080510.tgz => Installing /opt/robotpkg/var/lib/robotpkg/packages/bsd/Ubuntu-14.04-x86_64/All/tnftp-20130505~ssl.tgz => Required robotpkg package digest>=20080510: digest-20080510 found => Required robotpkg package tnftp>=20091122: tnftp-20130505~ssl found => Required system package gnupg>=1: gnupg-1.4.16 found => Required system package gzip: gzip-1.6 found => Required system package patch>=2.0: patch-2.7.1 found => Required system package pax and tar archivers: pax found => Required system package pkg_install>=20110805.9: pkg_install-20110805.9 found => Required system package pkgrepo2deb>=1.4: pkgrepo2deb-1.4 found => Dependency digest-20080510 already installed => Required robotpkg package infuse-asn1-types>=0.2: N/A => Dependency tnftp-20130505~ssl already installed ===> Logging bulk summary for infuse-asn1-conversions-0.4r1 => Checking leftover files => Creating bulk log files => Logging bulk metadata ===> Cleaning temporary files for infuse-asn1-conversions-0.4r1 ===> Done bulk for infuse-asn1-conversions-0.4r1 [62%] Processing wip/infuse-msgs-ros:infuse-msgs-ros-0.1.0 ===> Bulk building for infuse-msgs-ros-0.1.0 Binary package for infuse-msgs-ros-0.1.0 is up-to-date. [62%] Processing wip/talos-robot:talos-robot-1.0.2 ===> Bulk building for talos-robot-1.0.2 Binary package for talos-robot-1.0.2 is up-to-date. [63%] Processing wip/tiago-robot:tiago-robot-0.0.35os1 ===> Cleaning temporary files for tiago-robot-0.0.35os1 ===> Bulk building for tiago-robot-0.0.35os1 => Checking for clear installation => Installing /opt/robotpkg/var/lib/robotpkg/packages/bsd/Ubuntu-14.04-x86_64/All/digest-20080510.tgz => Installing /opt/robotpkg/var/lib/robotpkg/packages/bsd/Ubuntu-14.04-x86_64/All/tnftp-20130505~ssl.tgz => Required robotpkg package digest>=20080510: digest-20080510 found => Required robotpkg package tnftp>=20130505~ssl: tnftp-20130505~ssl found => Required system package gnupg>=1: gnupg-1.4.16 found => Required system package gzip: gzip-1.6 found => Required system package pax and tar archivers: pax found => Required system package pkg_install>=20110805.9: pkg_install-20110805.9 found => Required system package pkgrepo2deb>=1.4: pkgrepo2deb-1.4 found => Dependency digest-20080510 already installed => Installing /opt/robotpkg/var/lib/robotpkg/wip/packages/bsd/Ubuntu-14.04-x86_64/All/head-action-0.0.1r4.tgz => Required robotpkg package pal-gripper>=0.0.13: NOT found ERROR: Required robotpkg package pal-gripper>=0.0.13: NOT found => Required robotpkg package pmb2-robot>=1.1.8: NOT found ERROR: Required robotpkg package pmb2-robot>=1.1.8: NOT found => Installing /opt/robotpkg/var/lib/robotpkg/wip/packages/bsd/Ubuntu-14.04-x86_64/All/tf-lookup-0.0.1r1.tgz => Dependency tnftp-20130505~ssl already installed ===> Logging bulk summary for tiago-robot-0.0.35os1 => Checking leftover files => Creating bulk log files => Logging bulk metadata ===> Cleaning temporary files for tiago-robot-0.0.35os1 ===> Done bulk for tiago-robot-0.0.35os1 [63%] Processing wip/pal-gazebo-worlds:pal-gazebo-worlds-2.0.8r2 ===> Cleaning temporary files for pal-gazebo-worlds-2.0.8r2 ===> Bulk building for pal-gazebo-worlds-2.0.8r2 => Checking for clear installation => Installing /opt/robotpkg/var/lib/robotpkg/packages/bsd/Ubuntu-14.04-x86_64/All/digest-20080510.tgz => Installing /opt/robotpkg/var/lib/robotpkg/packages/bsd/Ubuntu-14.04-x86_64/All/tnftp-20130505~ssl.tgz => Required robotpkg package digest>=20080510: digest-20080510 found => Required robotpkg package tnftp>=20130505~ssl: tnftp-20130505~ssl found => Required system package gnupg>=1: gnupg-1.4.16 found => Required system package gzip: gzip-1.6 found => Required system package pax and tar archivers: pax found => Required system package pkg_install>=20110805.9: pkg_install-20110805.9 found => Required system package pkgrepo2deb>=1.4: pkgrepo2deb-1.4 found => Dependency digest-20080510 already installed ERROR: Required robotpkg package prf-gazebo-ros-pkgs>=2.6.5: BROKEN => Dependency tnftp-20130505~ssl already installed ===> Logging bulk summary for pal-gazebo-worlds-2.0.8r2 => Checking leftover files => Creating bulk log files => Logging bulk metadata ===> Cleaning temporary files for pal-gazebo-worlds-2.0.8r2 ===> Done bulk for pal-gazebo-worlds-2.0.8r2 [63%] Processing wip/prf-roboticsgroup-gazebo-plugins:prf-roboticsgroup-gazebo-plugins-0.1.0 ===> Cleaning temporary files for prf-roboticsgroup-gazebo-plugins-0.1.0 ===> Bulk building for prf-roboticsgroup-gazebo-plugins-0.1.0 => Checking for clear installation => Installing /opt/robotpkg/var/lib/robotpkg/packages/bsd/Ubuntu-14.04-x86_64/All/digest-20080510.tgz => Installing /opt/robotpkg/var/lib/robotpkg/packages/bsd/Ubuntu-14.04-x86_64/All/tnftp-20130505~ssl.tgz => Required robotpkg package digest>=20080510: digest-20080510 found => Required robotpkg package tnftp>=20130505~ssl: tnftp-20130505~ssl found => Required system package gnupg>=1: gnupg-1.4.16 found => Required system package gzip: gzip-1.6 found => Required system package pax and tar archivers: pax found => Required system package pkg_install>=20110805.9: pkg_install-20110805.9 found => Required system package pkgrepo2deb>=1.4: pkgrepo2deb-1.4 found => Dependency digest-20080510 already installed => Installing /opt/robotpkg/var/lib/robotpkg/wip/packages/bsd/Ubuntu-14.04-x86_64/All/pal-hardware-interfaces-0.0.3.tgz ERROR: Required robotpkg package prf-gazebo-ros-pkgs>=2.6.5: BROKEN => Dependency tnftp-20130505~ssl already installed ===> Logging bulk summary for prf-roboticsgroup-gazebo-plugins-0.1.0 => Checking leftover files => Creating bulk log files => Logging bulk metadata ===> Cleaning temporary files for prf-roboticsgroup-gazebo-plugins-0.1.0 ===> Done bulk for prf-roboticsgroup-gazebo-plugins-0.1.0 [64%] Processing wip/sot-core-v3:sot-core-v3-3.3.0 ===> Bulk building for sot-core-v3-3.3.0 Binary package for sot-core-v3-3.3.0 is up-to-date. [64%] Processing wip/dynamic-graph-tutorial:dynamic-graph-tutorial-1.1.1 ===> Bulk building for dynamic-graph-tutorial-1.1.1 Binary package for dynamic-graph-tutorial-1.1.1 is up-to-date. [64%] Processing wip/libnabo:libnabo-1.0.4 ===> Bulk building for libnabo-1.0.4 Binary package for libnabo-1.0.4 is up-to-date. [65%] Processing wip/py-dynamic-graph-v3:py27-dynamic-graph-v3-3.2.0 ===> Bulk building for py27-dynamic-graph-v3-3.2.0 Binary package for py27-dynamic-graph-v3-3.2.0 is up-to-date. [65%] Processing wip/py-dynamic-graph-v3:py32-dynamic-graph-v3-3.2.0 ===> Bulk building for py32-dynamic-graph-v3-3.2.0 Binary package for py32-dynamic-graph-v3-3.2.0 is up-to-date. [66%] Processing wip/py-dynamic-graph-v3:py34-dynamic-graph-v3-3.2.0 ===> Cleaning temporary files for py34-dynamic-graph-v3-3.2.0 ===> Bulk building for py34-dynamic-graph-v3-3.2.0 => Checking for clear installation => Installing /opt/robotpkg/var/lib/robotpkg/packages/bsd/Ubuntu-14.04-x86_64/All/digest-20080510.tgz => Installing /opt/robotpkg/var/lib/robotpkg/packages/bsd/Ubuntu-14.04-x86_64/All/tnftp-20130505~ssl.tgz => Required robotpkg package digest>=20080510: digest-20080510 found => Required robotpkg package tnftp>=20091122: tnftp-20130505~ssl found => Required system package gnupg>=1: gnupg-1.4.16 found => Required system package gzip: gzip-1.6 found => Required system package pax and tar archivers: pax found => Required system package pkg_install>=20110805.9: pkg_install-20110805.9 found => Required system package pkgrepo2deb>=1.4: pkgrepo2deb-1.4 found => Dependency digest-20080510 already installed => Installing /opt/robotpkg/var/lib/robotpkg/wip/packages/bsd/Ubuntu-14.04-x86_64/All/dynamic-graph-v3-3.2.0.tgz => Dependency tnftp-20130505~ssl already installed => Building with no option. => Use the GNU C++ compiler: c++-compiler provided by g++>=3 => Use the GNU C compiler: c-compiler provided by gcc>=3 => Use python-3.4: python>=2.5<3.8 provided by python34>=3.4<3.5 => Required system package cmake>=2.6: cmake-2.8.12.2 found => Required system package doxygen>=1.5: doxygen-1.8.6 found => Required system package eigen3>=3.0.0: eigen3-3.2.0 found => Required system package g++>=3: g++-4.8 found => Required system package gcc>=3: gcc-4.8 found => Required system package graphviz>=2: graphviz-2.36.0 found => Required system package libstdc++: libstdc++ found => Required system package pkg-config>=0.22: pkg-config-0.26 found => Required system package py-sphinx>=1.1: py-sphinx-1.2.2 found => Required system package python34>=3.4<3.5: python34-3.4.3 found => Required robotpkg package dynamic-graph-v3>=3.0.0: dynamic-graph-v3-3.2.0 found => SHA1 checksums OK => RMD160 checksums OK An unexpected error occured. The last 10 log lines are shown below. | ^ | /local/robotpkg/var/tmp/robotpkg/wip/py-dynamic-graph-v3/work/dynamic-graph-python-3.2.0/src/interpreter.cc: In member function 'void dynamicgraph::python::Interpreter::runMain()': | /local/robotpkg/var/tmp/robotpkg/wip/py-dynamic-graph-v3/work/dynamic-graph-python-3.2.0/src/interpreter.cc:331:37: error: cannot convert 'char**' to 'wchar_t**' for argument '2' to 'int Py_Main(int, wchar_t**)' | Py_Main(1,const_cast(argv)); | ^ | make[2]: *** [src/CMakeFiles/dynamic-graph-python.dir/interpreter.cc.o] Error 1 | make[2]: Leaving directory `/local/robotpkg/var/tmp/robotpkg/wip/py-dynamic-graph-v3/work/dynamic-graph-python-3.2.0' | make[1]: Leaving directory `/local/robotpkg/var/tmp/robotpkg/wip/py-dynamic-graph-v3/work/dynamic-graph-python-3.2.0' | make[1]: *** [src/CMakeFiles/dynamic-graph-python.dir/all] Error 2 | make: *** [all] Error 2 For details or bug reports, check the complete log file in: /local/robotpkg/var/tmp/robotpkg/wip/py-dynamic-graph-v3/work/build.log make[3]: *** [do-build] Error 2 make[2]: *** [pkg-check-installed] Error 2 => Marking py34-dynamic-graph-v3-3.2.0 as broken ERROR: make: *** [package] Error 2 ===> Logging bulk summary for py34-dynamic-graph-v3-3.2.0 => Checking leftover files => Creating bulk log files => Logging bulk metadata ===> Cleaning temporary files for py34-dynamic-graph-v3-3.2.0 ===> Done bulk for py34-dynamic-graph-v3-3.2.0 [66%] Processing wip/py-dynamic-graph-v3:py35-dynamic-graph-v3-3.2.0 ===> Bulk building for py35-dynamic-graph-v3-3.2.0 Binary package for py35-dynamic-graph-v3-3.2.0 is up-to-date. [66%] Processing wip/py-dynamic-graph-v3:py36-dynamic-graph-v3-3.2.0 ===> Bulk building for py36-dynamic-graph-v3-3.2.0 Binary package for py36-dynamic-graph-v3-3.2.0 is up-to-date. [67%] Processing wip/py-dynamic-graph-v3:py37-dynamic-graph-v3-3.2.0 ===> Bulk building for py37-dynamic-graph-v3-3.2.0 Binary package for py37-dynamic-graph-v3-3.2.0 is up-to-date. [67%] Processing wip/hatponboard-lib:hatponboard-lib-3.4.0 ===> Bulk building for hatponboard-lib-3.4.0~enable-goal Binary package for hatponboard-lib-3.4.0~enable-goal is up-to-date. [67%] Processing wip/sot-torque-control:sot-torque-control-1.2.0 ===> Cleaning temporary files for sot-torque-control-1.2.0 ===> Bulk building for sot-torque-control-1.2.0 => Checking for clear installation => Installing /opt/robotpkg/var/lib/robotpkg/packages/bsd/Ubuntu-14.04-x86_64/All/digest-20080510.tgz => Installing /opt/robotpkg/var/lib/robotpkg/packages/bsd/Ubuntu-14.04-x86_64/All/tnftp-20130505~ssl.tgz => Required robotpkg package digest>=20080510: digest-20080510 found => Required robotpkg package tnftp>=20091122: tnftp-20130505~ssl found => Required system package gnupg>=1: gnupg-1.4.16 found => Required system package gzip: gzip-1.6 found => Required system package pax and tar archivers: pax found => Required system package pkg_install>=20110805.9: pkg_install-20110805.9 found => Required system package pkgrepo2deb>=1.4: pkgrepo2deb-1.4 found => Dependency digest-20080510 already installed => Installing /opt/robotpkg/var/lib/robotpkg/wip/packages/bsd/Ubuntu-14.04-x86_64/All/dynamic-graph-v3-3.2.0.tgz => Installing /opt/robotpkg/var/lib/robotpkg/packages/bsd/Ubuntu-14.04-x86_64/All/hpp-fcl-0.6.0.tgz => Installing /opt/robotpkg/var/lib/robotpkg/wip/packages/bsd/Ubuntu-14.04-x86_64/All/parametric-curves-1.2.0.tgz => Installing /opt/robotpkg/var/lib/robotpkg/packages/bsd/Ubuntu-14.04-x86_64/All/pinocchio-1.3.3.tgz => Installing /opt/robotpkg/var/lib/robotpkg/wip/packages/bsd/Ubuntu-14.04-x86_64/All/simple-humanoid-description-1.0.1.tgz => Installing /opt/robotpkg/var/lib/robotpkg/wip/packages/bsd/Ubuntu-14.04-x86_64/All/sot-core-v3-3.3.0.tgz => Dependency tnftp-20130505~ssl already installed => Installing /opt/robotpkg/var/lib/robotpkg/wip/packages/bsd/Ubuntu-14.04-x86_64/All/tsid-1.1.0.tgz => Building with no option. => Use the GNU C++ compiler: c++-compiler provided by g++>=3 => Use the GNU C compiler: c-compiler provided by gcc>=3 => Required system package boost-headers>=1.34.1: boost-headers-1.54 found => Required system package boostlib-filesystem>=1.34.1: boost-libs-1.54.0 found => Required system package boostlib-iostreams>=1.34.1: boost-libs-1.54.0 found => Required system package boostlib-math>=1.34.1: boost-libs-1.54.0 found => Required system package boostlib-thread>=1.34.1: boost-libs-1.54.0 found => Required system package cmake>=2.6: cmake-2.8.12.2 found => Required system package doxygen>=1.5: doxygen-1.8.6 found => Required system package eigen3>=3.0.0: eigen3-3.2.0 found => Required system package g++>=3: g++-4.8 found => Required system package gcc>=3: gcc-4.8 found => Required system package graphviz>=2: graphviz-2.36.0 found => Required system package libstdc++: libstdc++ found => Required system package pkg-config>=0.22: pkg-config-0.26 found => Required system package tinyxml>=2: tinyxml-2.6.2 found => Required system package urdfdom>=0.2.8<1: urdfdom-0.2.10 found => Required robotpkg package dynamic-graph-v3>=3.0.0: dynamic-graph-v3-3.2.0 found => Required robotpkg package hpp-fcl>=0.5: hpp-fcl-0.6.0 found => Required robotpkg package parametric-curves>=1.0.0: parametric-curves-1.2.0 found => Required robotpkg package pinocchio>=1.3.1: pinocchio-1.3.3 found => Required robotpkg package simple-humanoid-description>=1.0.1: simple-humanoid-description-1.0.1 found => Required robotpkg package sot-core-v3>=3.0.0: sot-core-v3-3.3.0 found => Required robotpkg package tsid>=1.0.0: tsid-1.1.0 found => Fetching sot-torque-control-1.2.0.tar.gz => Total size: 2020835 bytes fetch: Unable to fetch expected file sot-torque-control-1.2.0.tar.gz tnftp: Error retrieving file `404 Not Found' fetch: Unable to fetch expected file sot-torque-control-1.2.0.tar.gz => Total size: 2020835 bytes tnftp: Error retrieving file `404 Not Found' fetch: Unable to fetch expected file sot-torque-control-1.2.0.tar.gz ERROR: Could not fetch the following file: ERROR: sot-torque-control-1.2.0.tar.gz ERROR: ERROR: Please retrieve this file manually into: ERROR: /opt/robotpkg/var/lib/robotpkg/distfiles/ make[3]: *** [/opt/robotpkg/var/lib/robotpkg/distfiles/sot-torque-control-1.2.0.tar.gz] Error 1 make[2]: *** [pkg-check-installed] Error 2 => Marking sot-torque-control-1.2.0 as broken ERROR: make: *** [package] Error 2 ===> Logging bulk summary for sot-torque-control-1.2.0 => Checking leftover files => Creating bulk log files => Logging bulk metadata ===> Cleaning temporary files for sot-torque-control-1.2.0 ===> Done bulk for sot-torque-control-1.2.0 [68%] Processing wip/orocos-dot_service:orocos-dot_service-20120308 ===> Cleaning temporary files for orocos-dot_service-20120308 ===> Bulk building for orocos-dot_service-20120308 => Checking for clear installation => Installing /opt/robotpkg/var/lib/robotpkg/packages/bsd/Ubuntu-14.04-x86_64/All/digest-20080510.tgz => Installing /opt/robotpkg/var/lib/robotpkg/packages/bsd/Ubuntu-14.04-x86_64/All/tnftp-20130505~ssl.tgz => Required robotpkg package digest>=20080510: digest-20080510 found => Required robotpkg package tnftp>=20130505~ssl: tnftp-20130505~ssl found => Required system package gnupg>=1: gnupg-1.4.16 found => Required system package gzip: gzip-1.6 found => Required system package pax and tar archivers: pax found => Required system package pkg_install>=20110805.9: pkg_install-20110805.9 found => Required system package pkgrepo2deb>=1.4: pkgrepo2deb-1.4 found => Dependency digest-20080510 already installed => Installing /opt/robotpkg/var/lib/robotpkg/packages/bsd/Ubuntu-14.04-x86_64/All/orocos-rtt-2.9.0rc1.tgz => Dependency tnftp-20130505~ssl already installed => Building with no option. => Use the GNU C++ compiler: c++-compiler provided by g++>=3 => Use the GNU C compiler: c-compiler provided by gcc>=3 => Required system package boost-headers>=1.46.1: boost-headers-1.54 found => Required system package boostlib-filesystem>=1.46.1: boost-libs-1.54.0 found => Required system package boostlib-iostreams>=1.46.1: boost-libs-1.54.0 found => Required system package boostlib-math>=1.46.1: boost-libs-1.54.0 found => Required system package boostlib-thread>=1.46.1: boost-libs-1.54.0 found => Required system package cmake>=2.6: cmake-2.8.12.2 found => Required system package g++>=3: g++-4.8 found => Required system package gcc>=3: gcc-4.8 found => Required system package graphviz>=2: graphviz-2.36.0 found => Required system package libstdc++: libstdc++ found => Required robotpkg package orocos-rtt>=2: orocos-rtt-2.9.0rc1 found => SHA1 checksums OK => RMD160 checksums OK An unexpected error occured. The last 10 log lines are shown below. | /usr/bin/g++ -DOROCOS_TARGET=gnulinux -Drtt_dot_service_EXPORTS -pipe -O3 -DNDEBUG -fPIC -I/opt/openrobots/include -I/opt/openrobots/include/orocos -o CMakeFiles/rtt_dot_service.dir/src/rtt_dot_service.cpp.o -c /local/robotpkg/var/tmp/robotpkg/wip/orocos-dot_service/work/rtt_dot_service-rtt_dot_service/src/rtt_dot_service.cpp | /local/robotpkg/var/tmp/robotpkg/wip/orocos-dot_service/work/rtt_dot_service-rtt_dot_service/src/rtt_dot_service.cpp: In member function 'virtual bool Dot::execute()': | /local/robotpkg/var/tmp/robotpkg/wip/orocos-dot_service/work/rtt_dot_service-rtt_dot_service/src/rtt_dot_service.cpp:112:114: error: 'class RTT::internal::ConnectionManager' has no member named 'getChannels' | std::list chns = tc->getPort(comp_ports[j])->getManager()->getChannels(); | ^ | make[2]: Leaving directory `/local/robotpkg/var/tmp/robotpkg/wip/orocos-dot_service/work/rtt_dot_service-rtt_dot_service' | make[1]: Leaving directory `/local/robotpkg/var/tmp/robotpkg/wip/orocos-dot_service/work/rtt_dot_service-rtt_dot_service' | make[2]: *** [CMakeFiles/rtt_dot_service.dir/src/rtt_dot_service.cpp.o] Error 1 | make[1]: *** [CMakeFiles/rtt_dot_service.dir/all] Error 2 | make: *** [all] Error 2 For details or bug reports, check the complete log file in: /local/robotpkg/var/tmp/robotpkg/wip/orocos-dot_service/work/build.log make[3]: *** [do-build] Error 2 make[2]: *** [pkg-check-installed] Error 2 => Marking orocos-dot_service-20120308 as broken ERROR: make: *** [package] Error 2 ===> Logging bulk summary for orocos-dot_service-20120308 => Checking leftover files => Creating bulk log files => Logging bulk metadata ===> Cleaning temporary files for orocos-dot_service-20120308 ===> Done bulk for orocos-dot_service-20120308 [68%] Processing wip/pal-gazebo-plugins:pal-gazebo-plugins-1.1.7 ===> Cleaning temporary files for pal-gazebo-plugins-1.1.7 ===> Bulk building for pal-gazebo-plugins-1.1.7 => Checking for clear installation => Installing /opt/robotpkg/var/lib/robotpkg/packages/bsd/Ubuntu-14.04-x86_64/All/digest-20080510.tgz => Installing /opt/robotpkg/var/lib/robotpkg/packages/bsd/Ubuntu-14.04-x86_64/All/tnftp-20130505~ssl.tgz => Required robotpkg package digest>=20080510: digest-20080510 found => Required robotpkg package tnftp>=20130505~ssl: tnftp-20130505~ssl found => Required system package gnupg>=1: gnupg-1.4.16 found => Required system package gzip: gzip-1.6 found => Required system package pax and tar archivers: pax found => Required system package pkg_install>=20110805.9: pkg_install-20110805.9 found => Required system package pkgrepo2deb>=1.4: pkgrepo2deb-1.4 found => Dependency digest-20080510 already installed => Installing /opt/robotpkg/var/lib/robotpkg/wip/packages/bsd/Ubuntu-14.04-x86_64/All/pal-msgs-0.11.3.tgz => Dependency tnftp-20130505~ssl already installed => Building with no option. => Use the GNU C++ compiler: c++-compiler provided by g++>=3 => Use the GNU C compiler: c-compiler provided by gcc>=3 => Use python-2.7: python>=2.5<3.8 provided by python27>=2.7<2.8 => Use ros indigo: ros>=groovy ros>=hydro provided by ros-indigo => Required system package boost-headers>=1.34.1: boost-headers-1.54 found => Required system package boostlib-filesystem>=1.34.1: boost-libs-1.54.0 found => Required system package boostlib-iostreams>=1.34.1: boost-libs-1.54.0 found => Required system package boostlib-math>=1.34.1: boost-libs-1.54.0 found => Required system package boostlib-thread>=1.34.1: boost-libs-1.54.0 found => Required system package cmake>=2.8.3: cmake-2.8.12.2 found => Required system package eigen3>=3.0.0: eigen3-3.2.0 found => Required system package g++>=3: g++-4.8 found => Required system package gcc>=3: gcc-4.8 found => Required system package googletest: googletest found => Required system package libstdc++: libstdc++ found => Required system package pkg-config>=0.22: pkg-config-0.26 found => Required system package py27-empy>=3: py27-empy-3.3 found => Required system package py27-nose>=0.10: py27-nose-1.3.1 found => Required system package python27>=2.7<2.8: python27-2.7.6 found => Required system package ros-actionlib>=1.11<1.12: ros-actionlib-1.11.13 found => Required system package ros-catkin>=0.6<0.7: ros-catkin-0.6.19 found => Required system package ros-class-loader>=0.3<0.4: ros-class-loader-0.3.9 found => Required system package ros-comm>=1.11<1.12: ros-comm-1.11.21 found => Required system package ros-common-msgs>=1.11<1.12: ros-common-msgs-1.11.10 found => Required system package ros-control-toolbox>=1.13<1.15: ros-control-toolbox-1.13.3 found => Required system package ros-genmsg>=0.5<0.6: ros-genmsg-0.5.8 found => Required system package ros-geometry>=1.11<1.12: ros-geometry-1.11.9 found => Required system package ros-message-generation>=0.2<0.3: ros-message-generation-0.2.10 found => Required system package ros-message-runtime>=0.4<0.5: ros-message-runtime-0.4.12 found => Required system package ros-pluginlib>=1.10<1.11: ros-pluginlib-1.10.7 found => Required system package ros-ros>=1.11<1.12: ros-ros-1.11.14 found => Required system package ros-std-msgs>=0.5: ros-std-msgs-0.5.10 found => Required robotpkg package pal-msgs>=0.11.3: pal-msgs-0.11.3 found => SHA1 checksums OK => RMD160 checksums OK An unexpected error occured. The last 10 log lines are shown below. | make[2]: *** [CMakeFiles/gazebo_pal_hand.dir/src/gazebo_pal_hand.cpp.o] Error 1 | make[1]: *** [CMakeFiles/gazebo_pal_hand.dir/all] Error 2 | Linking CXX shared library /local/robotpkg/var/tmp/robotpkg/wip/pal-gazebo-plugins/work/stage/lib/libgazebo_harness.so | /usr/bin/cmake -E cmake_link_script CMakeFiles/gazebo_harness.dir/link.txt --verbose=1 | /usr/bin/g++ -fPIC -pipe -O3 -DNDEBUG -std=c++0x -shared -Wl,-soname,libgazebo_harness.so -o /local/robotpkg/var/tmp/robotpkg/wip/pal-gazebo-plugins/work/stage/lib/libgazebo_harness.so CMakeFiles/gazebo_harness.dir/src/gazebo_harness.cpp.o -L/usr/lib/x86_64-linux-gnu/gazebo-2.2/plugins -lgazebo -lgazebo_ccd -lgazebo_common -lgazebo_gimpact -lgazebo_gui -lgazebo_gui_building -lgazebo_gui_viewers -lgazebo_math -lgazebo_msgs -lgazebo_ode -lgazebo_opcode -lgazebo_opende_ou -lgazebo_physics -lgazebo_physics_ode -lgazebo_rendering -lgazebo_selection_buffer -lgazebo_sensors -lgazebo_skyx -lgazebo_transport -lgazebo_util -lgazebo_player -lgazebo_rendering_deferred -lprotobuf -lsdformat /opt/ros/indigo/lib/libgazebo_ros_api_plugin.so /opt/ros/indigo/lib/libgazebo_ros_paths_plugin.so /opt/ros/indigo/lib/libroslib.so /opt/ros/indigo/lib/librospack.so -lpython2.7 -lboost_program_options /opt/ros/indigo/lib/libtf.so /opt/ros/indigo/lib/libtf2_ros.so /opt/ros/indigo/lib/libactionlib.so /opt/ros/indigo/lib/libmessage_filters.so /opt/ros/indigo/lib/libtf2.so /opt/ros/indigo/lib/libcontrol_toolbox.so -ltinyxml /opt/ros/indigo/lib/libdynamic_reconfigure_config_init_mutex.so /opt/ros/indigo/lib/librealtime_tools.so /opt/ros/indigo/lib/libroscpp.so -lboost_signals -lboost_filesystem /opt/ros/indigo/lib/librosconsole.so /opt/ros/indigo/lib/librosconsole_log4cxx.so /opt/ros/indigo/lib/librosconsole_backend_interface.so -llog4cxx -lboost_regex /opt/ros/indigo/lib/libxmlrpcpp.so /opt/ros/indigo/lib/libroscpp_serialization.so /opt/ros/indigo/lib/librostime.so -lboost_date_time /opt/ros/indigo/lib/libcpp_common.so -lboost_system -lboost_thread -lpthread -lconsole_bridge -Wl,-rpath,/usr/lib/x86_64-linux-gnu/gazebo-2.2/plugins:/opt/ros/indigo/lib:::::::::::::::::::: | make[2]: Leaving directory `/local/robotpkg/var/tmp/robotpkg/wip/pal-gazebo-plugins/work/pal_gazebo_plugins-1.1.7' | /usr/bin/cmake -E cmake_progress_report /local/robotpkg/var/tmp/robotpkg/wip/pal-gazebo-plugins/work/pal_gazebo_plugins-1.1.7/CMakeFiles 2 | [ 57%] Built target gazebo_harness | make[1]: Leaving directory `/local/robotpkg/var/tmp/robotpkg/wip/pal-gazebo-plugins/work/pal_gazebo_plugins-1.1.7' | make: *** [all] Error 2 For details or bug reports, check the complete log file in: /local/robotpkg/var/tmp/robotpkg/wip/pal-gazebo-plugins/work/build.log make[3]: *** [do-build] Error 2 => Marking pal-gazebo-plugins-1.1.7 as broken make[2]: *** [pkg-check-installed] Error 2 ERROR: make: *** [package] Error 2 ===> Logging bulk summary for pal-gazebo-plugins-1.1.7 => Checking leftover files => Creating bulk log files => Logging bulk metadata ===> Cleaning temporary files for pal-gazebo-plugins-1.1.7 ===> Done bulk for pal-gazebo-plugins-1.1.7 [69%] Processing wip/sot-dyninv:sot-dyninv-2.0.0r1 ===> Bulk building for sot-dyninv-2.0.0r1 Binary package for sot-dyninv-2.0.0r1 is up-to-date. [69%] Processing wip/pal-hardware-gazebo:pal-hardware-gazebo-0.1.1r2 ===> Cleaning temporary files for pal-hardware-gazebo-0.1.1r2 ===> Bulk building for pal-hardware-gazebo-0.1.1r2 => Checking for clear installation => Installing /opt/robotpkg/var/lib/robotpkg/packages/bsd/Ubuntu-14.04-x86_64/All/digest-20080510.tgz => Installing /opt/robotpkg/var/lib/robotpkg/packages/bsd/Ubuntu-14.04-x86_64/All/tnftp-20130505~ssl.tgz => Required robotpkg package digest>=20080510: digest-20080510 found => Required robotpkg package tnftp>=20130505~ssl: tnftp-20130505~ssl found => Required system package gnupg>=1: gnupg-1.4.16 found => Required system package gzip: gzip-1.6 found => Required system package patch>=2.0: patch-2.7.1 found => Required system package pax and tar archivers: pax found => Required system package pkg_install>=20110805.9: pkg_install-20110805.9 found => Required system package pkgrepo2deb>=1.4: pkgrepo2deb-1.4 found => Dependency digest-20080510 already installed ERROR: Required robotpkg package dynamic-introspection>=1.0.5: BROKEN => Installing /opt/robotpkg/var/lib/robotpkg/wip/packages/bsd/Ubuntu-14.04-x86_64/All/pal-hardware-interfaces-0.0.3.tgz ERROR: Required robotpkg package prf-gazebo-ros-pkgs>=2.6.5: BROKEN => Dependency prf-ros-control-0.2.6r3 already installed => Dependency tnftp-20130505~ssl already installed ===> Logging bulk summary for pal-hardware-gazebo-0.1.1r2 => Checking leftover files => Creating bulk log files => Logging bulk metadata ===> Cleaning temporary files for pal-hardware-gazebo-0.1.1r2 ===> Done bulk for pal-hardware-gazebo-0.1.1r2 [69%] Processing wip/jrl-walkgen-v3:jrl-walkgen-v3-4.0.4 ===> Cleaning temporary files for jrl-walkgen-v3-4.0.4 ===> Bulk building for jrl-walkgen-v3-4.0.4 => Checking for clear installation => Installing /opt/robotpkg/var/lib/robotpkg/packages/bsd/Ubuntu-14.04-x86_64/All/digest-20080510.tgz => Installing /opt/robotpkg/var/lib/robotpkg/packages/bsd/Ubuntu-14.04-x86_64/All/tnftp-20130505~ssl.tgz => Required robotpkg package digest>=20080510: digest-20080510 found => Required robotpkg package tnftp>=20091122: tnftp-20130505~ssl found => Required system package gnupg>=1: gnupg-1.4.16 found => Required system package gzip: gzip-1.6 found => Required system package pax and tar archivers: pax found => Required system package pkg_install>=20110805.9: pkg_install-20110805.9 found => Required system package pkgrepo2deb>=1.4: pkgrepo2deb-1.4 found => Dependency digest-20080510 already installed => Installing /opt/robotpkg/var/lib/robotpkg/wip/packages/bsd/Ubuntu-14.04-x86_64/All/eigen-quadprog-1.0.0.tgz => Installing /opt/robotpkg/var/lib/robotpkg/packages/bsd/Ubuntu-14.04-x86_64/All/hpp-fcl-0.6.0.tgz => Installing /opt/robotpkg/var/lib/robotpkg/packages/bsd/Ubuntu-14.04-x86_64/All/jrl-mal-1.19.6r1~jrl-mathtools.tgz => Installing /opt/robotpkg/var/lib/robotpkg/packages/bsd/Ubuntu-14.04-x86_64/All/pinocchio-1.3.3.tgz => Installing /opt/robotpkg/var/lib/robotpkg/wip/packages/bsd/Ubuntu-14.04-x86_64/All/simple-humanoid-description-1.0.1.tgz => Dependency tnftp-20130505~ssl already installed => Building with no option. => Use the GNU C++ compiler: c++-compiler provided by g++>=3 => Use the GNU C compiler: c-compiler provided by gcc>=3 => Use the GNU fortran compiler: fortran-compiler provided by => Required system package cmake>=2.6: cmake-2.8.12.2 found => Required system package doxygen>=1.5: doxygen-1.8.6 found => Required system package eigen3>=3.0.0: eigen3-3.2.0 found => Required system package g++>=3: g++-4.8 found => Required system package gcc>=3: gcc-4.8 found => Required system package gcc-fortran>=3: gcc-fortran-4.8 found => Required system package graphviz>=2: graphviz-2.36.0 found => Required system package libstdc++: libstdc++ found => Required system package pkg-config>=0.22: pkg-config-0.26 found => Required system package tinyxml>=2: tinyxml-2.6.2 found => Required system package urdfdom>=0.2.8<1: urdfdom-0.2.10 found => Required robotpkg package eigen-quadprog>=1.0.0: eigen-quadprog-1.0.0 found => Required robotpkg package hpp-fcl>=0.5: hpp-fcl-0.6.0 found => Required robotpkg package jrl-mal>=1.8.3: jrl-mal-1.19.6r1~jrl-mathtools found => Required robotpkg package pinocchio>=1.3.1: pinocchio-1.3.3 found => Required robotpkg package simple-humanoid-description>=1.0.1: simple-humanoid-description-1.0.1 found => SHA1 checksums OK => RMD160 checksums OK An unexpected error occured. The last 10 log lines are shown below. | [ 11%] Building CXX object src/CMakeFiles/jrl-walkgen.dir/GlobalStrategyManagers/CoMAndFootOnlyStrategy.cpp.o | cd /local/robotpkg/var/tmp/robotpkg/wip/jrl-walkgen-v3/work/jrl-walkgen-4.0.4/src && /usr/bin/g++ -DHAVE_SYS_TIME_H -Djrl_walkgen_EXPORTS -pedantic -Wno-long-long -Wall -Wextra -Wcast-align -Wcast-qual -Wformat -Wwrite-strings -Wconversion -pipe -O3 -DNDEBUG -O3 -DNDEBUG -fPIC -I/local/robotpkg/var/tmp/robotpkg/wip/jrl-walkgen-v3/work/jrl-walkgen-4.0.4/src -I/local/robotpkg/var/tmp/robotpkg/wip/jrl-walkgen-v3/work/jrl-walkgen-4.0.4 -I/local/robotpkg/var/tmp/robotpkg/wip/jrl-walkgen-v3/work/jrl-walkgen-4.0.4/include -isystem /usr/include/eigen3 -isystem /opt/openrobots/include -isystem /usr/include/assimp -msse -msse2 -msse3 -march=core2 -mfpmath=sse -fivopts -ftree-loop-im -fipa-pta -DURDFDOM_COLLISION_WITH_GROUP_NAME -DWITH_URDFDOM -DWITH_HPP_FCL -DFCL_USE_ASSIMP_UNIFIED_HEADER_NAMES -DFCL_HAVE_OCTOMAP= -o CMakeFiles/jrl-walkgen.dir/GlobalStrategyManagers/CoMAndFootOnlyStrategy.cpp.o -c /local/robotpkg/var/tmp/robotpkg/wip/jrl-walkgen-v3/work/jrl-walkgen-4.0.4/src/GlobalStrategyManagers/CoMAndFootOnlyStrategy.cpp | make[2]: *** [src/CMakeFiles/jrl-walkgen.dir/RobotDynamics/pinocchiorobot.cpp.o] Error 1 | make[2]: *** Waiting for unfinished jobs.... | /local/robotpkg/var/tmp/robotpkg/wip/jrl-walkgen-v3/work/jrl-walkgen-4.0.4/src/GlobalStrategyManagers/CoMAndFootOnlyStrategy.cpp:166:3: warning: multi-line comment [-Wcomment] | // cerr << "YOU SHOULD INITIALIZE PROPERLY aStartingZMPosition in ^ | make[2]: Leaving directory `/local/robotpkg/var/tmp/robotpkg/wip/jrl-walkgen-v3/work/jrl-walkgen-4.0.4' | make[1]: *** [src/CMakeFiles/jrl-walkgen.dir/all] Error 2 | make[1]: Leaving directory `/local/robotpkg/var/tmp/robotpkg/wip/jrl-walkgen-v3/work/jrl-walkgen-4.0.4' | make: *** [all] Error 2 For details or bug reports, check the complete log file in: /local/robotpkg/var/tmp/robotpkg/wip/jrl-walkgen-v3/work/build.log make[3]: *** [do-build] Error 2 make[2]: *** [pkg-check-installed] Error 2 => Marking jrl-walkgen-v3-4.0.4 as broken ERROR: make: *** [package] Error 2 ===> Logging bulk summary for jrl-walkgen-v3-4.0.4 => Checking leftover files => Creating bulk log files => Logging bulk metadata ===> Cleaning temporary files for jrl-walkgen-v3-4.0.4 ===> Done bulk for jrl-walkgen-v3-4.0.4 [70%] Processing wip/py-example-adder:py27-example-adder-1.0.0 ===> Bulk building for py27-example-adder-1.0.0 Binary package for py27-example-adder-1.0.0 is up-to-date. [70%] Processing wip/py-example-adder:py32-example-adder-1.0.0 ===> Bulk building for py32-example-adder-1.0.0 Binary package for py32-example-adder-1.0.0 is up-to-date. [70%] Processing wip/py-example-adder:py34-example-adder-1.0.0 ===> Bulk building for py34-example-adder-1.0.0 Binary package for py34-example-adder-1.0.0 is up-to-date. [71%] Processing wip/py-example-adder:py35-example-adder-1.0.0 ===> Bulk building for py35-example-adder-1.0.0 Binary package for py35-example-adder-1.0.0 is up-to-date. [71%] Processing wip/py-example-adder:py36-example-adder-1.0.0 ===> Bulk building for py36-example-adder-1.0.0 Binary package for py36-example-adder-1.0.0 is up-to-date. [71%] Processing wip/py-example-adder:py37-example-adder-1.0.0 ===> Bulk building for py37-example-adder-1.0.0 Binary package for py37-example-adder-1.0.0 is up-to-date. [72%] Processing wip/move3d-studio:move3d-studio-1.4r3 ===> Cleaning temporary files for move3d-studio-1.4r3~qtstudio ===> Bulk building for move3d-studio-1.4r3~qtstudio => Checking for clear installation => Installing /opt/robotpkg/var/lib/robotpkg/packages/bsd/Ubuntu-14.04-x86_64/All/digest-20080510.tgz => Installing /opt/robotpkg/var/lib/robotpkg/packages/bsd/Ubuntu-14.04-x86_64/All/tnftp-20130505~ssl.tgz => Required robotpkg package digest>=20080510: digest-20080510 found => Required robotpkg package tnftp>=20091122: tnftp-20130505~ssl found => Required system package gnupg>=1: gnupg-1.4.16 found => Required system package gzip: gzip-1.6 found => Required system package pax and tar archivers: pax found => Required system package pkg_install>=20110805.9: pkg_install-20110805.9 found => Required system package pkgrepo2deb>=1.4: pkgrepo2deb-1.4 found => Dependency digest-20080510 already installed => Installing /opt/robotpkg/var/lib/robotpkg/packages/bsd/Ubuntu-14.04-x86_64/All/gbM-0.11~tcl.tgz WARNING: Cannot check installed version of glpk WARNING: Cannot check installed version of libXpm => Installing /opt/robotpkg/var/lib/robotpkg/wip/packages/bsd/Ubuntu-14.04-x86_64/All/libmove3d-3.22.0r1.tgz => Installing /opt/robotpkg/var/lib/robotpkg/wip/packages/bsd/Ubuntu-14.04-x86_64/All/libmove3d-hri-2.24.tgz ERROR: Required robotpkg package libmove3d-planners>=1.4.0: BROKEN => Dependency softMotion-libs-3.12~tcl already installed => Dependency tnftp-20130505~ssl already installed WARNING: Cannot check installed version of glpk WARNING: Cannot check installed version of libXpm ===> Logging bulk summary for move3d-studio-1.4r3~qtstudio => Checking leftover files => Creating bulk log files => Logging bulk metadata ===> Cleaning temporary files for move3d-studio-1.4r3~qtstudio ===> Done bulk for move3d-studio-1.4r3~qtstudio [72%] Processing wip/sot-tools-v3:sot-tools-v3-2.1.0 ===> Bulk building for sot-tools-v3-2.1.0 Binary package for sot-tools-v3-2.1.0 is up-to-date. [73%] Processing wip/py-dynamic-graph-bridge-v3:py27-dynamic-graph-bridge-v3-3.2.0 ===> Bulk building for py27-dynamic-graph-bridge-v3-3.2.0 Binary package for py27-dynamic-graph-bridge-v3-3.2.0 is up-to-date. [73%] Processing wip/py-dynamic-graph-bridge-v3:py32-dynamic-graph-bridge-v3-3.2.0 ===> Bulk building for py32-dynamic-graph-bridge-v3-3.2.0 Binary package for py32-dynamic-graph-bridge-v3-3.2.0 is up-to-date. [73%] Processing wip/py-dynamic-graph-bridge-v3:py34-dynamic-graph-bridge-v3-3.2.0 ===> Cleaning temporary files for py34-dynamic-graph-bridge-v3-3.2.0 ===> Bulk building for py34-dynamic-graph-bridge-v3-3.2.0 => Checking for clear installation => Installing /opt/robotpkg/var/lib/robotpkg/packages/bsd/Ubuntu-14.04-x86_64/All/digest-20080510.tgz => Installing /opt/robotpkg/var/lib/robotpkg/packages/bsd/Ubuntu-14.04-x86_64/All/tnftp-20130505~ssl.tgz => Required robotpkg package digest>=20080510: digest-20080510 found => Required robotpkg package tnftp>=20091122: tnftp-20130505~ssl found => Required system package gnupg>=1: gnupg-1.4.16 found => Required system package gzip: gzip-1.6 found => Required system package pax and tar archivers: pax found => Required system package pkg_install>=20110805.9: pkg_install-20110805.9 found => Required system package pkgrepo2deb>=1.4: pkgrepo2deb-1.4 found => Dependency digest-20080510 already installed => Installing /opt/robotpkg/var/lib/robotpkg/packages/bsd/Ubuntu-14.04-x86_64/All/dynamic-graph-bridge-msgs-0.2.0.tgz => Installing /opt/robotpkg/var/lib/robotpkg/wip/packages/bsd/Ubuntu-14.04-x86_64/All/dynamic-graph-v3-3.2.0.tgz ERROR: Required robotpkg package py34-dynamic-graph-v3>=3.0: BROKEN => Required system package py34-empy>=3: MISSING => Required system package ros-catkin>=0.6<0.7: MISSING => Required system package ros-common-msgs>=1.11<1.12: MISSING => Required system package ros-std-msgs>=0.5: MISSING => Installing /opt/robotpkg/var/lib/robotpkg/wip/packages/bsd/Ubuntu-14.04-x86_64/All/sot-core-v3-3.3.0.tgz => Dependency tnftp-20130505~ssl already installed ERROR: ====================================================================== ERROR: Missing system packages required for py34-dynamic-graph-bridge-v3-3.2.0: ERROR: ERROR: py34-empy>=3 (Ubuntu package python-empy (python-3.4)) ERROR: ros-catkin>=0.6<0.7 (Ubuntu package ros-indigo-catkin) ERROR: ros-common-msgs>=1.11<1.12 (Ubuntu package ros-indigo-common-msgs) ERROR: ros-std-msgs>=0.5 (Ubuntu package ros-indigo-std-msgs) ERROR: ERROR: Please use the system package management tool to install these ERROR: dependencies. If a robotpkg version of a dependency is available, ERROR: you can configure robotpkg.conf to use this version instead. ERROR: ERROR: See /local/robotpkg/var/tmp/robotpkg/wip/py-dynamic-graph-bridge-v3/work/sysdep.log for details. ERROR: ====================================================================== make[2]: *** [sys-depends] Error 2 ===> Logging bulk summary for py34-dynamic-graph-bridge-v3-3.2.0 => Checking leftover files => Creating bulk log files => Logging bulk metadata ===> Cleaning temporary files for py34-dynamic-graph-bridge-v3-3.2.0 ===> Done bulk for py34-dynamic-graph-bridge-v3-3.2.0 [74%] Processing wip/py-dynamic-graph-bridge-v3:py35-dynamic-graph-bridge-v3-3.2.0 ===> Bulk building for py35-dynamic-graph-bridge-v3-3.2.0 Binary package for py35-dynamic-graph-bridge-v3-3.2.0 is up-to-date. [74%] Processing wip/py-dynamic-graph-bridge-v3:py36-dynamic-graph-bridge-v3-3.2.0 ===> Bulk building for py36-dynamic-graph-bridge-v3-3.2.0 Binary package for py36-dynamic-graph-bridge-v3-3.2.0 is up-to-date. [74%] Processing wip/py-dynamic-graph-bridge-v3:py37-dynamic-graph-bridge-v3-3.2.0 ===> Bulk building for py37-dynamic-graph-bridge-v3-3.2.0 Binary package for py37-dynamic-graph-bridge-v3-3.2.0 is up-to-date. [75%] Processing wip/cppadcodegen:CppADCodeGen-2.2.0 ===> Cleaning temporary files for CppADCodeGen-2.2.0 ===> Bulk building for CppADCodeGen-2.2.0 => Checking for clear installation => Installing /opt/robotpkg/var/lib/robotpkg/packages/bsd/Ubuntu-14.04-x86_64/All/digest-20080510.tgz => Installing /opt/robotpkg/var/lib/robotpkg/packages/bsd/Ubuntu-14.04-x86_64/All/tnftp-20130505~ssl.tgz => Required robotpkg package digest>=20080510: digest-20080510 found => Required robotpkg package tnftp>=20130505~ssl: tnftp-20130505~ssl found => Required system package gnupg>=1: gnupg-1.4.16 found => Required system package gzip: gzip-1.6 found => Required system package pax and tar archivers: pax found => Required system package pkg_install>=20110805.9: pkg_install-20110805.9 found => Required system package pkgrepo2deb>=1.4: pkgrepo2deb-1.4 found => Required robotpkg package CppAD>=20180000.0: N/A => Dependency digest-20080510 already installed => Required system package llvm>=3.8.0: MISSING => Dependency tnftp-20130505~ssl already installed ERROR: ====================================================================== ERROR: Missing system packages required for CppADCodeGen-2.2.0: ERROR: ERROR: llvm>=3.8.0 ERROR: ERROR: Please use the system package management tool to install these ERROR: dependencies. If a robotpkg version of a dependency is available, ERROR: you can configure robotpkg.conf to use this version instead. ERROR: ERROR: See /local/robotpkg/var/tmp/robotpkg/wip/cppadcodegen/work/sysdep.log for details. ERROR: ====================================================================== make[2]: *** [sys-depends] Error 2 ===> Logging bulk summary for CppADCodeGen-2.2.0 => Checking leftover files => Creating bulk log files => Logging bulk metadata ===> Cleaning temporary files for CppADCodeGen-2.2.0 ===> Done bulk for CppADCodeGen-2.2.0 [75%] Processing wip/py-dynamic-graph-tutorial:py27-dynamic-graph-tutorial-1.1.1 ===> Bulk building for py27-dynamic-graph-tutorial-1.1.1 Binary package for py27-dynamic-graph-tutorial-1.1.1 is up-to-date. [76%] Processing wip/py-dynamic-graph-tutorial:py32-dynamic-graph-tutorial-1.1.1 ===> Bulk building for py32-dynamic-graph-tutorial-1.1.1 Binary package for py32-dynamic-graph-tutorial-1.1.1 is up-to-date. [76%] Processing wip/py-dynamic-graph-tutorial:py34-dynamic-graph-tutorial-1.1.1 ===> Cleaning temporary files for py34-dynamic-graph-tutorial-1.1.1 ===> Bulk building for py34-dynamic-graph-tutorial-1.1.1 => Checking for clear installation => Installing /opt/robotpkg/var/lib/robotpkg/packages/bsd/Ubuntu-14.04-x86_64/All/digest-20080510.tgz => Installing /opt/robotpkg/var/lib/robotpkg/packages/bsd/Ubuntu-14.04-x86_64/All/tnftp-20130505~ssl.tgz => Required robotpkg package digest>=20080510: digest-20080510 found => Required robotpkg package tnftp>=20091122: tnftp-20130505~ssl found => Required system package gnupg>=1: gnupg-1.4.16 found => Required system package gzip: gzip-1.6 found => Required system package pax and tar archivers: pax found => Required system package pkg_install>=20110805.9: pkg_install-20110805.9 found => Required system package pkgrepo2deb>=1.4: pkgrepo2deb-1.4 found => Dependency digest-20080510 already installed => Installing /opt/robotpkg/var/lib/robotpkg/wip/packages/bsd/Ubuntu-14.04-x86_64/All/dynamic-graph-tutorial-1.1.1.tgz => Dependency dynamic-graph-v3-3.2.0 already installed ERROR: Required robotpkg package py34-dynamic-graph-v3>=3.0: BROKEN => Dependency tnftp-20130505~ssl already installed ===> Logging bulk summary for py34-dynamic-graph-tutorial-1.1.1 => Checking leftover files => Creating bulk log files => Logging bulk metadata ===> Cleaning temporary files for py34-dynamic-graph-tutorial-1.1.1 ===> Done bulk for py34-dynamic-graph-tutorial-1.1.1 [76%] Processing wip/py-dynamic-graph-tutorial:py35-dynamic-graph-tutorial-1.1.1 ===> Bulk building for py35-dynamic-graph-tutorial-1.1.1 Binary package for py35-dynamic-graph-tutorial-1.1.1 is up-to-date. [77%] Processing wip/py-dynamic-graph-tutorial:py36-dynamic-graph-tutorial-1.1.1 ===> Bulk building for py36-dynamic-graph-tutorial-1.1.1 Binary package for py36-dynamic-graph-tutorial-1.1.1 is up-to-date. [77%] Processing wip/py-dynamic-graph-tutorial:py37-dynamic-graph-tutorial-1.1.1 ===> Bulk building for py37-dynamic-graph-tutorial-1.1.1 Binary package for py37-dynamic-graph-tutorial-1.1.1 is up-to-date. [77%] Processing wip/talos-simulation:talos-simulation-0.1.4r2 ===> Cleaning temporary files for talos-simulation-0.1.4r2 ===> Bulk building for talos-simulation-0.1.4r2 => Checking for clear installation => Installing /opt/robotpkg/var/lib/robotpkg/packages/bsd/Ubuntu-14.04-x86_64/All/digest-20080510.tgz => Installing /opt/robotpkg/var/lib/robotpkg/packages/bsd/Ubuntu-14.04-x86_64/All/tnftp-20130505~ssl.tgz => Required robotpkg package digest>=20080510: digest-20080510 found => Required robotpkg package tnftp>=20130505~ssl: tnftp-20130505~ssl found => Required system package gnupg>=1: gnupg-1.4.16 found => Required system package gzip: gzip-1.6 found => Required system package pax and tar archivers: pax found => Required system package pkg_install>=20110805.9: pkg_install-20110805.9 found => Required system package pkgrepo2deb>=1.4: pkgrepo2deb-1.4 found => Dependency digest-20080510 already installed => Installing /opt/robotpkg/var/lib/robotpkg/wip/packages/bsd/Ubuntu-14.04-x86_64/All/head-action-0.0.1r4.tgz ERROR: Required robotpkg package pal-gazebo-plugins>=1.1.5: BROKEN ERROR: Required robotpkg package pal-gazebo-worlds>=2.0.0: BROKEN ERROR: Required robotpkg package pal-hardware-gazebo>=0.0.9: BROKEN ERROR: Required robotpkg package prf-roboticsgroup-gazebo-plugins>=0.0.3: BROKEN => Required robotpkg package prf-ros-controllers>=0.2.8: N/A => Installing /opt/robotpkg/var/lib/robotpkg/wip/packages/bsd/Ubuntu-14.04-x86_64/All/talos-moveit-config-0.2.6r1.tgz => Installing /opt/robotpkg/var/lib/robotpkg/wip/packages/bsd/Ubuntu-14.04-x86_64/All/talos-robot-1.0.2.tgz => Dependency tnftp-20130505~ssl already installed ===> Logging bulk summary for talos-simulation-0.1.4r2 => Checking leftover files => Creating bulk log files => Logging bulk metadata ===> Cleaning temporary files for talos-simulation-0.1.4r2 ===> Done bulk for talos-simulation-0.1.4r2 [78%] Processing wip/sot-dynamic-pinocchio-v3:sot-dynamic-pinocchio-v3-3.2.4 ===> Bulk building for sot-dynamic-pinocchio-v3-3.2.4 Binary package for sot-dynamic-pinocchio-v3-3.2.4 is up-to-date. [78%] Processing wip/sot-dyninv-v3:sot-dyninv-v3-3.1.1r1 ===> Bulk building for sot-dyninv-v3-3.1.1r1 Binary package for sot-dyninv-v3-3.1.1r1 is up-to-date. [78%] Processing wip/py-sot-core-v3:py27-sot-core-v3-3.3.0 ===> Bulk building for py27-sot-core-v3-3.3.0 Binary package for py27-sot-core-v3-3.3.0 is up-to-date. [79%] Processing wip/py-sot-core-v3:py32-sot-core-v3-3.3.0 ===> Bulk building for py32-sot-core-v3-3.3.0 Binary package for py32-sot-core-v3-3.3.0 is up-to-date. [79%] Processing wip/py-sot-core-v3:py34-sot-core-v3-3.3.0 ===> Cleaning temporary files for py34-sot-core-v3-3.3.0 ===> Bulk building for py34-sot-core-v3-3.3.0 => Checking for clear installation => Installing /opt/robotpkg/var/lib/robotpkg/packages/bsd/Ubuntu-14.04-x86_64/All/digest-20080510.tgz => Installing /opt/robotpkg/var/lib/robotpkg/packages/bsd/Ubuntu-14.04-x86_64/All/tnftp-20130505~ssl.tgz => Required robotpkg package digest>=20080510: digest-20080510 found => Required robotpkg package tnftp>=20091122: tnftp-20130505~ssl found => Required system package gnupg>=1: gnupg-1.4.16 found => Required system package gzip: gzip-1.6 found => Required system package pax and tar archivers: pax found => Required system package pkg_install>=20110805.9: pkg_install-20110805.9 found => Required system package pkgrepo2deb>=1.4: pkgrepo2deb-1.4 found => Dependency digest-20080510 already installed => Installing /opt/robotpkg/var/lib/robotpkg/wip/packages/bsd/Ubuntu-14.04-x86_64/All/dynamic-graph-v3-3.2.0.tgz ERROR: Required robotpkg package py34-dynamic-graph-v3>=3.0: BROKEN => Installing /opt/robotpkg/var/lib/robotpkg/wip/packages/bsd/Ubuntu-14.04-x86_64/All/sot-core-v3-3.3.0.tgz => Dependency tnftp-20130505~ssl already installed ===> Logging bulk summary for py34-sot-core-v3-3.3.0 => Checking leftover files => Creating bulk log files => Logging bulk metadata ===> Cleaning temporary files for py34-sot-core-v3-3.3.0 ===> Done bulk for py34-sot-core-v3-3.3.0 [80%] Processing wip/py-sot-core-v3:py35-sot-core-v3-3.3.0 ===> Bulk building for py35-sot-core-v3-3.3.0 Binary package for py35-sot-core-v3-3.3.0 is up-to-date. [80%] Processing wip/py-sot-core-v3:py36-sot-core-v3-3.3.0 ===> Bulk building for py36-sot-core-v3-3.3.0 Binary package for py36-sot-core-v3-3.3.0 is up-to-date. [80%] Processing wip/py-sot-core-v3:py37-sot-core-v3-3.3.0 ===> Bulk building for py37-sot-core-v3-3.3.0 Binary package for py37-sot-core-v3-3.3.0 is up-to-date. [81%] Processing wip/py-parametric-curves:py27-parametric-curves-1.2.0 ===> Bulk building for py27-parametric-curves-1.2.0 Binary package for py27-parametric-curves-1.2.0 is up-to-date. [81%] Processing wip/py-parametric-curves:py32-parametric-curves-1.2.0 ===> Bulk building for py32-parametric-curves-1.2.0 Binary package for py32-parametric-curves-1.2.0 is up-to-date. [81%] Processing wip/py-parametric-curves:py34-parametric-curves-1.2.0 ===> Bulk building for py34-parametric-curves-1.2.0 Binary package for py34-parametric-curves-1.2.0 is up-to-date. [82%] Processing wip/py-parametric-curves:py35-parametric-curves-1.2.0 ===> Bulk building for py35-parametric-curves-1.2.0 Binary package for py35-parametric-curves-1.2.0 is up-to-date. [82%] Processing wip/py-parametric-curves:py36-parametric-curves-1.2.0 ===> Bulk building for py36-parametric-curves-1.2.0 Binary package for py36-parametric-curves-1.2.0 is up-to-date. [83%] Processing wip/py-parametric-curves:py37-parametric-curves-1.2.0 ===> Bulk building for py37-parametric-curves-1.2.0 Binary package for py37-parametric-curves-1.2.0 is up-to-date. [83%] Processing wip/sot-hrp2:sot-hrp2-1.1.2 ===> Bulk building for sot-hrp2-1.1.2 Binary package for sot-hrp2-1.1.2 is up-to-date. [83%] Processing wip/py-sot-torque-control:py27-sot-torque-control-1.1.0 ===> Cleaning temporary files for py27-sot-torque-control-1.1.0 ===> Bulk building for py27-sot-torque-control-1.1.0 => Checking for clear installation => Installing /opt/robotpkg/var/lib/robotpkg/packages/bsd/Ubuntu-14.04-x86_64/All/digest-20080510.tgz => Installing /opt/robotpkg/var/lib/robotpkg/packages/bsd/Ubuntu-14.04-x86_64/All/tnftp-20130505~ssl.tgz => Required robotpkg package digest>=20080510: digest-20080510 found => Required robotpkg package tnftp>=20091122: tnftp-20130505~ssl found => Required system package gnupg>=1: gnupg-1.4.16 found => Required system package gzip: gzip-1.6 found => Required system package pax and tar archivers: pax found => Required system package pkg_install>=20110805.9: pkg_install-20110805.9 found => Required system package pkgrepo2deb>=1.4: pkgrepo2deb-1.4 found => Dependency digest-20080510 already installed => Installing /opt/robotpkg/var/lib/robotpkg/wip/packages/bsd/Ubuntu-14.04-x86_64/All/dynamic-graph-v3-3.2.0.tgz => Installing /opt/robotpkg/var/lib/robotpkg/packages/bsd/Ubuntu-14.04-x86_64/All/hpp-fcl-0.6.0.tgz => Installing /opt/robotpkg/var/lib/robotpkg/wip/packages/bsd/Ubuntu-14.04-x86_64/All/parametric-curves-1.2.0.tgz => Installing /opt/robotpkg/var/lib/robotpkg/packages/bsd/Ubuntu-14.04-x86_64/All/pinocchio-1.3.3.tgz => Installing /opt/robotpkg/var/lib/robotpkg/wip/packages/bsd/Ubuntu-14.04-x86_64/All/py27-dynamic-graph-v3-3.2.0.tgz => Installing /opt/robotpkg/var/lib/robotpkg/wip/packages/bsd/Ubuntu-14.04-x86_64/All/py27-parametric-curves-1.2.0.tgz => Installing /opt/robotpkg/var/lib/robotpkg/packages/bsd/Ubuntu-14.04-x86_64/All/py27-pinocchio-1.3.3.tgz => Installing /opt/robotpkg/var/lib/robotpkg/wip/packages/bsd/Ubuntu-14.04-x86_64/All/py27-sot-core-v3-3.3.0.tgz => Installing /opt/robotpkg/var/lib/robotpkg/wip/packages/bsd/Ubuntu-14.04-x86_64/All/simple-humanoid-description-1.0.1.tgz => Dependency sot-core-v3-3.3.0 already installed => Installing /opt/robotpkg/var/lib/robotpkg/wip/packages/bsd/Ubuntu-14.04-x86_64/All/sot-torque-control-1.1.0.tgz => Dependency tnftp-20130505~ssl already installed => Dependency tsid-1.1.0 already installed => Building with no option. => Use the GNU C++ compiler: c++-compiler provided by g++>=3 => Use the GNU C compiler: c-compiler provided by gcc>=3 => Use python-2.7: python>=2.5<3.8 provided by python27>=2.7<2.8 => Required system package boost-headers>=1.34.1: boost-headers-1.54 found => Required system package boostlib-filesystem>=1.34.1: boost-libs-1.54.0 found => Required system package boostlib-iostreams>=1.34.1: boost-libs-1.54.0 found => Required system package boostlib-math>=1.34.1: boost-libs-1.54.0 found => Required system package boostlib-thread>=1.34.1: boost-libs-1.54.0 found => Required system package cmake>=2.6: cmake-2.8.12.2 found => Required system package doxygen>=1.5: doxygen-1.8.6 found => Required system package eigen3>=3.0.0: eigen3-3.2.0 found => Required system package g++>=3: g++-4.8 found => Required system package gcc>=3: gcc-4.8 found => Required system package graphviz>=2: graphviz-2.36.0 found => Required system package libstdc++: libstdc++ found => Required system package pkg-config>=0.22: pkg-config-0.26 found => Required system package py-sphinx>=1.1: py-sphinx-1.2.2 found => Required system package python27>=2.7<2.8: python27-2.7.6 found => Required system package tinyxml>=2: tinyxml-2.6.2 found => Required system package urdfdom>=0.2.8<1: urdfdom-0.2.10 found => Required robotpkg package dynamic-graph-v3>=3.0.0: dynamic-graph-v3-3.2.0 found => Required robotpkg package hpp-fcl>=0.5: hpp-fcl-0.6.0 found => Required robotpkg package parametric-curves>=1.0.0: parametric-curves-1.2.0 found => Required robotpkg package pinocchio>=1.3.1: pinocchio-1.3.3 found => Required robotpkg package py27-dynamic-graph-v3>=3.0: py27-dynamic-graph-v3-3.2.0 found => Required robotpkg package py27-parametric-curves>=1.0.0: py27-parametric-curves-1.2.0 found => Required robotpkg package py27-pinocchio: py27-pinocchio-1.3.3 found => Required robotpkg package py27-sot-core-v3>=3.0.0: py27-sot-core-v3-3.3.0 found => Required robotpkg package simple-humanoid-description>=1.0.1: simple-humanoid-description-1.0.1 found => Required robotpkg package sot-core-v3>=3.0.0: sot-core-v3-3.3.0 found => Required robotpkg package sot-torque-control>=1.0.0: sot-torque-control-1.1.0 found => Required robotpkg package tsid>=1.0.0: tsid-1.1.0 found => SHA1 checksums OK => RMD160 checksums OK An unexpected error occured. The last 10 log lines are shown below. | /local/robotpkg/var/tmp/robotpkg/wip/py-sot-torque-control/work/sot-torque-control-1.1.0/src/causal-filter.cpp:101:46: warning: conversion to 'int' from 'Eigen::EigenBase >::Index {aka long int}' may alter its value [-Wconversion] | int filter_order_m = filter_numerator.size(); | ^ | /local/robotpkg/var/tmp/robotpkg/wip/py-sot-torque-control/work/sot-torque-control-1.1.0/src/causal-filter.cpp:102:48: warning: conversion to 'int' from 'Eigen::EigenBase >::Index {aka long int}' may alter its value [-Wconversion] | int filter_order_n = filter_denominator.size(); | ^ | make[2]: Leaving directory `/local/robotpkg/var/tmp/robotpkg/wip/py-sot-torque-control/work/sot-torque-control-1.1.0' | make[1]: *** [CMakeFiles/sot-torque-control.dir/all] Error 2 | make: *** [all] Error 2 | make[1]: Leaving directory `/local/robotpkg/var/tmp/robotpkg/wip/py-sot-torque-control/work/sot-torque-control-1.1.0' For details or bug reports, check the complete log file in: /local/robotpkg/var/tmp/robotpkg/wip/py-sot-torque-control/work/build.log make[3]: *** [do-build] Error 2 make[2]: *** [pkg-check-installed] Error 2 => Marking py27-sot-torque-control-1.1.0 as broken ERROR: make: *** [package] Error 2 ===> Logging bulk summary for py27-sot-torque-control-1.1.0 => Checking leftover files => Creating bulk log files => Logging bulk metadata ===> Cleaning temporary files for py27-sot-torque-control-1.1.0 ===> Done bulk for py27-sot-torque-control-1.1.0 [84%] Processing wip/py-sot-torque-control:py32-sot-torque-control-1.1.0 ===> Bulk building for py32-sot-torque-control-1.1.0 Binary package for py32-sot-torque-control-1.1.0 is up-to-date. [84%] Processing wip/py-sot-torque-control:py34-sot-torque-control-1.1.0 ===> Cleaning temporary files for py34-sot-torque-control-1.1.0 ===> Bulk building for py34-sot-torque-control-1.1.0 => Checking for clear installation => Installing /opt/robotpkg/var/lib/robotpkg/packages/bsd/Ubuntu-14.04-x86_64/All/digest-20080510.tgz => Installing /opt/robotpkg/var/lib/robotpkg/packages/bsd/Ubuntu-14.04-x86_64/All/tnftp-20130505~ssl.tgz => Required robotpkg package digest>=20080510: digest-20080510 found => Required robotpkg package tnftp>=20091122: tnftp-20130505~ssl found => Required system package gnupg>=1: gnupg-1.4.16 found => Required system package gzip: gzip-1.6 found => Required system package pax and tar archivers: pax found => Required system package pkg_install>=20110805.9: pkg_install-20110805.9 found => Required system package pkgrepo2deb>=1.4: pkgrepo2deb-1.4 found => Dependency digest-20080510 already installed => Installing /opt/robotpkg/var/lib/robotpkg/wip/packages/bsd/Ubuntu-14.04-x86_64/All/dynamic-graph-v3-3.2.0.tgz => Installing /opt/robotpkg/var/lib/robotpkg/packages/bsd/Ubuntu-14.04-x86_64/All/hpp-fcl-0.6.0.tgz => Installing /opt/robotpkg/var/lib/robotpkg/wip/packages/bsd/Ubuntu-14.04-x86_64/All/parametric-curves-1.2.0.tgz => Installing /opt/robotpkg/var/lib/robotpkg/packages/bsd/Ubuntu-14.04-x86_64/All/pinocchio-1.3.3.tgz ERROR: Required robotpkg package py34-dynamic-graph-v3>=3.0: BROKEN => Installing /opt/robotpkg/var/lib/robotpkg/wip/packages/bsd/Ubuntu-14.04-x86_64/All/py34-parametric-curves-1.2.0.tgz => Installing /opt/robotpkg/var/lib/robotpkg/packages/bsd/Ubuntu-14.04-x86_64/All/py34-pinocchio-1.3.3.tgz ERROR: Required robotpkg package py34-sot-core-v3>=3.0.0: BROKEN => Installing /opt/robotpkg/var/lib/robotpkg/wip/packages/bsd/Ubuntu-14.04-x86_64/All/simple-humanoid-description-1.0.1.tgz => Installing /opt/robotpkg/var/lib/robotpkg/wip/packages/bsd/Ubuntu-14.04-x86_64/All/sot-core-v3-3.3.0.tgz => Installing /opt/robotpkg/var/lib/robotpkg/wip/packages/bsd/Ubuntu-14.04-x86_64/All/sot-torque-control-1.1.0.tgz => Dependency tnftp-20130505~ssl already installed => Dependency tsid-1.1.0 already installed ===> Logging bulk summary for py34-sot-torque-control-1.1.0 => Checking leftover files => Creating bulk log files => Logging bulk metadata ===> Cleaning temporary files for py34-sot-torque-control-1.1.0 ===> Done bulk for py34-sot-torque-control-1.1.0 [84%] Processing wip/py-sot-torque-control:py35-sot-torque-control-1.1.0 ===> Bulk building for py35-sot-torque-control-1.1.0 Binary package for py35-sot-torque-control-1.1.0 is up-to-date. [85%] Processing wip/py-sot-torque-control:py36-sot-torque-control-1.1.0 ===> Bulk building for py36-sot-torque-control-1.1.0 Binary package for py36-sot-torque-control-1.1.0 is up-to-date. [85%] Processing wip/py-sot-torque-control:py37-sot-torque-control-1.1.0 ===> Bulk building for py37-sot-torque-control-1.1.0 Binary package for py37-sot-torque-control-1.1.0 is up-to-date. [85%] Processing wip/sot-pattern-generator-v3:sot-pattern-generator-v3-3.1.0 ===> Bulk building for sot-pattern-generator-v3-3.1.0 Binary package for sot-pattern-generator-v3-3.1.0 is up-to-date. [86%] Processing wip/py-sot-tools-v3:py27-sot-tools-v3-2.1.0 ===> Bulk building for py27-sot-tools-v3-2.1.0 Binary package for py27-sot-tools-v3-2.1.0 is up-to-date. [86%] Processing wip/py-sot-tools-v3:py32-sot-tools-v3-2.1.0 ===> Bulk building for py32-sot-tools-v3-2.1.0 Binary package for py32-sot-tools-v3-2.1.0 is up-to-date. [87%] Processing wip/py-sot-tools-v3:py34-sot-tools-v3-2.1.0 ===> Cleaning temporary files for py34-sot-tools-v3-2.1.0 ===> Bulk building for py34-sot-tools-v3-2.1.0 => Checking for clear installation => Installing /opt/robotpkg/var/lib/robotpkg/packages/bsd/Ubuntu-14.04-x86_64/All/digest-20080510.tgz => Installing /opt/robotpkg/var/lib/robotpkg/packages/bsd/Ubuntu-14.04-x86_64/All/tnftp-20130505~ssl.tgz => Required robotpkg package digest>=20080510: digest-20080510 found => Required robotpkg package tnftp>=20091122: tnftp-20130505~ssl found => Required system package gnupg>=1: gnupg-1.4.16 found => Required system package gzip: gzip-1.6 found => Required system package pax and tar archivers: pax found => Required system package pkg_install>=20110805.9: pkg_install-20110805.9 found => Required system package pkgrepo2deb>=1.4: pkgrepo2deb-1.4 found => Dependency digest-20080510 already installed ERROR: Required robotpkg package py34-sot-core-v3>=3.0.0: BROKEN => Installing /opt/robotpkg/var/lib/robotpkg/wip/packages/bsd/Ubuntu-14.04-x86_64/All/sot-core-v3-3.3.0.tgz => Installing /opt/robotpkg/var/lib/robotpkg/wip/packages/bsd/Ubuntu-14.04-x86_64/All/sot-tools-v3-2.1.0.tgz => Dependency tnftp-20130505~ssl already installed ===> Logging bulk summary for py34-sot-tools-v3-2.1.0 => Checking leftover files => Creating bulk log files => Logging bulk metadata ===> Cleaning temporary files for py34-sot-tools-v3-2.1.0 ===> Done bulk for py34-sot-tools-v3-2.1.0 [87%] Processing wip/py-sot-tools-v3:py35-sot-tools-v3-2.1.0 ===> Bulk building for py35-sot-tools-v3-2.1.0 Binary package for py35-sot-tools-v3-2.1.0 is up-to-date. [87%] Processing wip/py-sot-tools-v3:py36-sot-tools-v3-2.1.0 ===> Bulk building for py36-sot-tools-v3-2.1.0 Binary package for py36-sot-tools-v3-2.1.0 is up-to-date. [88%] Processing wip/py-sot-tools-v3:py37-sot-tools-v3-2.1.0 ===> Bulk building for py37-sot-tools-v3-2.1.0 Binary package for py37-sot-tools-v3-2.1.0 is up-to-date. [88%] Processing wip/sot-hrp2-v3:sot-hrp2-v3-2.1.0 ===> Bulk building for sot-hrp2-v3-2.1.0 Binary package for sot-hrp2-v3-2.1.0 is up-to-date. [88%] Processing wip/py-sot-dynamic-pinocchio-v3:py27-sot-dynamic-pinocchio-v3-3.2.4 ===> Bulk building for py27-sot-dynamic-pinocchio-v3-3.2.4 Binary package for py27-sot-dynamic-pinocchio-v3-3.2.4 is up-to-date. [89%] Processing wip/py-sot-dynamic-pinocchio-v3:py32-sot-dynamic-pinocchio-v3-3.2.4 ===> Bulk building for py32-sot-dynamic-pinocchio-v3-3.2.4 Binary package for py32-sot-dynamic-pinocchio-v3-3.2.4 is up-to-date. [89%] Processing wip/py-sot-dynamic-pinocchio-v3:py34-sot-dynamic-pinocchio-v3-3.2.4 ===> Cleaning temporary files for py34-sot-dynamic-pinocchio-v3-3.2.4 ===> Bulk building for py34-sot-dynamic-pinocchio-v3-3.2.4 => Checking for clear installation => Installing /opt/robotpkg/var/lib/robotpkg/packages/bsd/Ubuntu-14.04-x86_64/All/digest-20080510.tgz => Installing /opt/robotpkg/var/lib/robotpkg/packages/bsd/Ubuntu-14.04-x86_64/All/tnftp-20130505~ssl.tgz => Required robotpkg package digest>=20080510: digest-20080510 found => Required robotpkg package tnftp>=20091122: tnftp-20130505~ssl found => Required system package gnupg>=1: gnupg-1.4.16 found => Required system package gzip: gzip-1.6 found => Required system package pax and tar archivers: pax found => Required system package pkg_install>=20110805.9: pkg_install-20110805.9 found => Required system package pkgrepo2deb>=1.4: pkgrepo2deb-1.4 found => Dependency digest-20080510 already installed => Installing /opt/robotpkg/var/lib/robotpkg/packages/bsd/Ubuntu-14.04-x86_64/All/hpp-fcl-0.6.0.tgz => Installing /opt/robotpkg/var/lib/robotpkg/packages/bsd/Ubuntu-14.04-x86_64/All/pinocchio-1.3.3.tgz => Installing /opt/robotpkg/var/lib/robotpkg/packages/bsd/Ubuntu-14.04-x86_64/All/py34-pinocchio-1.3.3.tgz ERROR: Required robotpkg package py34-sot-core-v3>=3.0.0: BROKEN ERROR: Required robotpkg package py34-sot-tools-v3>=2.0: BROKEN => Installing /opt/robotpkg/var/lib/robotpkg/wip/packages/bsd/Ubuntu-14.04-x86_64/All/sot-core-v3-3.3.0.tgz => Installing /opt/robotpkg/var/lib/robotpkg/wip/packages/bsd/Ubuntu-14.04-x86_64/All/sot-dynamic-pinocchio-v3-3.2.4.tgz robotpkg_add: Package `py27-eigenpy-1.5.0' conflicts with `py[0-9][0-9]-eigenpy-[0-9]*', and `py34-eigenpy-1.5.0' is installed. robotpkg_add: Installed package `py34-eigenpy-1.5.0' conflicts with `py[0-9][0-9]-eigenpy-[0-9]*' when trying to install `py27-eigenpy-1.5.0'. robotpkg_add: Can't install dependency py27-eigenpy>=1.4.1 robotpkg_add: 1 package addition failed => Installing /opt/robotpkg/var/lib/robotpkg/wip/packages/bsd/Ubuntu-14.04-x86_64/All/sot-tools-v3-2.1.0.tgz => Dependency tnftp-20130505~ssl already installed ===> Logging bulk summary for py34-sot-dynamic-pinocchio-v3-3.2.4 => Checking leftover files => Creating bulk log files => Logging bulk metadata ===> Cleaning temporary files for py34-sot-dynamic-pinocchio-v3-3.2.4 ===> Done bulk for py34-sot-dynamic-pinocchio-v3-3.2.4 [90%] Processing wip/py-sot-dynamic-pinocchio-v3:py35-sot-dynamic-pinocchio-v3-3.2.4 ===> Bulk building for py35-sot-dynamic-pinocchio-v3-3.2.4 Binary package for py35-sot-dynamic-pinocchio-v3-3.2.4 is up-to-date. [90%] Processing wip/py-sot-dynamic-pinocchio-v3:py36-sot-dynamic-pinocchio-v3-3.2.4 ===> Bulk building for py36-sot-dynamic-pinocchio-v3-3.2.4 Binary package for py36-sot-dynamic-pinocchio-v3-3.2.4 is up-to-date. [90%] Processing wip/py-sot-dynamic-pinocchio-v3:py37-sot-dynamic-pinocchio-v3-3.2.4 ===> Bulk building for py37-sot-dynamic-pinocchio-v3-3.2.4 Binary package for py37-sot-dynamic-pinocchio-v3-3.2.4 is up-to-date. [91%] Processing wip/openhrp3-hrp2:openhrp3-hrp2-1.2.0 ===> Bulk building for openhrp3-hrp2-1.2.0 Binary package for openhrp3-hrp2-1.2.0 is up-to-date. [91%] Processing wip/py-sot-dyninv-v3:py27-sot-dyninv-v3-3.1.1r1 ===> Bulk building for py27-sot-dyninv-v3-3.1.1r1 Binary package for py27-sot-dyninv-v3-3.1.1r1 is up-to-date. [91%] Processing wip/py-sot-dyninv-v3:py32-sot-dyninv-v3-3.1.1r1 ===> Bulk building for py32-sot-dyninv-v3-3.1.1r1 Binary package for py32-sot-dyninv-v3-3.1.1r1 is up-to-date. [92%] Processing wip/py-sot-dyninv-v3:py34-sot-dyninv-v3-3.1.1r1 ===> Cleaning temporary files for py34-sot-dyninv-v3-3.1.1r1 ===> Bulk building for py34-sot-dyninv-v3-3.1.1r1 => Checking for clear installation => Installing /opt/robotpkg/var/lib/robotpkg/packages/bsd/Ubuntu-14.04-x86_64/All/digest-20080510.tgz => Installing /opt/robotpkg/var/lib/robotpkg/packages/bsd/Ubuntu-14.04-x86_64/All/tnftp-20130505~ssl.tgz => Required robotpkg package digest>=20080510: digest-20080510 found => Required robotpkg package tnftp>=20091122: tnftp-20130505~ssl found => Required system package gnupg>=1: gnupg-1.4.16 found => Required system package gzip: gzip-1.6 found => Required system package pax and tar archivers: pax found => Required system package pkg_install>=20110805.9: pkg_install-20110805.9 found => Required system package pkgrepo2deb>=1.4: pkgrepo2deb-1.4 found => Dependency digest-20080510 already installed => Installing /opt/robotpkg/var/lib/robotpkg/wip/packages/bsd/Ubuntu-14.04-x86_64/All/dynamic-graph-v3-3.2.0.tgz ERROR: Required robotpkg package py34-dynamic-graph-v3>=3.0: BROKEN ERROR: Required robotpkg package py34-sot-core-v3>=3.0.0: BROKEN => Installing /opt/robotpkg/var/lib/robotpkg/wip/packages/bsd/Ubuntu-14.04-x86_64/All/sot-core-v3-3.3.0.tgz => Installing /opt/robotpkg/var/lib/robotpkg/wip/packages/bsd/Ubuntu-14.04-x86_64/All/sot-dyninv-v3-3.1.1r1.tgz => Dependency soth-2.0.3 already installed => Dependency tnftp-20130505~ssl already installed ===> Logging bulk summary for py34-sot-dyninv-v3-3.1.1r1 => Checking leftover files => Creating bulk log files => Logging bulk metadata ===> Cleaning temporary files for py34-sot-dyninv-v3-3.1.1r1 ===> Done bulk for py34-sot-dyninv-v3-3.1.1r1 [92%] Processing wip/py-sot-dyninv-v3:py35-sot-dyninv-v3-3.1.1r1 ===> Bulk building for py35-sot-dyninv-v3-3.1.1r1 Binary package for py35-sot-dyninv-v3-3.1.1r1 is up-to-date. [92%] Processing wip/py-sot-dyninv-v3:py36-sot-dyninv-v3-3.1.1r1 ===> Bulk building for py36-sot-dyninv-v3-3.1.1r1 Binary package for py36-sot-dyninv-v3-3.1.1r1 is up-to-date. [93%] Processing wip/py-sot-dyninv-v3:py37-sot-dyninv-v3-3.1.1r1 ===> Bulk building for py37-sot-dyninv-v3-3.1.1r1 Binary package for py37-sot-dyninv-v3-3.1.1r1 is up-to-date. [93%] Processing wip/py-sot-application-v3:py27-sot-application-v3-1.2.0r2 ===> Bulk building for py27-sot-application-v3-1.2.0r2 Binary package for py27-sot-application-v3-1.2.0r2 is up-to-date. [94%] Processing wip/py-sot-application-v3:py32-sot-application-v3-1.2.0r2 ===> Bulk building for py32-sot-application-v3-1.2.0r2 Binary package for py32-sot-application-v3-1.2.0r2 is up-to-date. [94%] Processing wip/py-sot-application-v3:py34-sot-application-v3-1.2.0r2 ===> Cleaning temporary files for py34-sot-application-v3-1.2.0r2 ===> Bulk building for py34-sot-application-v3-1.2.0r2 => Checking for clear installation => Installing /opt/robotpkg/var/lib/robotpkg/packages/bsd/Ubuntu-14.04-x86_64/All/digest-20080510.tgz => Installing /opt/robotpkg/var/lib/robotpkg/packages/bsd/Ubuntu-14.04-x86_64/All/tnftp-20130505~ssl.tgz => Required robotpkg package digest>=20080510: digest-20080510 found => Required robotpkg package tnftp>=20091122: tnftp-20130505~ssl found => Required system package gnupg>=1: gnupg-1.4.16 found => Required system package gzip: gzip-1.6 found => Required system package pax and tar archivers: pax found => Required system package pkg_install>=20110805.9: pkg_install-20110805.9 found => Required system package pkgrepo2deb>=1.4: pkgrepo2deb-1.4 found => Dependency digest-20080510 already installed => Required robotpkg package py34-sot-dynamic-pinocchio-v3>=3.1.1: N/A => Installing /opt/robotpkg/var/lib/robotpkg/wip/packages/bsd/Ubuntu-14.04-x86_64/All/sot-dynamic-pinocchio-v3-3.2.4.tgz => Installing /opt/robotpkg/var/lib/robotpkg/wip/packages/bsd/Ubuntu-14.04-x86_64/All/sot-dyninv-v3-3.1.1r1.tgz => Dependency tnftp-20130505~ssl already installed ===> Logging bulk summary for py34-sot-application-v3-1.2.0r2 => Checking leftover files => Creating bulk log files => Logging bulk metadata ===> Cleaning temporary files for py34-sot-application-v3-1.2.0r2 ===> Done bulk for py34-sot-application-v3-1.2.0r2 [94%] Processing wip/py-sot-application-v3:py35-sot-application-v3-1.2.0r2 ===> Bulk building for py35-sot-application-v3-1.2.0r2 Binary package for py35-sot-application-v3-1.2.0r2 is up-to-date. [95%] Processing wip/py-sot-application-v3:py36-sot-application-v3-1.2.0r2 ===> Bulk building for py36-sot-application-v3-1.2.0r2 Binary package for py36-sot-application-v3-1.2.0r2 is up-to-date. [95%] Processing wip/py-sot-application-v3:py37-sot-application-v3-1.2.0r2 ===> Bulk building for py37-sot-application-v3-1.2.0r2 Binary package for py37-sot-application-v3-1.2.0r2 is up-to-date. [95%] Processing wip/roscontrol-sot:roscontrol-sot-0.0.7 ===> Cleaning temporary files for roscontrol-sot-0.0.7 ===> Bulk building for roscontrol-sot-0.0.7 => Checking for clear installation => Installing /opt/robotpkg/var/lib/robotpkg/packages/bsd/Ubuntu-14.04-x86_64/All/digest-20080510.tgz => Installing /opt/robotpkg/var/lib/robotpkg/packages/bsd/Ubuntu-14.04-x86_64/All/tnftp-20130505~ssl.tgz => Required robotpkg package digest>=20080510: digest-20080510 found => Required robotpkg package tnftp>=20130505~ssl: tnftp-20130505~ssl found => Required system package gnupg>=1: gnupg-1.4.16 found => Required system package gzip: gzip-1.6 found => Required system package pax and tar archivers: pax found => Required system package pkg_install>=20110805.9: pkg_install-20110805.9 found => Required system package pkgrepo2deb>=1.4: pkgrepo2deb-1.4 found => Dependency digest-20080510 already installed => Installing /opt/robotpkg/var/lib/robotpkg/packages/bsd/Ubuntu-14.04-x86_64/All/dynamic-graph-bridge-msgs-0.2.0.tgz => Installing /opt/robotpkg/var/lib/robotpkg/wip/packages/bsd/Ubuntu-14.04-x86_64/All/dynamic-graph-v3-3.2.0.tgz => Installing /opt/robotpkg/var/lib/robotpkg/wip/packages/bsd/Ubuntu-14.04-x86_64/All/pal-hardware-interfaces-0.0.3.tgz => Dependency prf-ros-control-0.2.6r3 already installed => Installing /opt/robotpkg/var/lib/robotpkg/wip/packages/bsd/Ubuntu-14.04-x86_64/All/py27-dynamic-graph-bridge-v3-3.2.0.tgz => Dependency py27-dynamic-graph-v3-3.2.0 already installed => Dependency sot-core-v3-3.3.0 already installed => Installing /opt/robotpkg/var/lib/robotpkg/wip/packages/bsd/Ubuntu-14.04-x86_64/All/sot-dynamic-pinocchio-v3-3.2.4.tgz => Dependency tnftp-20130505~ssl already installed => Building with no option. => Use the GNU C++ compiler: c++-compiler provided by g++>=3 => Use the GNU C compiler: c-compiler provided by gcc>=3 => Use python-2.7: python>=2.5<3.8 provided by python27>=2.7<2.8 => Use ros indigo: ros>=groovy ros>=groovy ros>=hydro provided by ros-indigo => Required system package bullet>=2.75: bullet-2.81 found => Required system package cmake>=2.8.3: cmake-2.8.12.2 found => Required system package eigen3>=3.0.0: eigen3-3.2.0 found => Required system package g++>=3: g++-4.8 found => Required system package gcc>=3: gcc-4.8 found => Required system package googletest: googletest found => Required system package libstdc++: libstdc++ found => Required system package pkg-config>=0.22: pkg-config-0.26 found => Required system package py27-empy>=3: py27-empy-3.3 found => Required system package py27-nose>=0.10: py27-nose-1.3.1 found => Required system package python27>=2.7<2.8: python27-2.7.6 found => Required system package ros-catkin>=0.6<0.7: ros-catkin-0.6.19 found => Required system package ros-comm>=1.11<1.12: ros-comm-1.11.21 found => Required system package ros-common-msgs>=1.11<1.12: ros-common-msgs-1.11.10 found => Required system package ros-control-msgs>=1.3<1.4: ros-control-msgs-1.3.1 found => Required system package ros-geometry>=1.11<1.12: ros-geometry-1.11.9 found => Required system package ros-message-runtime>=0.4<0.5: ros-message-runtime-0.4.12 found => Required system package ros-realtime-tools>=1.8.2: ros-realtime-tools-1.9.1 found => Required system package ros-roscpp-core>=0.5<0.6: ros-roscpp-core-0.5.8 found => Required system package ros-rospack>=2.2<2.3: ros-rospack-2.2.8 found => Required system package ros-std-msgs>=0.5: ros-std-msgs-0.5.10 found => Required robotpkg package dynamic-graph-bridge-msgs>=0.2.0: dynamic-graph-bridge-msgs-0.2.0 found => Required robotpkg package dynamic-graph-v3>=3.0.0: dynamic-graph-v3-3.2.0 found => Required robotpkg package pal-hardware-interfaces>=0.0.3: pal-hardware-interfaces-0.0.3 found => Required robotpkg package prf-ros-control>=0.2: prf-ros-control-0.2.6r3 found => Required robotpkg package py27-dynamic-graph-bridge-v3>=3.0.0: py27-dynamic-graph-bridge-v3-3.2.0 found => Required robotpkg package py27-dynamic-graph-v3>=3.0: py27-dynamic-graph-v3-3.2.0 found => Required robotpkg package sot-core-v3>=3.0.0: sot-core-v3-3.3.0 found => Required robotpkg package sot-dynamic-pinocchio-v3>=3.1.1: sot-dynamic-pinocchio-v3-3.2.4 found => SHA1 checksums OK => RMD160 checksums OK An unexpected error occured. The last 10 log lines are shown below. | /opt/openrobots/include/hardware_interface/internal/interface_manager.h: In instantiation of 'static char (& hardware_interface::CheckIsResourceManager::callCM(std::vector&, C*, typename C::resource_manager_type*))[1] [with C = hardware_interface::ImuSensorInterface; T = hardware_interface::ImuSensorInterface; hardware_interface::CheckIsResourceManager::yes = char [1]; typename C::resource_manager_type = hardware_interface::ResourceManager]': | /opt/openrobots/include/hardware_interface/internal/interface_manager.h:83:11: required from 'static const void hardware_interface::CheckIsResourceManager::callConcatManagers(std::vector&, T*) [with T = hardware_interface::ImuSensorInterface]' | /opt/openrobots/include/hardware_interface/internal/interface_manager.h:200:78: required from 'T* hardware_interface::InterfaceManager::get() [with T = hardware_interface::ImuSensorInterface]' | /local/robotpkg/var/tmp/robotpkg/wip/roscontrol-sot/work/roscontrol_sot-0.0.7/src/roscontrol-sot-controller.cpp:227:52: required from here | /opt/openrobots/include/hardware_interface/internal/interface_manager.h:73:9: warning: reference to local variable 'tmp_yes' returned [-Wreturn-local-addr] | make[2]: *** [CMakeFiles/rcsot_controller.dir/src/roscontrol-sot-controller.cpp.o] Error 1 | make[2]: Leaving directory `/local/robotpkg/var/tmp/robotpkg/wip/roscontrol-sot/work/roscontrol_sot-0.0.7' | make[1]: Leaving directory `/local/robotpkg/var/tmp/robotpkg/wip/roscontrol-sot/work/roscontrol_sot-0.0.7' | make[1]: *** [CMakeFiles/rcsot_controller.dir/all] Error 2 | make: *** [all] Error 2 For details or bug reports, check the complete log file in: /local/robotpkg/var/tmp/robotpkg/wip/roscontrol-sot/work/build.log make[3]: *** [do-build] Error 2 make[2]: *** [pkg-check-installed] Error 2 => Marking roscontrol-sot-0.0.7 as broken ERROR: make: *** [package] Error 2 ===> Logging bulk summary for roscontrol-sot-0.0.7 => Checking leftover files => Creating bulk log files => Logging bulk metadata ===> Cleaning temporary files for roscontrol-sot-0.0.7 ===> Done bulk for roscontrol-sot-0.0.7 [96%] Processing wip/py-sot-pattern-generator-v3:py27-sot-pattern-generator-v3-3.1.0 ===> Bulk building for py27-sot-pattern-generator-v3-3.1.0 Binary package for py27-sot-pattern-generator-v3-3.1.0 is up-to-date. [96%] Processing wip/py-sot-pattern-generator-v3:py32-sot-pattern-generator-v3-3.1.0 ===> Bulk building for py32-sot-pattern-generator-v3-3.1.0 Binary package for py32-sot-pattern-generator-v3-3.1.0 is up-to-date. [97%] Processing wip/py-sot-pattern-generator-v3:py34-sot-pattern-generator-v3-3.1.0 ===> Cleaning temporary files for py34-sot-pattern-generator-v3-3.1.0 ===> Bulk building for py34-sot-pattern-generator-v3-3.1.0 => Checking for clear installation => Installing /opt/robotpkg/var/lib/robotpkg/packages/bsd/Ubuntu-14.04-x86_64/All/digest-20080510.tgz => Installing /opt/robotpkg/var/lib/robotpkg/packages/bsd/Ubuntu-14.04-x86_64/All/tnftp-20130505~ssl.tgz => Required robotpkg package digest>=20080510: digest-20080510 found => Required robotpkg package tnftp>=20091122: tnftp-20130505~ssl found => Required system package gnupg>=1: gnupg-1.4.16 found => Required system package gzip: gzip-1.6 found => Required system package pax and tar archivers: pax found => Required system package pkg_install>=20110805.9: pkg_install-20110805.9 found => Required system package pkgrepo2deb>=1.4: pkgrepo2deb-1.4 found => Dependency digest-20080510 already installed => Installing /opt/robotpkg/var/lib/robotpkg/packages/bsd/Ubuntu-14.04-x86_64/All/hpp-fcl-0.6.0.tgz => Installing /opt/robotpkg/var/lib/robotpkg/wip/packages/bsd/Ubuntu-14.04-x86_64/All/jrl-walkgen-v3-4.0.4.tgz => Dependency pinocchio-1.3.3 already installed ERROR: Required robotpkg package py34-sot-core-v3>=3.0.0: BROKEN => Installing /opt/robotpkg/var/lib/robotpkg/wip/packages/bsd/Ubuntu-14.04-x86_64/All/sot-core-v3-3.3.0.tgz => Installing /opt/robotpkg/var/lib/robotpkg/wip/packages/bsd/Ubuntu-14.04-x86_64/All/sot-pattern-generator-v3-3.1.0.tgz => Dependency tnftp-20130505~ssl already installed ===> Logging bulk summary for py34-sot-pattern-generator-v3-3.1.0 => Checking leftover files => Creating bulk log files => Logging bulk metadata ===> Cleaning temporary files for py34-sot-pattern-generator-v3-3.1.0 ===> Done bulk for py34-sot-pattern-generator-v3-3.1.0 [97%] Processing wip/py-sot-pattern-generator-v3:py35-sot-pattern-generator-v3-3.1.0 ===> Bulk building for py35-sot-pattern-generator-v3-3.1.0 Binary package for py35-sot-pattern-generator-v3-3.1.0 is up-to-date. [97%] Processing wip/py-sot-pattern-generator-v3:py36-sot-pattern-generator-v3-3.1.0 ===> Bulk building for py36-sot-pattern-generator-v3-3.1.0 Binary package for py36-sot-pattern-generator-v3-3.1.0 is up-to-date. [98%] Processing wip/py-sot-pattern-generator-v3:py37-sot-pattern-generator-v3-3.1.0 ===> Bulk building for py37-sot-pattern-generator-v3-3.1.0 Binary package for py37-sot-pattern-generator-v3-3.1.0 is up-to-date. [98%] Processing wip/sot-talos:sot-talos-1.0.2 ===> Bulk building for sot-talos-1.0.2 Binary package for sot-talos-1.0.2 is up-to-date. [98%] Processing wip/hrp2-dev:hrp2-dev-20171009 ===> Bulk building for hrp2-dev-20171009 Binary package for hrp2-dev-20171009 is up-to-date. [99%] Processing wip/talos-metapkg-ros-control-sot:talos-metapkg-ros-control-sot-0.0.12 ===> Cleaning temporary files for talos-metapkg-ros-control-sot-0.0.12 ===> Bulk building for talos-metapkg-ros-control-sot-0.0.12 => Checking for clear installation => Installing /opt/robotpkg/var/lib/robotpkg/packages/bsd/Ubuntu-14.04-x86_64/All/digest-20080510.tgz => Installing /opt/robotpkg/var/lib/robotpkg/packages/bsd/Ubuntu-14.04-x86_64/All/tnftp-20130505~ssl.tgz => Required robotpkg package digest>=20080510: digest-20080510 found => Required robotpkg package tnftp>=20130505~ssl: tnftp-20130505~ssl found => Required system package gnupg>=1: gnupg-1.4.16 found => Required system package gzip: gzip-1.6 found => Required system package pax and tar archivers: pax found => Required system package pkg_install>=20110805.9: pkg_install-20110805.9 found => Required system package pkgrepo2deb>=1.4: pkgrepo2deb-1.4 found => Dependency digest-20080510 already installed => Installing /opt/robotpkg/var/lib/robotpkg/wip/packages/bsd/Ubuntu-14.04-x86_64/All/pal-hardware-interfaces-0.0.3.tgz => Required robotpkg package prf-ros-controllers>=0.2.8: N/A => Installing /opt/robotpkg/var/lib/robotpkg/wip/packages/bsd/Ubuntu-14.04-x86_64/All/py27-dynamic-graph-bridge-v3-3.2.0.tgz ERROR: Required robotpkg package roscontrol-sot>=0.0.3: BROKEN => Dependency tnftp-20130505~ssl already installed ===> Logging bulk summary for talos-metapkg-ros-control-sot-0.0.12 => Checking leftover files => Creating bulk log files => Logging bulk metadata ===> Cleaning temporary files for talos-metapkg-ros-control-sot-0.0.12 ===> Done bulk for talos-metapkg-ros-control-sot-0.0.12 [99%] Processing wip/talos-dev:talos-dev-20171009 ===> Cleaning temporary files for talos-dev-20171009 ===> Bulk building for talos-dev-20171009 => Checking for clear installation => Required system package gnupg>=1: gnupg-1.4.16 found => Required system package gzip: gzip-1.6 found => Required system package pkg_install>=20110805.9: pkg_install-20110805.9 found => Required system package pkgrepo2deb>=1.4: pkgrepo2deb-1.4 found ERROR: Required robotpkg package prf-gazebo-ros-pkgs>=2.6.5: BROKEN => Installing /opt/robotpkg/var/lib/robotpkg/wip/packages/bsd/Ubuntu-14.04-x86_64/All/sot-talos-1.0.2.tgz => Installing /opt/robotpkg/var/lib/robotpkg/wip/packages/bsd/Ubuntu-14.04-x86_64/All/talos-metapkg-ros-control-sot-0.0.7.tgz robotpkg_add: Conflicting PLIST with py27-dynamic-graph-bridge-v3-3.2.0: include/dynamic_graph_bridge/RunPythonFile.h robotpkg_add: Can't install dependency dynamic-graph-bridge-v3>=3.0.0 robotpkg_add: 1 package addition failed => Installing /opt/robotpkg/var/lib/robotpkg/wip/packages/bsd/Ubuntu-14.04-x86_64/All/talos-simulation-0.0.14r2.tgz ===> Logging bulk summary for talos-dev-20171009 => Checking leftover files => Creating bulk log files => Logging bulk metadata ===> Cleaning temporary files for talos-dev-20171009 ===> Done bulk for talos-dev-20171009 ===> Done bulk for rbulk wip set 735.35user 375.56system 17:30.23elapsed 105%CPU (0avgtext+0avgdata 1180844maxresident)k 1306888inputs+6617048outputs (971major+44860077minor)pagefaults 0swaps --- Updating bulk database --------------------------------------- Collecting session logs in /local/robotpkg/var/log/bulk updated py34-jsbsim-20150424r1 updated move3d-studio-1.4r3~qtstudio updated py27-hla-1.1.1r1 updated dynamic-introspection-1.0.5 updated talos-metapkg-ros-control-sot-0.0.12 updated pal-gazebo-worlds-2.0.8r2 updated py34-dynamic-graph-v3-3.2.0 updated tiago-robot-0.0.35os1 updated py34-sot-dynamic-pinocchio-v3-3.2.4 updated sot-torque-control-1.2.0 updated orocos-dot_service-20120308 updated morse-hla-1.4 updated talos-simulation-0.1.4r2 updated play-motion-0.4.5 updated CppAD-20180000.0 updated infuse-envire-0.1.1 updated prf-roboticsgroup-gazebo-plugins-0.1.0 updated py27-jsbsim-20150424r1 updated py34-sot-torque-control-1.1.0 updated py27-sot-torque-control-1.1.0 updated roralink-0.3.0-Source updated backward-ros-0.1.4r3 updated py34-sot-application-v3-1.2.0r2 updated pal-hardware-gazebo-0.1.1r2 updated spark-genom-3.9~mightability+openprs+tcl+tclserv_client updated ur5-description-1.0.1 updated pal-gazebo-plugins-1.1.7 updated py34-mavlink-1.1.62 updated gdalwrap-0.1.10 updated ros-swri-string-util-2.3.0 updated py34-sot-core-v3-3.3.0 updated infuse-asn1-conversions-0.4r1 updated prf-ros-controllers-0.3.5r3 updated morse-mavlink-1.4 updated talos-dev-20171009 updated py34-dynamic-graph-tutorial-1.1.1 updated prf-gazebo-ros-pkgs-2.6.7r4 updated orocos-yarp_transport-20150316~doc updated roscontrol-sot-0.0.7 updated py34-sot-dyninv-v3-3.1.1r1 updated mraa-1.9.0 updated jrl-walkgen-v3-4.0.4 updated py34-sot-tools-v3-2.1.0 updated py34-hla-1.1.1r1 updated py34-dynamic-graph-bridge-v3-3.2.0 updated infuse-asn1-types-0.3 updated infuse-novatel-gps-driver-ros-0.1.0 updated libmove3d-planners-1.4.0 updated ros-swri-nodelet-2.3.0 updated CppADCodeGen-2.2.0 updated py34-rqt-dynamic-graph-1.0.0 updated morse-ros-1.4 updated py34-sot-pattern-generator-v3-3.1.0 updated pyrene-motions updated octoviz-1.6.1 processed 55 packages