robotpkg/wip bulk build results

Log for Fedora-26-x86_64 (Back)

--- Updating robotpkg ------------------------------------------------ Pulling /local/robotpkg/var/lib/robotpkg/wip Updating b885611..dfa42cd Fast-forward Makefile | 1 + parametric-curves/depend.mk | 2 +- sot-torque-control/DESCR | 1 + sot-torque-control/Makefile | 55 ++++++++++ sot-torque-control/PLIST | 152 ++++++++++++++++++++++++++++ sot-torque-control/depend.mk | 28 +++++ sot-torque-control/distinfo | 3 + talos-roboticsgroup-gazebo-plugins/Makefile | 2 +- talos-roboticsgroup-gazebo-plugins/distinfo | 6 +- 9 files changed, 245 insertions(+), 5 deletions(-) create mode 100644 sot-torque-control/DESCR create mode 100644 sot-torque-control/Makefile create mode 100644 sot-torque-control/PLIST create mode 100644 sot-torque-control/depend.mk create mode 100644 sot-torque-control/distinfo Updating pkgtools/pkg_install ===> Updating for pkg_install-20110805.7 pkg_install-20110805.7 is already installed and up-to-date. Updating pkgtools/rbulkit ===> Updating for rbulkit-20170123 rbulkit-20170123 is already installed and up-to-date. --- Running build for bulk-rbulk-wip ----------------------------------- ===> Sorting packages for rbulk wip set Scanning wip/py-mavlink:* Scanning wip/talos-robot:* Scanning wip/orocos-dot_service:* Scanning pkgtools/tnftp:tnftp>=20130505~ssl Scanning wip/soth:* Scanning wip/pr2-pick-object:* Scanning wip/py-sot-tools-v3:* Scanning wip/hyper-viewer:* Scanning wip/urg:* Scanning wip/gerard-bauzil:* Scanning wip/jafar-rtslam:* Scanning wip/robotModelParser-libs:* Scanning wip/hrp2-computer-monitor:* Scanning wip/laaswm-gui:* Scanning wip/hatptester:* Scanning wip/move3d-studio:* Scanning wip/talos-dev:* Scanning wip/chilitags:* Scanning wip/sot-hrp2:* Scanning wip/move3d-assets:* Scanning wip/py-dynamic-graph-v3:* Scanning wip/morse-hla:* Scanning wip/qpOASES:* Scanning wip/morse-pocolibs:* Scanning wip/talos-simulation:* Scanning wip/libmove3d-hri:* Scanning wip/py-laaswm:* Scanning wip/sot-core-v3:* Scanning wip/msgconnector:* Scanning wip/talos-data:* Scanning wip/FRILibrary:* Scanning wip/sot-application:* Scanning wip/talos-moveit-config:* Scanning wip/openhrp3-hrp2:* Scanning wip/libpointmatcher:* Scanning wip/sot-application-v3:* Scanning wip/sot-dyninv:* Scanning wip/MPC_avoidObs-genom:* [wip/MPC_avoidObs-genom:*] Warning: the LICENSE of wip/MPC_avoidObs-genom is undefined. Scanning wip/dptu-genom3:* Scanning wip/talos-pal-transmissions:* Scanning wip/libmove3d:* Scanning wip/py-jsbsim:* Scanning wip/morse-mavlink:* Scanning wip/dynamic-graph-bridge-v3:* Scanning wip/mhp-genom:* Scanning wip/parametric-curves:* Scanning wip/pinocchio:* Scanning wip/mrpt:* Scanning wip/libmove3d-planners:* Scanning wip/talos-metapkg-ros-control-sot:* Scanning wip/atlaas-genom:* Scanning wip/kukaFri-libs:* Scanning wip/hatpconsole:* Scanning wip/gdalwrap:* Scanning wip/talos-ros-control:* Scanning wip/atlaas:* Scanning wip/talos-pal-hardware-interfaces:* Scanning wip/MPC_DEMTreatment-genom:* [wip/MPC_DEMTreatment-genom:*] Warning: the LICENSE of wip/MPC_DEMTreatment-genom is undefined. Scanning wip/talos-roboticsgroup-gazebo-plugins:* Scanning wip/joystick-genom:* Scanning wip/hrp2-bringup:* Scanning wip/sot-torque-control:* Scanning wip/antlr2:* Scanning wip/mavlink:* Scanning wip/libnabo:* Scanning wip/spark-genom:* Scanning wip/jointStateMapper:* Scanning wip/ur5-description:* [wip/ur5-description:*] Warning: the LICENSE of wip/ur5-description is undefined. Scanning wip/osg-dae:* Scanning wip/MPC_controller-genom:* [wip/MPC_controller-genom:*] Warning: the LICENSE of wip/MPC_controller-genom is undefined. Scanning wip/pal-msgs:* Scanning wip/talos-ros-controllers:* Scanning wip/sot-dynamic-pinocchio-v3:* Scanning wip/sot-romeo-v3:* Scanning wip/openhrp3-simulator-wo-rtm:* Scanning wip/hrp2-14-description:* Scanning wip/talos-pal-hardware-gazebo:* Scanning wip/eigen-quadprog:* Scanning wip/jafar-qdisplay:* Scanning wip/octovis:* Scanning wip/hyper:* Scanning wip/talos-gazebo-ros-control:* Scanning wip/libfreenect:* Scanning wip/jsbsim:* Scanning wip/talos-pal-gazebo-plugins:* Scanning wip/track-target-genom:* Scanning wip/MPC_planner-genom:* [wip/MPC_planner-genom:*] Warning: the LICENSE of wip/MPC_planner-genom is undefined. Scanning wip/gladys:* Scanning wip/hatponboard-lib:* Scanning wip/hrp2-dev:* Scanning wip/orocos-yarp_transport:* Scanning middleware/orocos-rtt:orocos-rtt>=2.5 Scanning wip/sot-dyninv-v3:* Scanning wip/can-utils:* Scanning wip/libhatp:* Scanning wip/tsid:* Scanning wip/roralink:* Scanning wip/metapod:* [wip/metapod:*] Warning: DOXYGEN_PLIST_DIR in wip/metapod is deprecated. [wip/metapod:*] Warning: use DYNAMIC_PLIST_DIRS instead. Scanning wip/sot-pattern-generator-v3:* Scanning wip/jrl-walkgen-v3:* Scanning wip/simple-humanoid-description:* Scanning wip/hri-simulation:* Scanning wip/certi:* Scanning wip/ompl:* Scanning wip/sot-hrp2-v3:* Scanning wip/dynamic-graph-v3:* Scanning wip/morse-ros:* Scanning wip/vnet-yarp:* Scanning wip/sot-talos:* Scanning wip/mumps:* Scanning wip/histodet:* Scanning wip/orocos-bfl:* Scanning wip/sot-hrprtc-hrp2:* Scanning wip/py-hla:* Scanning wip/hyper-genom-plugin:* Scanning wip/py-eigen:* Scanning wip/hrp2-machine:* Scanning wip/py-morse:* Scanning wip/lua-rfsm:* Scanning wip/MPC:* Scanning wip/py-hla:py36-hla-1.1.1r1 Scanning wip/py-jsbsim:py36-jsbsim-20150424r1 Scanning wip/dptu-genom3:dptu-genom3-0.2~codels+openprs+ros-client-c+ros-client-ros+ros-server+!* Scanning wip/dptu-genom3:dptu-genom3-0.2~codels+pocolibs-client-c+openprs+pocolibs-server+!* Scanning wip/jafar-rtslam:~MTI Scanning wip/py-mavlink:py36-mavlink-1.1.62 Scanned 265 packages (218 unique) [0%] Processing wip/ompl:ompl-1.0.0 ===> Bulk building for ompl-1.0.0 Binary package for ompl-1.0.0 is up-to-date. [0%] Processing wip/certi:certi-3.5.1 ===> Cleaning temporary files for certi-3.5.1 ===> Bulk building for certi-3.5.1 => Checking for clear installation => Installing digest-20080510.tgz => Installing tnftp-20130505~ssl.tgz => Required robotpkg package digest>=20080510: digest-20080510 found => Required robotpkg package tnftp>=20091122: tnftp-20130505~ssl found => Required system package gzip: gzip-1.8 found => Required system package pax and tar archivers: pax found => Required system package pkg_install>=20110805.7: pkg_install-20110805.7 found => Dependency digest-20080510 already installed => Dependency tnftp-20130505~ssl already installed => Building with no option. => Use the GNU C++ compiler: c++-compiler provided by g++>=3 => Use the GNU C compiler: c-compiler provided by gcc>=3 => Required system package bison: bison found => Required system package cmake>=2.8.11: cmake-3.10.1 found => Required system package flex>=2.5.33: flex-2.6.1 found => Required system package g++>=3: g++-7 found => Required system package gcc>=3: gcc-7 found => Required system package libstdc++: libstdc++ found => Required system package libxml2>=2: libxml2-2.9.7 found => SHA1 checksums OK => RMD160 checksums OK => Registering installation for certi-3.5.1 => Linking package in /opt/robotpkg/var/lib/robotpkg/packages/bsd/Fedora-26-x86_64/pub ===> Logging bulk summary for certi-3.5.1 => Checking leftover files => Creating bulk log files => Logging bulk metadata ===> Cleaning temporary files for certi-3.5.1 ===> Done bulk for certi-3.5.1 [0%] Processing wip/dynamic-graph-v3:dynamic-graph-v3-3.0.1 ===> Cleaning temporary files for dynamic-graph-v3-3.0.1 ===> Bulk building for dynamic-graph-v3-3.0.1 => Checking for clear installation => Installing digest-20080510.tgz => Installing tnftp-20130505~ssl.tgz => Required robotpkg package digest>=20080510: digest-20080510 found => Required robotpkg package tnftp>=20091122: tnftp-20130505~ssl found => Required system package gzip: gzip-1.8 found => Required system package pax and tar archivers: pax found => Required system package pkg_install>=20110805.7: pkg_install-20110805.7 found => Dependency digest-20080510 already installed => Dependency tnftp-20130505~ssl already installed => Building with no option. => Use the GNU C++ compiler: c++-compiler provided by g++>=3 => Use the GNU C compiler: c-compiler provided by gcc>=3 => Required system package cmake>=2.6: cmake-3.10.1 found => Required system package doxygen>=1.5: doxygen-1.8.13 found => Required system package eigen3>=3.0.0: eigen3-3.3.4 found => Required system package g++>=3: g++-7 found => Required system package gcc>=3: gcc-7 found => Required system package graphviz>=2: graphviz-2.40.1 found => Required system package libstdc++: libstdc++ found => Required system package pdflatex: pdflatex found => Required system package pkg-config>=0.22: pkg-config-1.3.12 found => Required system package podlators: podlators found => SHA1 checksums OK => RMD160 checksums OK => Adding run-time search paths to pkg-config files => Registering installation for dynamic-graph-v3-3.0.1 => Linking package in /opt/robotpkg/var/lib/robotpkg/packages/bsd/Fedora-26-x86_64/pub ===> Logging bulk summary for dynamic-graph-v3-3.0.1 => Checking leftover files => Creating bulk log files => Logging bulk metadata ===> Cleaning temporary files for dynamic-graph-v3-3.0.1 ===> Done bulk for dynamic-graph-v3-3.0.1 [1%] Processing wip/morse-ros:morse-ros-1.4 ===> Cleaning temporary files for morse-ros-1.4 ===> Bulk building for morse-ros-1.4 => Checking for clear installation => Installing digest-20080510.tgz => Installing tnftp-20130505~ssl.tgz => Required robotpkg package digest>=20080510: digest-20080510 found => Required robotpkg package tnftp>=20091122: tnftp-20130505~ssl found => Required system package gzip: gzip-1.8 found => Required system package patch>=2.0: patch-2.7.5 found => Required system package pax and tar archivers: pax found => Required system package pkg_install>=20110805.7: pkg_install-20110805.7 found => Dependency digest-20080510 already installed => Installing morse-1.4~doc.tgz => Installing py36-catkin-pkg-0.2.4.tgz => Required system package py36-yaml>=3: MISSING => Dependency tnftp-20130505~ssl already installed ERROR: ====================================================================== ERROR: Missing system packages required for morse-ros-1.4: ERROR: ERROR: py36-yaml>=3 ERROR: ERROR: Please use the system package management tool to install these ERROR: dependencies. If a robotpkg version of a dependency is available, ERROR: you can configure robotpkg.conf to use this version instead. ERROR: ERROR: See /local/robotpkg/var/tmp/robotpkg/wip/morse-ros/work/sysdep.log for details. ERROR: ====================================================================== make[2]: *** [/local/robotpkg/var/lib/robotpkg/mk/depends/sysdep.mk:35: sys-depends] Error 2 ===> Logging bulk summary for morse-ros-1.4 => Checking leftover files => Creating bulk log files => Logging bulk metadata ===> Cleaning temporary files for morse-ros-1.4 ===> Done bulk for morse-ros-1.4 [1%] Processing wip/vnet-yarp:vnet-yarp-0.2r2 ===> Cleaning temporary files for vnet-yarp-0.2r2 ===> Bulk building for vnet-yarp-0.2r2 => Checking for clear installation => Installing digest-20080510.tgz => Installing tnftp-20130505~ssl.tgz => Required robotpkg package digest>=20080510: digest-20080510 found => Required robotpkg package tnftp>=20091122: tnftp-20130505~ssl found => Required system package gzip: gzip-1.8 found => Required system package patch>=2.0: patch-2.7.5 found => Required system package pax and tar archivers: pax found => Required system package pkg_install>=20110805.7: pkg_install-20110805.7 found => Installing ace-6.4.6.tgz => Dependency digest-20080510 already installed => Dependency tnftp-20130505~ssl already installed => Installing yarp-2.3.64r3~gui.tgz => Building with no option. => Use the GNU C++ compiler: c++-compiler provided by g++>=3 => Use the GNU C compiler: c-compiler provided by gcc>=3 => Required system package boost-headers>=1.34.1: boost-headers-1.63 found => Required system package boostlib-filesystem>=1.43: boost-libs-1.63.0 found => Required system package boostlib-iostreams>=1.43: boost-libs-1.63.0 found => Required system package boostlib-math>=1.43: boost-libs-1.63.0 found => Required system package boostlib-thread>=1.43: boost-libs-1.63.0 found => Required system package cmake>=2.6: cmake-3.10.1 found => Required system package g++>=3: g++-7 found => Required system package gcc>=3: gcc-7 found => Required system package libstdc++: libstdc++ found => Required system package pkg-config>=0.22: pkg-config-1.3.12 found => Required robotpkg package ace>=5.6: ace-6.4.6 found => Required robotpkg package yarp>=2.3.1: yarp-2.3.64r3~gui found => SHA1 checksums OK => RMD160 checksums OK => Applying robotpkg patches for vnet-yarp-0.2r2 An unexpected error occured. The last 10 log lines are shown below. | /usr/bin/cmake -E cmake_link_script CMakeFiles/vnet.dir/link.txt --verbose=1 | /usr/bin/g++ -pipe -O3 -DNDEBUG -rdynamic CMakeFiles/vnet.dir/src/vnet_yarp.cc.o -o vnet -Wl,-rpath,/opt/openrobots/lib: libvnet_yarp.a /opt/openrobots/lib/libYARP_dev.so.2.3.64 /opt/openrobots/lib/libYARP_name.so.2.3.64 /opt/openrobots/lib/libYARP_init.so.2.3.64 -lboost_system -lboost_thread -lboost_program_options -lboost_chrono -lboost_date_time -lboost_atomic /opt/openrobots/lib/libYARP_sig.so.2.3.64 /opt/openrobots/lib/libYARP_OS.so.2.3.64 | /usr/bin/ld: libvnet_yarp.a(vnet_morse.cc.o): undefined reference to symbol 'pthread_create@@GLIBC_2.2.5' | //usr/lib64/libpthread.so.0: error adding symbols: DSO missing from command line | collect2: error: ld returned 1 exit status | make[2]: *** [CMakeFiles/vnet.dir/build.make:110: vnet] Error 1 | make[1]: *** [CMakeFiles/Makefile2:145: CMakeFiles/vnet.dir/all] Error 2 | make: *** [Makefile:144: all] Error 2 | make[2]: Leaving directory '/local/robotpkg/var/tmp/robotpkg/wip/vnet-yarp/work/vnet-yarp-0.2' | make[1]: Leaving directory '/local/robotpkg/var/tmp/robotpkg/wip/vnet-yarp/work/vnet-yarp-0.2' For details or bug reports, check the complete log file in: /local/robotpkg/var/tmp/robotpkg/wip/vnet-yarp/work/build.log make[3]: *** [/local/robotpkg/var/lib/robotpkg/mk/build/build.mk:197: do-build] Error 2 make[2]: *** [/local/robotpkg/var/lib/robotpkg/mk/pkg/package.mk:42: pkg-check-installed] Error 2 => Marking vnet-yarp-0.2r2 as broken ERROR: make: *** [package] Error 2 ===> Logging bulk summary for vnet-yarp-0.2r2 => Checking leftover files => Creating bulk log files => Logging bulk metadata ===> Cleaning temporary files for vnet-yarp-0.2r2 ===> Done bulk for vnet-yarp-0.2r2 [2%] Processing wip/orocos-bfl:orocos-bfl-0.8.0 ===> Cleaning temporary files for orocos-bfl-0.8.0 ===> Bulk building for orocos-bfl-0.8.0 => Checking for clear installation => Installing digest-20080510.tgz => Installing tnftp-20130505~ssl.tgz => Required robotpkg package digest>=20080510: digest-20080510 found => Required robotpkg package tnftp>=20091122: tnftp-20130505~ssl found => Required system package gzip: gzip-1.8 found => Required system package pax and tar archivers: pax found => Required system package pkg_install>=20110805.7: pkg_install-20110805.7 found => Dependency digest-20080510 already installed => Dependency tnftp-20130505~ssl already installed => Building with no option. => Use the GNU C++ compiler: c++-compiler provided by g++>=3 => Use the GNU C compiler: c-compiler provided by gcc>=3 => Required system package boost-headers>=1.46.1: boost-headers-1.63 found => Required system package boostlib-filesystem>=1.46.1: boost-libs-1.63.0 found => Required system package boostlib-iostreams>=1.46.1: boost-libs-1.63.0 found => Required system package boostlib-math>=1.46.1: boost-libs-1.63.0 found => Required system package boostlib-thread>=1.46.1: boost-libs-1.63.0 found => Required system package cmake>=2.6: cmake-3.10.1 found => Required system package cppunit>=1: cppunit-1.13.2 found => Required system package g++>=3: g++-7 found => Required system package gcc>=3: gcc-7 found => Required system package libstdc++: libstdc++ found => Required system package pkg-config>=0.22: pkg-config-1.3.12 found => SHA1 checksums OK => RMD160 checksums OK => Adding run-time search paths to pkg-config files => Registering installation for orocos-bfl-0.8.0 => Linking package in /opt/robotpkg/var/lib/robotpkg/packages/bsd/Fedora-26-x86_64/pub ===> Logging bulk summary for orocos-bfl-0.8.0 => Checking leftover files => Creating bulk log files => Logging bulk metadata ===> Cleaning temporary files for orocos-bfl-0.8.0 ===> Done bulk for orocos-bfl-0.8.0 [2%] Processing wip/histodet:histodet-1.0r2 ===> Cleaning temporary files for histodet-1.0r2 ===> Bulk building for histodet-1.0r2 => Checking for clear installation => Installing digest-20080510.tgz => Installing tnftp-20130505~ssl.tgz => Required robotpkg package digest>=20080510: digest-20080510 found => Required robotpkg package tnftp>=20091122: tnftp-20130505~ssl found => Required system package gzip: gzip-1.8 found => Required system package pax and tar archivers: pax found => Required system package pkg_install>=20110805.7: pkg_install-20110805.7 found => Dependency digest-20080510 already installed => Dependency tnftp-20130505~ssl already installed => Building with no option. => Use the GNU C++ compiler: c++-compiler provided by g++>=3 => Use the GNU C compiler: c-compiler provided by gcc>=3 => Required system package cmake>=2.6: cmake-3.10.1 found => Required system package g++>=3: g++-7 found => Required system package gcc>=3: gcc-7 found => Required system package libstdc++: libstdc++ found => Required system package opencv>=2.2.0: opencv-3.2.0 found => SHA1 checksums OK => RMD160 checksums OK => Registering installation for histodet-1.0r2 => Linking package in /opt/robotpkg/var/lib/robotpkg/packages/bsd/Fedora-26-x86_64/pub ===> Logging bulk summary for histodet-1.0r2 => Checking leftover files => Creating bulk log files => Logging bulk metadata ===> Cleaning temporary files for histodet-1.0r2 ===> Done bulk for histodet-1.0r2 [3%] Processing wip/mumps:mumps-4.10.0 ===> Cleaning temporary files for mumps-4.10.0 ===> Bulk building for mumps-4.10.0 => Checking for clear installation => Installing digest-20080510.tgz => Installing tnftp-20130505~ssl.tgz => Required robotpkg package digest>=20080510: digest-20080510 found => Required robotpkg package tnftp>=20091122: tnftp-20130505~ssl found => Required system package gzip: gzip-1.8 found => Required system package patch>=2.0: patch-2.7.5 found => Required system package pax and tar archivers: pax found => Required system package pkg_install>=20110805.7: pkg_install-20110805.7 found => Dependency digest-20080510 already installed => Dependency tnftp-20130505~ssl already installed => Building with no option. => Use the GNU C++ compiler: c++-compiler provided by g++>=3 => Use the GNU C compiler: c-compiler provided by gcc>=3 => Use the GNU fortran compiler: fortran-compiler provided by => Required system package autoconf>=2.59: autoconf-2.69 found => Required system package automake>=1.8: automake-1.15 found => Required system package g++>=3: g++-7 found => Required system package gcc>=3: gcc-7 found => Required system package gcc-fortran>=4: gcc-fortran-7 found => Required system package gm4>=1.4: gm4-1.4.18 found => Required system package lapack: lapack found => Required system package libstdc++: libstdc++ found => SHA1 checksums OK => RMD160 checksums OK => Applying robotpkg patches for mumps-4.10.0 => Running autoreconf in /local/robotpkg/var/tmp/robotpkg/wip/mumps/work => Modifying GNU configure scripts to avoid --recheck => Registering installation for mumps-4.10.0 => Linking package in /opt/robotpkg/var/lib/robotpkg/packages/bsd/Fedora-26-x86_64/pub ===> Logging bulk summary for mumps-4.10.0 => Checking leftover files => Creating bulk log files => Logging bulk metadata ===> Cleaning temporary files for mumps-4.10.0 ===> Done bulk for mumps-4.10.0 [3%] Processing wip/py-eigen:eigenpy-1.4.0r2 ===> Cleaning temporary files for eigenpy-1.4.0r2 ===> Bulk building for eigenpy-1.4.0r2 => Checking for clear installation => Installing digest-20080510.tgz => Installing tnftp-20130505~ssl.tgz => Required robotpkg package digest>=20080510: digest-20080510 found => Required robotpkg package tnftp>=20091122: tnftp-20130505~ssl found => Required system package gzip: gzip-1.8 found => Required system package patch>=2.0: patch-2.7.5 found => Required system package pax and tar archivers: pax found => Required system package pkg_install>=20110805.7: pkg_install-20110805.7 found => Dependency digest-20080510 already installed => Dependency tnftp-20130505~ssl already installed => Building with no option. => Use the GNU C++ compiler: c++-compiler provided by g++>=3 => Use the GNU C compiler: c-compiler provided by gcc>=3 => Use python-2.7: python>=2.5<3.7 python<3 provided by python27>=2.7<2.8 => Required system package boost-headers>=1.34.1: boost-headers-1.63 found => Required system package boostlib-python>=1.34.1: boost-libs-1.63.0 found => Required system package cmake>=2.6: cmake-3.10.1 found => Required system package doxygen>=1.5: doxygen-1.8.13 found => Required system package eigen3>=3.0.0: eigen3-3.3.4 found => Required system package g++>=3: g++-7 found => Required system package gcc>=3: gcc-7 found => Required system package libstdc++: libstdc++ found => Required system package pkg-config>=0.22: pkg-config-1.3.12 found => Required system package py27-numpy>=1: py27-numpy-1.12.1 found => Required system package python27>=2.7<2.8: python27-2.7.14 found => SHA1 checksums OK => RMD160 checksums OK => Applying robotpkg patches for eigenpy-1.4.0r2 => Adding run-time search paths to pkg-config files => Compiling python files => Registering installation for eigenpy-1.4.0r2 => Linking package in /opt/robotpkg/var/lib/robotpkg/packages/bsd/Fedora-26-x86_64/pub ===> Logging bulk summary for eigenpy-1.4.0r2 => Checking leftover files => Creating bulk log files => Logging bulk metadata ===> Cleaning temporary files for eigenpy-1.4.0r2 ===> Done bulk for eigenpy-1.4.0r2 [4%] Processing wip/py-hla:py36-hla-1.1.1r1 ===> Cleaning temporary files for py36-hla-1.1.1r1 ===> Bulk building for py36-hla-1.1.1r1 => Checking for clear installation => Installing digest-20080510.tgz => Installing tnftp-20130505~ssl.tgz => Required robotpkg package digest>=20080510: digest-20080510 found => Required robotpkg package tnftp>=20091122: tnftp-20130505~ssl found => Required system package gzip: gzip-1.8 found => Required system package patch>=2.0: patch-2.7.5 found => Required system package pax and tar archivers: pax found => Required system package pkg_install>=20110805.7: pkg_install-20110805.7 found => Installing certi-3.5.1.tgz => Dependency digest-20080510 already installed => Dependency tnftp-20130505~ssl already installed => Building with no option. => Use the GNU C++ compiler: c++-compiler provided by g++>=3 => Use the GNU C compiler: c-compiler provided by gcc>=3 => Use python-3.6: python>=2.5<3.7 provided by python36>=3.6<3.7 => Required system package cmake>=2.6: cmake-3.10.1 found => Required system package g++>=3: g++-7 found => Required system package gcc>=3: gcc-7 found => Required system package libstdc++: libstdc++ found => Required system package python36>=3.6<3.7: python36-3.6.4 found => Required robotpkg package certi>=3.4.0: certi-3.5.1 found => SHA1 checksums OK => RMD160 checksums OK => Applying robotpkg patches for py36-hla-1.1.1r1 => Compiling python files robotpkg_create: can't stat `/opt/openrobots/lib/python3.6/site-packages/hla/__pycache__/__init__.cpython-36.pyo' robotpkg_create: can't stat `/opt/openrobots/lib/python3.6/site-packages/hla/omt/__pycache__/__init__.cpython-36.pyo' robotpkg_create: can't stat `/opt/openrobots/lib/python3.6/site-packages/hla/omt/__pycache__/array.cpython-36.pyo' robotpkg_create: can't stat `/opt/openrobots/lib/python3.6/site-packages/hla/omt/__pycache__/basic.cpython-36.pyo' robotpkg_create: can't stat `/opt/openrobots/lib/python3.6/site-packages/hla/omt/__pycache__/enumerated.cpython-36.pyo' robotpkg_create: can't stat `/opt/openrobots/lib/python3.6/site-packages/hla/omt/__pycache__/record.cpython-36.pyo' robotpkg_create: can't stat `/opt/openrobots/lib/python3.6/site-packages/hla/rti/__pycache__/__init__.cpython-36.pyo' => Registering installation for py36-hla-1.1.1r1 robotpkg_admin: py36-hla-1.1.1r1: File `/opt/openrobots/lib/python3.6/site-packages/hla/__pycache__/__init__.cpython-36.pyo' is in +CONTENTS but not on filesystem! robotpkg_admin: py36-hla-1.1.1r1: File `/opt/openrobots/lib/python3.6/site-packages/hla/omt/__pycache__/__init__.cpython-36.pyo' is in +CONTENTS but not on filesystem! robotpkg_admin: py36-hla-1.1.1r1: File `/opt/openrobots/lib/python3.6/site-packages/hla/omt/__pycache__/array.cpython-36.pyo' is in +CONTENTS but not on filesystem! robotpkg_admin: py36-hla-1.1.1r1: File `/opt/openrobots/lib/python3.6/site-packages/hla/omt/__pycache__/basic.cpython-36.pyo' is in +CONTENTS but not on filesystem! robotpkg_admin: py36-hla-1.1.1r1: File `/opt/openrobots/lib/python3.6/site-packages/hla/omt/__pycache__/enumerated.cpython-36.pyo' is in +CONTENTS but not on filesystem! robotpkg_admin: py36-hla-1.1.1r1: File `/opt/openrobots/lib/python3.6/site-packages/hla/omt/__pycache__/record.cpython-36.pyo' is in +CONTENTS but not on filesystem! robotpkg_admin: py36-hla-1.1.1r1: File `/opt/openrobots/lib/python3.6/site-packages/hla/rti/__pycache__/__init__.cpython-36.pyo' is in +CONTENTS but not on filesystem! robotpkg_create: can't stat `/opt/openrobots/lib/python3.6/site-packages/hla/__pycache__/__init__.cpython-36.pyo' robotpkg_create: can't stat `/opt/openrobots/lib/python3.6/site-packages/hla/omt/__pycache__/__init__.cpython-36.pyo' robotpkg_create: can't stat `/opt/openrobots/lib/python3.6/site-packages/hla/omt/__pycache__/array.cpython-36.pyo' robotpkg_create: can't stat `/opt/openrobots/lib/python3.6/site-packages/hla/omt/__pycache__/basic.cpython-36.pyo' robotpkg_create: can't stat `/opt/openrobots/lib/python3.6/site-packages/hla/omt/__pycache__/enumerated.cpython-36.pyo' robotpkg_create: can't stat `/opt/openrobots/lib/python3.6/site-packages/hla/omt/__pycache__/record.cpython-36.pyo' robotpkg_create: can't stat `/opt/openrobots/lib/python3.6/site-packages/hla/rti/__pycache__/__init__.cpython-36.pyo' robotpkg_create: lstat failed for file lib/python3.6/site-packages/hla/__pycache__/__init__.cpython-36.pyo: No such file or directory make[2]: *** [/local/robotpkg/var/lib/robotpkg/mk/pkg/package.mk:74: pkg-tarup] Error 2 => Marking py36-hla-1.1.1r1 as broken ERROR: make: *** [package] Error 2 robotpkg_delete: Couldn't remove /opt/openrobots/lib/python3.6/site-packages/hla/__pycache__/__init__.cpython-36.pyo robotpkg_delete: Couldn't remove /opt/openrobots/lib/python3.6/site-packages/hla/omt/__pycache__/__init__.cpython-36.pyo robotpkg_delete: Couldn't remove /opt/openrobots/lib/python3.6/site-packages/hla/omt/__pycache__/array.cpython-36.pyo robotpkg_delete: Couldn't remove /opt/openrobots/lib/python3.6/site-packages/hla/omt/__pycache__/basic.cpython-36.pyo robotpkg_delete: Couldn't remove /opt/openrobots/lib/python3.6/site-packages/hla/omt/__pycache__/enumerated.cpython-36.pyo robotpkg_delete: Couldn't remove /opt/openrobots/lib/python3.6/site-packages/hla/omt/__pycache__/record.cpython-36.pyo robotpkg_delete: Couldn't remove /opt/openrobots/lib/python3.6/site-packages/hla/rti/__pycache__/__init__.cpython-36.pyo ===> Logging bulk summary for py36-hla-1.1.1r1 => Checking leftover files => Creating bulk log files => Logging bulk metadata ===> Cleaning temporary files for py36-hla-1.1.1r1 ===> Done bulk for py36-hla-1.1.1r1 [4%] Processing wip/py-hla:py27-hla-1.1.1r1 ===> Cleaning temporary files for py27-hla-1.1.1r1 ===> Bulk building for py27-hla-1.1.1r1 => Checking for clear installation => Installing digest-20080510.tgz => Installing tnftp-20130505~ssl.tgz => Required robotpkg package digest>=20080510: digest-20080510 found => Required robotpkg package tnftp>=20091122: tnftp-20130505~ssl found => Required system package gzip: gzip-1.8 found => Required system package patch>=2.0: patch-2.7.5 found => Required system package pax and tar archivers: pax found => Required system package pkg_install>=20110805.7: pkg_install-20110805.7 found => Installing certi-3.5.1.tgz => Dependency digest-20080510 already installed => Dependency tnftp-20130505~ssl already installed => Building with no option. => Use the GNU C++ compiler: c++-compiler provided by g++>=3 => Use the GNU C compiler: c-compiler provided by gcc>=3 => Use python-2.7: python>=2.5<3.7 provided by python27>=2.7<2.8 => Required system package cmake>=2.6: cmake-3.10.1 found => Required system package g++>=3: g++-7 found => Required system package gcc>=3: gcc-7 found => Required system package libstdc++: libstdc++ found => Required system package python27>=2.7<2.8: python27-2.7.14 found => Required robotpkg package certi>=3.4.0: certi-3.5.1 found => SHA1 checksums OK => RMD160 checksums OK => Applying robotpkg patches for py27-hla-1.1.1r1 => Compiling python files => Registering installation for py27-hla-1.1.1r1 => Linking package in /opt/robotpkg/var/lib/robotpkg/packages/bsd/Fedora-26-x86_64/pub ===> Logging bulk summary for py27-hla-1.1.1r1 => Checking leftover files => Creating bulk log files => Logging bulk metadata ===> Cleaning temporary files for py27-hla-1.1.1r1 ===> Done bulk for py27-hla-1.1.1r1 [5%] Processing wip/py-morse:py36-morse-1.4 ===> Cleaning temporary files for py36-morse-1.4 ===> Bulk building for py36-morse-1.4 => Checking for clear installation => Installing digest-20080510.tgz => Installing tnftp-20130505~ssl.tgz => Required robotpkg package digest>=20080510: digest-20080510 found => Required robotpkg package tnftp>=20091122: tnftp-20130505~ssl found => Required system package gzip: gzip-1.8 found => Required system package pax and tar archivers: pax found => Required system package pkg_install>=20110805.7: pkg_install-20110805.7 found => Dependency digest-20080510 already installed => Dependency tnftp-20130505~ssl already installed => Building with no option. => Use the GNU C++ compiler: c++-compiler provided by g++>=3 => Use the GNU C compiler: c-compiler provided by gcc>=3 => Use python-3.6: python>=3.2 provided by python36>=3.6<3.7 => Required system package cmake>=2.6: cmake-3.10.1 found => Required system package g++>=3: g++-7 found => Required system package gcc>=3: gcc-7 found => Required system package libstdc++: libstdc++ found => Required system package python36>=3.6<3.7: python36-3.6.4 found => SHA1 checksums OK => RMD160 checksums OK => Compiling python files => Registering installation for py36-morse-1.4 => Linking package in /opt/robotpkg/var/lib/robotpkg/packages/bsd/Fedora-26-x86_64/pub ===> Logging bulk summary for py36-morse-1.4 => Checking leftover files => Creating bulk log files => Logging bulk metadata ===> Cleaning temporary files for py36-morse-1.4 ===> Done bulk for py36-morse-1.4 [5%] Processing wip/hrp2-machine:hrp2-machine-1.0.2 ===> Cleaning temporary files for hrp2-machine-1.0.2 ===> Bulk building for hrp2-machine-1.0.2 => Checking for clear installation => Installing digest-20080510.tgz => Installing tnftp-20130505~ssl.tgz => Required robotpkg package digest>=20080510: digest-20080510 found => Required robotpkg package tnftp>=20091122: tnftp-20130505~ssl found => Required system package gzip: gzip-1.8 found => Required system package pax and tar archivers: pax found => Required system package pkg_install>=20110805.7: pkg_install-20110805.7 found => Dependency digest-20080510 already installed => Installing ros-catkin-0.6.9r2.tgz => Installing ros-comm-1.11.20.tgz => Installing ros-common-msgs-1.11.4.tgz => Dependency ros-std-msgs-0.5.9 already installed => Dependency tnftp-20130505~ssl already installed => Building with no option. => Use the GNU C++ compiler: c++-compiler provided by g++>=3 => Use the GNU C compiler: c-compiler provided by gcc>=3 => Use python-2.7: python>=2.5<3.7 provided by python27>=2.7<2.8 => Use ros indigo: ros>=groovy provided by ros-indigo => Required system package cmake>=2.8.3: cmake-3.10.1 found => Required system package doxygen>=1.5: doxygen-1.8.13 found => Required system package g++>=3: g++-7 found => Required system package gcc>=3: gcc-7 found => Required system package googletest: googletest found => Required system package graphviz>=2: graphviz-2.40.1 found => Required system package libstdc++: libstdc++ found => Required system package pdflatex: pdflatex found => Required system package pkg-config>=0.22: pkg-config-1.3.12 found => Required system package py27-empy>=3: py27-empy-3.3.2 found => Required system package py27-nose>=0.10: py27-nose-1.3.7 found => Required system package python27>=2.7<2.8: python27-2.7.14 found => Required robotpkg package ros-catkin>=0.6<0.7: ros-catkin-0.6.9r2 found => Required robotpkg package ros-comm>=1.11<1.12: ros-comm-1.11.20 found => Required robotpkg package ros-common-msgs>=1.11<1.12: ros-common-msgs-1.11.4 found => Required robotpkg package ros-std-msgs>=0.5: ros-std-msgs-0.5.9 found => SHA1 checksums OK => RMD160 checksums OK => Running PRE-INSTALL script actions => Running POST-INSTALL script actions => Adding run-time search paths to pkg-config files => Compiling python files => Registering installation for hrp2-machine-1.0.2 => Linking package in /opt/robotpkg/var/lib/robotpkg/packages/bsd/Fedora-26-x86_64/jrl WARNING: hrp2-machine-1.0.2 may not be publicly available: WARNING: Redistribution of repackaged binaries not permitted ===> Logging bulk summary for hrp2-machine-1.0.2 => Checking leftover files => Creating bulk log files => Logging bulk metadata ===> Cleaning temporary files for hrp2-machine-1.0.2 ===> Done bulk for hrp2-machine-1.0.2 [5%] Processing wip/lua-rfsm:lua-rfsm-20131212.44fcec2db5r2 ===> Cleaning temporary files for lua-rfsm-20131212.44fcec2db5r2 ===> Bulk building for lua-rfsm-20131212.44fcec2db5r2 => Checking for clear installation => Installing digest-20080510.tgz => Installing tnftp-20130505~ssl.tgz => Required robotpkg package digest>=20080510: digest-20080510 found => Required robotpkg package tnftp>=20091122: tnftp-20130505~ssl found => Required system package git>=1.6: git-2.13.6 found => Required system package gzip: gzip-1.8 found => Required system package pax and tar archivers: pax found => Required system package pkg_install>=20110805.7: pkg_install-20110805.7 found => Dependency digest-20080510 already installed => Dependency tnftp-20130505~ssl already installed => Required system package A BSD-compatible install program: install-sh found => Required system package lua>=5: lua-5.3.4 found => Required system package pax and tar archivers: pax found => SHA1 checksums OK => RMD160 checksums OK => Creating installation directories => Registering installation for lua-rfsm-20131212.44fcec2db5r2 => Linking package in /opt/robotpkg/var/lib/robotpkg/packages/bsd/Fedora-26-x86_64/pub ===> Logging bulk summary for lua-rfsm-20131212.44fcec2db5r2 => Checking leftover files => Creating bulk log files => Logging bulk metadata ===> Cleaning temporary files for lua-rfsm-20131212.44fcec2db5r2 ===> Done bulk for lua-rfsm-20131212.44fcec2db5r2 [6%] Processing wip/MPC:MPC-1.0r2 ===> Cleaning temporary files for MPC-1.0r2 ===> Bulk building for MPC-1.0r2 => Checking for clear installation => Installing digest-20080510.tgz => Installing tnftp-20130505~ssl.tgz => Required robotpkg package digest>=20080510: digest-20080510 found => Required robotpkg package tnftp>=20091122: tnftp-20130505~ssl found => Required system package gzip: gzip-1.8 found => Required system package patch>=2.0: patch-2.7.5 found => Required system package pax and tar archivers: pax found => Required system package pkg_install>=20110805.7: pkg_install-20110805.7 found => Dependency digest-20080510 already installed => Dependency tnftp-20130505~ssl already installed => Building with no option. => Use the GNU C++ compiler: c++-compiler provided by g++>=3 => Use the GNU C compiler: c-compiler provided by gcc>=3 => Required system package boost-headers>=1.34.1: boost-headers-1.63 found => Required system package boostlib-filesystem>=1.34.1: boost-libs-1.63.0 found => Required system package boostlib-iostreams>=1.34.1: boost-libs-1.63.0 found => Required system package boostlib-math>=1.34.1: boost-libs-1.63.0 found => Required system package boostlib-thread>=1.34.1: boost-libs-1.63.0 found => Required system package cmake>=2.6: cmake-3.10.1 found => Required system package freeglut: freeglut found => Required system package g++>=3: g++-7 found => Required system package gcc>=3: gcc-7 found => Required system package glib2>=2.20: glib2-2.52.3 found => Required system package glu>=7: glu-9.0.0 found => Required system package libX11>=1: libX11-1.6.5 found => Required system package libstdc++: libstdc++ found => Required system package mesa>=6.5: mesa-17.2.4 found => Required system package pkg-config>=0.22: pkg-config-1.3.12 found => SHA1 checksums OK => RMD160 checksums OK => Applying robotpkg patches for MPC-1.0r2 An unexpected error occured. The last 10 log lines are shown below. | /local/robotpkg/var/tmp/robotpkg/wip/MPC/work/MPC-1.0/MPC/core/./trajGen/inc/TrajGen.hpp: At global scope: | /local/robotpkg/var/tmp/robotpkg/wip/MPC/work/MPC-1.0/MPC/core/./trajGen/inc/TrajGen.hpp:90:25: error: 'constexpr' needed for in-class initialization of static data member 'const double mpc::TrajGen::E' of non-integral type [-fpermissive] | static const double E = 0.000000001; /**< small value for computation of the derivatives by finite differences */ | ^ | /local/robotpkg/var/tmp/robotpkg/wip/MPC/work/MPC-1.0/MPC/core/./trajGen/inc/TrajGen.hpp:91:25: error: 'constexpr' needed for in-class initialization of static data member 'const double mpc::TrajGen::UnSurE' of non-integral type [-fpermissive] | static const double UnSurE = 1000000000.0; /**< great value for computation of the derivatives by finite differences */ | ^~~~~~ | make[2]: *** [core/CMakeFiles/MPC-core.dir/build.make:1791: core/CMakeFiles/MPC-core.dir/planner/src/RoadMapTP.cpp.o] Error 1 | make[1]: *** [CMakeFiles/Makefile2:136: core/CMakeFiles/MPC-core.dir/all] Error 2 | make: *** [Makefile:130: all] Error 2 For details or bug reports, check the complete log file in: => Marking MPC-1.0r2 as broken /local/robotpkg/var/tmp/robotpkg/wip/MPC/work/build.log make[3]: *** [/local/robotpkg/var/lib/robotpkg/mk/build/build.mk:197: do-build] Error 2 make[2]: *** [/local/robotpkg/var/lib/robotpkg/mk/pkg/package.mk:42: pkg-check-installed] Error 2 ERROR: make: *** [package] Error 2 ===> Logging bulk summary for MPC-1.0r2 => Checking leftover files => Creating bulk log files => Logging bulk metadata ===> Cleaning temporary files for MPC-1.0r2 ===> Done bulk for MPC-1.0r2 [6%] Processing wip/py-mavlink:py27-mavlink-1.1.62 ===> Cleaning temporary files for py27-mavlink-1.1.62 ===> Bulk building for py27-mavlink-1.1.62 => Checking for clear installation => Installing digest-20080510.tgz => Installing tnftp-20130505~ssl.tgz => Required robotpkg package digest>=20080510: digest-20080510 found => Required robotpkg package tnftp>=20091122: tnftp-20130505~ssl found => Required system package git>=1.6: git-2.13.6 found => Required system package gzip: gzip-1.8 found => Required system package pax and tar archivers: pax found => Required system package pkg_install>=20110805.7: pkg_install-20110805.7 found => Dependency digest-20080510 already installed => Dependency tnftp-20130505~ssl already installed => Building with no option. => Use the GNU C compiler: c-compiler provided by gcc>=3 => Use python-2.7: python>=2.5<3.7 provided by python27>=2.7<2.8 => Required system package gcc>=3: gcc-7 found => Required system package python27>=2.7<2.8: python27-2.7.14 found => SHA1 checksums OK => RMD160 checksums OK => Compiling python files => Registering installation for py27-mavlink-1.1.62 => Linking package in /opt/robotpkg/var/lib/robotpkg/packages/bsd/Fedora-26-x86_64/pub robotpkg_delete: Directory `/opt/openrobots/share/mavlink' disappeared, skipping ===> Logging bulk summary for py27-mavlink-1.1.62 => Checking leftover files => Creating bulk log files => Logging bulk metadata ===> Cleaning temporary files for py27-mavlink-1.1.62 ===> Done bulk for py27-mavlink-1.1.62 [7%] Processing wip/py-mavlink:py36-mavlink-1.1.62 ===> Cleaning temporary files for py36-mavlink-1.1.62 ===> Bulk building for py36-mavlink-1.1.62 => Checking for clear installation => Installing digest-20080510.tgz => Installing tnftp-20130505~ssl.tgz => Required robotpkg package digest>=20080510: digest-20080510 found => Required robotpkg package tnftp>=20091122: tnftp-20130505~ssl found => Required system package git>=1.6: git-2.13.6 found => Required system package gzip: gzip-1.8 found => Required system package pax and tar archivers: pax found => Required system package pkg_install>=20110805.7: pkg_install-20110805.7 found => Dependency digest-20080510 already installed => Dependency tnftp-20130505~ssl already installed => Building with no option. => Use the GNU C compiler: c-compiler provided by gcc>=3 => Use python-3.6: python>=2.5<3.7 provided by python36>=3.6<3.7 => Required system package gcc>=3: gcc-7 found => Required system package python36>=3.6<3.7: python36-3.6.4 found => SHA1 checksums OK => RMD160 checksums OK => Compiling python files File "/opt/openrobots/lib/python3.6/site-packages/pymavlink/generator/lib/genxmlif/__init__.py", line 81 raise AttributeError, "Unknown XML interface: %s" %(xmlIf) ^ SyntaxError: invalid syntax File "/opt/openrobots/lib/python3.6/site-packages/pymavlink/generator/lib/genxmlif/xmlif4Dom.py", line 58 print "Using 4Dom interface module..." ^ SyntaxError: Missing parentheses in call to 'print'. Did you mean print(print "Using 4Dom interface module...")? File "/opt/openrobots/lib/python3.6/site-packages/pymavlink/generator/lib/genxmlif/xmlifApi.py", line 370 raise AttributeError, "Attribute %s not found!" %(repr(tupleOrAttrName)) ^ SyntaxError: invalid syntax File "/opt/openrobots/lib/python3.6/site-packages/pymavlink/generator/lib/genxmlif/xmlifDom.py", line 69 print "Xinclude: %s" %href ^ SyntaxError: Missing parentheses in call to 'print'. Did you mean print(print "Xinclude: %s" %href)? File "/opt/openrobots/lib/python3.6/site-packages/pymavlink/generator/lib/genxmlif/xmlifElementTree.py", line 72 print "Using elementtree interface module..." ^ SyntaxError: Missing parentheses in call to 'print'. Did you mean print(print "Using elementtree interface module...")? File "/opt/openrobots/lib/python3.6/site-packages/pymavlink/generator/lib/genxmlif/xmlifMinidom.py", line 63 print "Using minidom interface module..." ^ SyntaxError: Missing parentheses in call to 'print'. Did you mean print(print "Using minidom interface module...")? File "/opt/openrobots/lib/python3.6/site-packages/pymavlink/generator/lib/genxmlif/xmlifUtils.py", line 193 raise LookupError, "Prefix for namespaceURI '%s' not found!" % (ns) ^ SyntaxError: invalid syntax File "/opt/openrobots/lib/python3.6/site-packages/pymavlink/generator/lib/genxmlif/xmliftest.py", line 12 print xmlTree.printTree(prettyPrint=1) ^ SyntaxError: invalid syntax File "/opt/openrobots/lib/python3.6/site-packages/pymavlink/generator/lib/minixsv/minixsvWrapper.py", line 36 print validSyntaxText ^ SyntaxError: Missing parentheses in call to 'print'. Did you mean print(print validSyntaxText)? File "/opt/openrobots/lib/python3.6/site-packages/pymavlink/generator/lib/minixsv/pyxsval.py", line 93 raise KeyError, "xmlIfKey %s already implemented!" %(xmlIfKey) ^ SyntaxError: invalid syntax File "/opt/openrobots/lib/python3.6/site-packages/pymavlink/generator/lib/minixsv/xsvalBase.py", line 135 except TagException, errInst: ^ SyntaxError: invalid syntax File "/opt/openrobots/lib/python3.6/site-packages/pymavlink/generator/lib/minixsv/xsvalErrorHandler.py", line 122 print string.join (self.infoDict.keys(), "n") ^ SyntaxError: invalid syntax File "/opt/openrobots/lib/python3.6/site-packages/pymavlink/generator/lib/minixsv/xsvalSchema.py", line 431 except TagException, errInst: ^ SyntaxError: invalid syntax File "/opt/openrobots/lib/python3.6/site-packages/pymavlink/generator/lib/minixsv/xsvalSimpleTypes.py", line 78 except BaseTypeError, errstr: ^ SyntaxError: invalid syntax File "/opt/openrobots/lib/python3.6/site-packages/pymavlink/generator/lib/minixsv/xsvalUtils.py", line 48 r"Cc" : ur"x00-x1fx7f-x9f", ^ SyntaxError: invalid syntax File "/opt/openrobots/lib/python3.6/site-packages/pymavlink/generator/lib/genxmlif/__init__.py", line 81 raise AttributeError, "Unknown XML interface: %s" %(xmlIf) ^ SyntaxError: invalid syntax File "/opt/openrobots/lib/python3.6/site-packages/pymavlink/generator/lib/genxmlif/xmlif4Dom.py", line 58 print "Using 4Dom interface module..." ^ SyntaxError: Missing parentheses in call to 'print'. Did you mean print(print "Using 4Dom interface module...")? File "/opt/openrobots/lib/python3.6/site-packages/pymavlink/generator/lib/genxmlif/xmlifApi.py", line 370 raise AttributeError, "Attribute %s not found!" %(repr(tupleOrAttrName)) ^ SyntaxError: invalid syntax File "/opt/openrobots/lib/python3.6/site-packages/pymavlink/generator/lib/genxmlif/xmlifDom.py", line 69 print "Xinclude: %s" %href ^ SyntaxError: Missing parentheses in call to 'print'. Did you mean print(print "Xinclude: %s" %href)? File "/opt/openrobots/lib/python3.6/site-packages/pymavlink/generator/lib/genxmlif/xmlifElementTree.py", line 72 print "Using elementtree interface module..." ^ SyntaxError: Missing parentheses in call to 'print'. Did you mean print(print "Using elementtree interface module...")? File "/opt/openrobots/lib/python3.6/site-packages/pymavlink/generator/lib/genxmlif/xmlifMinidom.py", line 63 print "Using minidom interface module..." ^ SyntaxError: Missing parentheses in call to 'print'. Did you mean print(print "Using minidom interface module...")? File "/opt/openrobots/lib/python3.6/site-packages/pymavlink/generator/lib/genxmlif/xmlifUtils.py", line 193 raise LookupError, "Prefix for namespaceURI '%s' not found!" % (ns) ^ SyntaxError: invalid syntax File "/opt/openrobots/lib/python3.6/site-packages/pymavlink/generator/lib/genxmlif/xmliftest.py", line 12 print xmlTree.printTree(prettyPrint=1) ^ SyntaxError: invalid syntax File "/opt/openrobots/lib/python3.6/site-packages/pymavlink/generator/lib/minixsv/minixsvWrapper.py", line 36 print validSyntaxText ^ SyntaxError: Missing parentheses in call to 'print'. Did you mean print(print validSyntaxText)? File "/opt/openrobots/lib/python3.6/site-packages/pymavlink/generator/lib/minixsv/pyxsval.py", line 93 raise KeyError, "xmlIfKey %s already implemented!" %(xmlIfKey) ^ SyntaxError: invalid syntax File "/opt/openrobots/lib/python3.6/site-packages/pymavlink/generator/lib/minixsv/xsvalBase.py", line 135 except TagException, errInst: ^ SyntaxError: invalid syntax File "/opt/openrobots/lib/python3.6/site-packages/pymavlink/generator/lib/minixsv/xsvalErrorHandler.py", line 122 print string.join (self.infoDict.keys(), "n") ^ SyntaxError: invalid syntax File "/opt/openrobots/lib/python3.6/site-packages/pymavlink/generator/lib/minixsv/xsvalSchema.py", line 431 except TagException, errInst: ^ SyntaxError: invalid syntax File "/opt/openrobots/lib/python3.6/site-packages/pymavlink/generator/lib/minixsv/xsvalSimpleTypes.py", line 78 except BaseTypeError, errstr: ^ SyntaxError: invalid syntax File "/opt/openrobots/lib/python3.6/site-packages/pymavlink/generator/lib/minixsv/xsvalUtils.py", line 48 r"Cc" : ur"x00-x1fx7f-x9f", ^ SyntaxError: invalid syntax robotpkg_create: can't stat `/opt/openrobots/lib/python3.6/site-packages/mavnative.so' robotpkg_create: can't stat `/opt/openrobots/lib/python3.6/site-packages/pymavlink/generator/lib/genxmlif/__pycache__/__init__.cpython-36.pyc' robotpkg_create: can't stat `/opt/openrobots/lib/python3.6/site-packages/pymavlink/generator/lib/genxmlif/__pycache__/__init__.cpython-36.opt-1.pyc' robotpkg_create: can't stat `/opt/openrobots/lib/python3.6/site-packages/pymavlink/generator/lib/genxmlif/__pycache__/xmlif4Dom.cpython-36.pyc' robotpkg_create: can't stat `/opt/openrobots/lib/python3.6/site-packages/pymavlink/generator/lib/genxmlif/__pycache__/xmlif4Dom.cpython-36.opt-1.pyc' robotpkg_create: can't stat `/opt/openrobots/lib/python3.6/site-packages/pymavlink/generator/lib/genxmlif/__pycache__/xmlifApi.cpython-36.pyc' robotpkg_create: can't stat `/opt/openrobots/lib/python3.6/site-packages/pymavlink/generator/lib/genxmlif/__pycache__/xmlifApi.cpython-36.opt-1.pyc' robotpkg_create: can't stat `/opt/openrobots/lib/python3.6/site-packages/pymavlink/generator/lib/genxmlif/__pycache__/xmlifDom.cpython-36.pyc' robotpkg_create: can't stat `/opt/openrobots/lib/python3.6/site-packages/pymavlink/generator/lib/genxmlif/__pycache__/xmlifDom.cpython-36.opt-1.pyc' robotpkg_create: can't stat `/opt/openrobots/lib/python3.6/site-packages/pymavlink/generator/lib/genxmlif/__pycache__/xmlifElementTree.cpython-36.pyc' robotpkg_create: can't stat `/opt/openrobots/lib/python3.6/site-packages/pymavlink/generator/lib/genxmlif/__pycache__/xmlifElementTree.cpython-36.opt-1.pyc' robotpkg_create: can't stat `/opt/openrobots/lib/python3.6/site-packages/pymavlink/generator/lib/genxmlif/__pycache__/xmlifMinidom.cpython-36.pyc' robotpkg_create: can't stat `/opt/openrobots/lib/python3.6/site-packages/pymavlink/generator/lib/genxmlif/__pycache__/xmlifMinidom.cpython-36.opt-1.pyc' robotpkg_create: can't stat `/opt/openrobots/lib/python3.6/site-packages/pymavlink/generator/lib/genxmlif/__pycache__/xmlifUtils.cpython-36.pyc' robotpkg_create: can't stat `/opt/openrobots/lib/python3.6/site-packages/pymavlink/generator/lib/genxmlif/__pycache__/xmlifUtils.cpython-36.opt-1.pyc' robotpkg_create: can't stat `/opt/openrobots/lib/python3.6/site-packages/pymavlink/generator/lib/genxmlif/__pycache__/xmliftest.cpython-36.pyc' robotpkg_create: can't stat `/opt/openrobots/lib/python3.6/site-packages/pymavlink/generator/lib/genxmlif/__pycache__/xmliftest.cpython-36.opt-1.pyc' robotpkg_create: can't stat `/opt/openrobots/lib/python3.6/site-packages/pymavlink/generator/lib/minixsv/__pycache__/minixsvWrapper.cpython-36.pyc' robotpkg_create: can't stat `/opt/openrobots/lib/python3.6/site-packages/pymavlink/generator/lib/minixsv/__pycache__/minixsvWrapper.cpython-36.opt-1.pyc' robotpkg_create: can't stat `/opt/openrobots/lib/python3.6/site-packages/pymavlink/generator/lib/minixsv/__pycache__/pyxsval.cpython-36.pyc' robotpkg_create: can't stat `/opt/openrobots/lib/python3.6/site-packages/pymavlink/generator/lib/minixsv/__pycache__/pyxsval.cpython-36.opt-1.pyc' robotpkg_create: can't stat `/opt/openrobots/lib/python3.6/site-packages/pymavlink/generator/lib/minixsv/__pycache__/xsvalBase.cpython-36.pyc' robotpkg_create: can't stat `/opt/openrobots/lib/python3.6/site-packages/pymavlink/generator/lib/minixsv/__pycache__/xsvalBase.cpython-36.opt-1.pyc' robotpkg_create: can't stat `/opt/openrobots/lib/python3.6/site-packages/pymavlink/generator/lib/minixsv/__pycache__/xsvalErrorHandler.cpython-36.pyc' robotpkg_create: can't stat `/opt/openrobots/lib/python3.6/site-packages/pymavlink/generator/lib/minixsv/__pycache__/xsvalErrorHandler.cpython-36.opt-1.pyc' robotpkg_create: can't stat `/opt/openrobots/lib/python3.6/site-packages/pymavlink/generator/lib/minixsv/__pycache__/xsvalSchema.cpython-36.pyc' robotpkg_create: can't stat `/opt/openrobots/lib/python3.6/site-packages/pymavlink/generator/lib/minixsv/__pycache__/xsvalSchema.cpython-36.opt-1.pyc' robotpkg_create: can't stat `/opt/openrobots/lib/python3.6/site-packages/pymavlink/generator/lib/minixsv/__pycache__/xsvalSimpleTypes.cpython-36.pyc' => Registering installation for py36-mavlink-1.1.62 robotpkg_create: can't stat `/opt/openrobots/lib/python3.6/site-packages/pymavlink/generator/lib/minixsv/__pycache__/xsvalSimpleTypes.cpython-36.opt-1.pyc' robotpkg_create: can't stat `/opt/openrobots/lib/python3.6/site-packages/pymavlink/generator/lib/minixsv/__pycache__/xsvalUtils.cpython-36.pyc' robotpkg_create: can't stat `/opt/openrobots/lib/python3.6/site-packages/pymavlink/generator/lib/minixsv/__pycache__/xsvalUtils.cpython-36.opt-1.pyc' robotpkg_admin: py36-mavlink-1.1.62: File `/opt/openrobots/lib/python3.6/site-packages/mavnative.so' is in +CONTENTS but not on filesystem! robotpkg_admin: py36-mavlink-1.1.62: File `/opt/openrobots/lib/python3.6/site-packages/pymavlink/generator/lib/genxmlif/__pycache__/__init__.cpython-36.pyc' is in +CONTENTS but not on filesystem! robotpkg_admin: py36-mavlink-1.1.62: File `/opt/openrobots/lib/python3.6/site-packages/pymavlink/generator/lib/genxmlif/__pycache__/__init__.cpython-36.opt-1.pyc' is in +CONTENTS but not on filesystem! robotpkg_admin: py36-mavlink-1.1.62: File `/opt/openrobots/lib/python3.6/site-packages/pymavlink/generator/lib/genxmlif/__pycache__/xmlif4Dom.cpython-36.pyc' is in +CONTENTS but not on filesystem! robotpkg_admin: py36-mavlink-1.1.62: File `/opt/openrobots/lib/python3.6/site-packages/pymavlink/generator/lib/genxmlif/__pycache__/xmlif4Dom.cpython-36.opt-1.pyc' is in +CONTENTS but not on filesystem! robotpkg_admin: py36-mavlink-1.1.62: File `/opt/openrobots/lib/python3.6/site-packages/pymavlink/generator/lib/genxmlif/__pycache__/xmlifApi.cpython-36.pyc' is in +CONTENTS but not on filesystem! robotpkg_admin: py36-mavlink-1.1.62: File `/opt/openrobots/lib/python3.6/site-packages/pymavlink/generator/lib/genxmlif/__pycache__/xmlifApi.cpython-36.opt-1.pyc' is in +CONTENTS but not on filesystem! robotpkg_admin: py36-mavlink-1.1.62: File `/opt/openrobots/lib/python3.6/site-packages/pymavlink/generator/lib/genxmlif/__pycache__/xmlifDom.cpython-36.pyc' is in +CONTENTS but not on filesystem! robotpkg_admin: py36-mavlink-1.1.62: File `/opt/openrobots/lib/python3.6/site-packages/pymavlink/generator/lib/genxmlif/__pycache__/xmlifDom.cpython-36.opt-1.pyc' is in +CONTENTS but not on filesystem! robotpkg_admin: py36-mavlink-1.1.62: File `/opt/openrobots/lib/python3.6/site-packages/pymavlink/generator/lib/genxmlif/__pycache__/xmlifElementTree.cpython-36.pyc' is in +CONTENTS but not on filesystem! robotpkg_admin: py36-mavlink-1.1.62: File `/opt/openrobots/lib/python3.6/site-packages/pymavlink/generator/lib/genxmlif/__pycache__/xmlifElementTree.cpython-36.opt-1.pyc' is in +CONTENTS but not on filesystem! robotpkg_admin: py36-mavlink-1.1.62: File `/opt/openrobots/lib/python3.6/site-packages/pymavlink/generator/lib/genxmlif/__pycache__/xmlifMinidom.cpython-36.pyc' is in +CONTENTS but not on filesystem! robotpkg_admin: py36-mavlink-1.1.62: File `/opt/openrobots/lib/python3.6/site-packages/pymavlink/generator/lib/genxmlif/__pycache__/xmlifMinidom.cpython-36.opt-1.pyc' is in +CONTENTS but not on filesystem! robotpkg_admin: py36-mavlink-1.1.62: File `/opt/openrobots/lib/python3.6/site-packages/pymavlink/generator/lib/genxmlif/__pycache__/xmlifUtils.cpython-36.pyc' is in +CONTENTS but not on filesystem! robotpkg_admin: py36-mavlink-1.1.62: File `/opt/openrobots/lib/python3.6/site-packages/pymavlink/generator/lib/genxmlif/__pycache__/xmlifUtils.cpython-36.opt-1.pyc' is in +CONTENTS but not on filesystem! robotpkg_admin: py36-mavlink-1.1.62: File `/opt/openrobots/lib/python3.6/site-packages/pymavlink/generator/lib/genxmlif/__pycache__/xmliftest.cpython-36.pyc' is in +CONTENTS but not on filesystem! robotpkg_admin: py36-mavlink-1.1.62: File `/opt/openrobots/lib/python3.6/site-packages/pymavlink/generator/lib/genxmlif/__pycache__/xmliftest.cpython-36.opt-1.pyc' is in +CONTENTS but not on filesystem! robotpkg_admin: py36-mavlink-1.1.62: File `/opt/openrobots/lib/python3.6/site-packages/pymavlink/generator/lib/minixsv/__pycache__/minixsvWrapper.cpython-36.pyc' is in +CONTENTS but not on filesystem! robotpkg_admin: py36-mavlink-1.1.62: File `/opt/openrobots/lib/python3.6/site-packages/pymavlink/generator/lib/minixsv/__pycache__/minixsvWrapper.cpython-36.opt-1.pyc' is in +CONTENTS but not on filesystem! robotpkg_admin: py36-mavlink-1.1.62: File `/opt/openrobots/lib/python3.6/site-packages/pymavlink/generator/lib/minixsv/__pycache__/pyxsval.cpython-36.pyc' is in +CONTENTS but not on filesystem! robotpkg_admin: py36-mavlink-1.1.62: File `/opt/openrobots/lib/python3.6/site-packages/pymavlink/generator/lib/minixsv/__pycache__/pyxsval.cpython-36.opt-1.pyc' is in +CONTENTS but not on filesystem! robotpkg_admin: py36-mavlink-1.1.62: File `/opt/openrobots/lib/python3.6/site-packages/pymavlink/generator/lib/minixsv/__pycache__/xsvalBase.cpython-36.pyc' is in +CONTENTS but not on filesystem! robotpkg_admin: py36-mavlink-1.1.62: File `/opt/openrobots/lib/python3.6/site-packages/pymavlink/generator/lib/minixsv/__pycache__/xsvalBase.cpython-36.opt-1.pyc' is in +CONTENTS but not on filesystem! robotpkg_admin: py36-mavlink-1.1.62: File `/opt/openrobots/lib/python3.6/site-packages/pymavlink/generator/lib/minixsv/__pycache__/xsvalErrorHandler.cpython-36.pyc' is in +CONTENTS but not on filesystem! robotpkg_admin: py36-mavlink-1.1.62: File `/opt/openrobots/lib/python3.6/site-packages/pymavlink/generator/lib/minixsv/__pycache__/xsvalErrorHandler.cpython-36.opt-1.pyc' is in +CONTENTS but not on filesystem! robotpkg_admin: py36-mavlink-1.1.62: File `/opt/openrobots/lib/python3.6/site-packages/pymavlink/generator/lib/minixsv/__pycache__/xsvalSchema.cpython-36.pyc' is in +CONTENTS but not on filesystem! robotpkg_admin: py36-mavlink-1.1.62: File `/opt/openrobots/lib/python3.6/site-packages/pymavlink/generator/lib/minixsv/__pycache__/xsvalSchema.cpython-36.opt-1.pyc' is in +CONTENTS but not on filesystem! robotpkg_admin: py36-mavlink-1.1.62: File `/opt/openrobots/lib/python3.6/site-packages/pymavlink/generator/lib/minixsv/__pycache__/xsvalSimpleTypes.cpython-36.pyc' is in +CONTENTS but not on filesystem! robotpkg_admin: py36-mavlink-1.1.62: File `/opt/openrobots/lib/python3.6/site-packages/pymavlink/generator/lib/minixsv/__pycache__/xsvalSimpleTypes.cpython-36.opt-1.pyc' is in +CONTENTS but not on filesystem! robotpkg_admin: py36-mavlink-1.1.62: File `/opt/openrobots/lib/python3.6/site-packages/pymavlink/generator/lib/minixsv/__pycache__/xsvalUtils.cpython-36.pyc' is in +CONTENTS but not on filesystem! robotpkg_admin: py36-mavlink-1.1.62: File `/opt/openrobots/lib/python3.6/site-packages/pymavlink/generator/lib/minixsv/__pycache__/xsvalUtils.cpython-36.opt-1.pyc' is in +CONTENTS but not on filesystem! robotpkg_create: can't stat `/opt/openrobots/lib/python3.6/site-packages/mavnative.so' robotpkg_create: can't stat `/opt/openrobots/lib/python3.6/site-packages/pymavlink/generator/lib/genxmlif/__pycache__/__init__.cpython-36.pyc' robotpkg_create: can't stat `/opt/openrobots/lib/python3.6/site-packages/pymavlink/generator/lib/genxmlif/__pycache__/__init__.cpython-36.opt-1.pyc' robotpkg_create: can't stat `/opt/openrobots/lib/python3.6/site-packages/pymavlink/generator/lib/genxmlif/__pycache__/xmlif4Dom.cpython-36.pyc' robotpkg_create: can't stat `/opt/openrobots/lib/python3.6/site-packages/pymavlink/generator/lib/genxmlif/__pycache__/xmlif4Dom.cpython-36.opt-1.pyc' robotpkg_create: can't stat `/opt/openrobots/lib/python3.6/site-packages/pymavlink/generator/lib/genxmlif/__pycache__/xmlifApi.cpython-36.pyc' robotpkg_create: can't stat `/opt/openrobots/lib/python3.6/site-packages/pymavlink/generator/lib/genxmlif/__pycache__/xmlifApi.cpython-36.opt-1.pyc' robotpkg_create: can't stat `/opt/openrobots/lib/python3.6/site-packages/pymavlink/generator/lib/genxmlif/__pycache__/xmlifDom.cpython-36.pyc' robotpkg_create: can't stat `/opt/openrobots/lib/python3.6/site-packages/pymavlink/generator/lib/genxmlif/__pycache__/xmlifDom.cpython-36.opt-1.pyc' robotpkg_create: can't stat `/opt/openrobots/lib/python3.6/site-packages/pymavlink/generator/lib/genxmlif/__pycache__/xmlifElementTree.cpython-36.pyc' robotpkg_create: can't stat `/opt/openrobots/lib/python3.6/site-packages/pymavlink/generator/lib/genxmlif/__pycache__/xmlifElementTree.cpython-36.opt-1.pyc' robotpkg_create: can't stat `/opt/openrobots/lib/python3.6/site-packages/pymavlink/generator/lib/genxmlif/__pycache__/xmlifMinidom.cpython-36.pyc' robotpkg_create: can't stat `/opt/openrobots/lib/python3.6/site-packages/pymavlink/generator/lib/genxmlif/__pycache__/xmlifMinidom.cpython-36.opt-1.pyc' robotpkg_create: can't stat `/opt/openrobots/lib/python3.6/site-packages/pymavlink/generator/lib/genxmlif/__pycache__/xmlifUtils.cpython-36.pyc' robotpkg_create: can't stat `/opt/openrobots/lib/python3.6/site-packages/pymavlink/generator/lib/genxmlif/__pycache__/xmlifUtils.cpython-36.opt-1.pyc' robotpkg_create: can't stat `/opt/openrobots/lib/python3.6/site-packages/pymavlink/generator/lib/genxmlif/__pycache__/xmliftest.cpython-36.pyc' robotpkg_create: can't stat `/opt/openrobots/lib/python3.6/site-packages/pymavlink/generator/lib/genxmlif/__pycache__/xmliftest.cpython-36.opt-1.pyc' robotpkg_create: can't stat `/opt/openrobots/lib/python3.6/site-packages/pymavlink/generator/lib/minixsv/__pycache__/minixsvWrapper.cpython-36.pyc' robotpkg_create: can't stat `/opt/openrobots/lib/python3.6/site-packages/pymavlink/generator/lib/minixsv/__pycache__/minixsvWrapper.cpython-36.opt-1.pyc' robotpkg_create: can't stat `/opt/openrobots/lib/python3.6/site-packages/pymavlink/generator/lib/minixsv/__pycache__/pyxsval.cpython-36.pyc' robotpkg_create: can't stat `/opt/openrobots/lib/python3.6/site-packages/pymavlink/generator/lib/minixsv/__pycache__/pyxsval.cpython-36.opt-1.pyc' robotpkg_create: can't stat `/opt/openrobots/lib/python3.6/site-packages/pymavlink/generator/lib/minixsv/__pycache__/xsvalBase.cpython-36.pyc' robotpkg_create: can't stat `/opt/openrobots/lib/python3.6/site-packages/pymavlink/generator/lib/minixsv/__pycache__/xsvalBase.cpython-36.opt-1.pyc' robotpkg_create: can't stat `/opt/openrobots/lib/python3.6/site-packages/pymavlink/generator/lib/minixsv/__pycache__/xsvalErrorHandler.cpython-36.pyc' robotpkg_create: can't stat `/opt/openrobots/lib/python3.6/site-packages/pymavlink/generator/lib/minixsv/__pycache__/xsvalErrorHandler.cpython-36.opt-1.pyc' robotpkg_create: can't stat `/opt/openrobots/lib/python3.6/site-packages/pymavlink/generator/lib/minixsv/__pycache__/xsvalSchema.cpython-36.pyc' robotpkg_create: can't stat `/opt/openrobots/lib/python3.6/site-packages/pymavlink/generator/lib/minixsv/__pycache__/xsvalSchema.cpython-36.opt-1.pyc' robotpkg_create: can't stat `/opt/openrobots/lib/python3.6/site-packages/pymavlink/generator/lib/minixsv/__pycache__/xsvalSimpleTypes.cpython-36.pyc' robotpkg_create: can't stat `/opt/openrobots/lib/python3.6/site-packages/pymavlink/generator/lib/minixsv/__pycache__/xsvalSimpleTypes.cpython-36.opt-1.pyc' robotpkg_create: can't stat `/opt/openrobots/lib/python3.6/site-packages/pymavlink/generator/lib/minixsv/__pycache__/xsvalUtils.cpython-36.pyc' robotpkg_create: can't stat `/opt/openrobots/lib/python3.6/site-packages/pymavlink/generator/lib/minixsv/__pycache__/xsvalUtils.cpython-36.opt-1.pyc' robotpkg_create: lstat failed for file lib/python3.6/site-packages/mavnative.so: No such file or directory => Marking py36-mavlink-1.1.62 as broken make[2]: *** [/local/robotpkg/var/lib/robotpkg/mk/pkg/package.mk:74: pkg-tarup] Error 2 ERROR: make: *** [package] Error 2 robotpkg_delete: Couldn't remove /opt/openrobots/lib/python3.6/site-packages/mavnative.so robotpkg_delete: Couldn't remove /opt/openrobots/lib/python3.6/site-packages/pymavlink/generator/lib/genxmlif/__pycache__/__init__.cpython-36.pyc robotpkg_delete: Couldn't remove /opt/openrobots/lib/python3.6/site-packages/pymavlink/generator/lib/genxmlif/__pycache__/__init__.cpython-36.opt-1.pyc robotpkg_delete: Couldn't remove /opt/openrobots/lib/python3.6/site-packages/pymavlink/generator/lib/genxmlif/__pycache__/xmlif4Dom.cpython-36.pyc robotpkg_delete: Couldn't remove /opt/openrobots/lib/python3.6/site-packages/pymavlink/generator/lib/genxmlif/__pycache__/xmlif4Dom.cpython-36.opt-1.pyc robotpkg_delete: Couldn't remove /opt/openrobots/lib/python3.6/site-packages/pymavlink/generator/lib/genxmlif/__pycache__/xmlifApi.cpython-36.pyc robotpkg_delete: Couldn't remove /opt/openrobots/lib/python3.6/site-packages/pymavlink/generator/lib/genxmlif/__pycache__/xmlifApi.cpython-36.opt-1.pyc robotpkg_delete: Couldn't remove /opt/openrobots/lib/python3.6/site-packages/pymavlink/generator/lib/genxmlif/__pycache__/xmlifDom.cpython-36.pyc robotpkg_delete: Couldn't remove /opt/openrobots/lib/python3.6/site-packages/pymavlink/generator/lib/genxmlif/__pycache__/xmlifDom.cpython-36.opt-1.pyc robotpkg_delete: Couldn't remove /opt/openrobots/lib/python3.6/site-packages/pymavlink/generator/lib/genxmlif/__pycache__/xmlifElementTree.cpython-36.pyc robotpkg_delete: Couldn't remove /opt/openrobots/lib/python3.6/site-packages/pymavlink/generator/lib/genxmlif/__pycache__/xmlifElementTree.cpython-36.opt-1.pyc robotpkg_delete: Couldn't remove /opt/openrobots/lib/python3.6/site-packages/pymavlink/generator/lib/genxmlif/__pycache__/xmlifMinidom.cpython-36.pyc robotpkg_delete: Couldn't remove /opt/openrobots/lib/python3.6/site-packages/pymavlink/generator/lib/genxmlif/__pycache__/xmlifMinidom.cpython-36.opt-1.pyc robotpkg_delete: Couldn't remove /opt/openrobots/lib/python3.6/site-packages/pymavlink/generator/lib/genxmlif/__pycache__/xmlifUtils.cpython-36.pyc robotpkg_delete: Couldn't remove /opt/openrobots/lib/python3.6/site-packages/pymavlink/generator/lib/genxmlif/__pycache__/xmlifUtils.cpython-36.opt-1.pyc robotpkg_delete: Couldn't remove /opt/openrobots/lib/python3.6/site-packages/pymavlink/generator/lib/genxmlif/__pycache__/xmliftest.cpython-36.pyc robotpkg_delete: Couldn't remove /opt/openrobots/lib/python3.6/site-packages/pymavlink/generator/lib/genxmlif/__pycache__/xmliftest.cpython-36.opt-1.pyc robotpkg_delete: Couldn't remove /opt/openrobots/lib/python3.6/site-packages/pymavlink/generator/lib/minixsv/__pycache__/minixsvWrapper.cpython-36.pyc robotpkg_delete: Couldn't remove /opt/openrobots/lib/python3.6/site-packages/pymavlink/generator/lib/minixsv/__pycache__/minixsvWrapper.cpython-36.opt-1.pyc robotpkg_delete: Couldn't remove /opt/openrobots/lib/python3.6/site-packages/pymavlink/generator/lib/minixsv/__pycache__/pyxsval.cpython-36.pyc robotpkg_delete: Couldn't remove /opt/openrobots/lib/python3.6/site-packages/pymavlink/generator/lib/minixsv/__pycache__/pyxsval.cpython-36.opt-1.pyc robotpkg_delete: Couldn't remove /opt/openrobots/lib/python3.6/site-packages/pymavlink/generator/lib/minixsv/__pycache__/xsvalBase.cpython-36.pyc robotpkg_delete: Couldn't remove /opt/openrobots/lib/python3.6/site-packages/pymavlink/generator/lib/minixsv/__pycache__/xsvalBase.cpython-36.opt-1.pyc robotpkg_delete: Couldn't remove /opt/openrobots/lib/python3.6/site-packages/pymavlink/generator/lib/minixsv/__pycache__/xsvalErrorHandler.cpython-36.pyc robotpkg_delete: Couldn't remove /opt/openrobots/lib/python3.6/site-packages/pymavlink/generator/lib/minixsv/__pycache__/xsvalErrorHandler.cpython-36.opt-1.pyc robotpkg_delete: Couldn't remove /opt/openrobots/lib/python3.6/site-packages/pymavlink/generator/lib/minixsv/__pycache__/xsvalSchema.cpython-36.pyc robotpkg_delete: Couldn't remove /opt/openrobots/lib/python3.6/site-packages/pymavlink/generator/lib/minixsv/__pycache__/xsvalSchema.cpython-36.opt-1.pyc robotpkg_delete: Couldn't remove /opt/openrobots/lib/python3.6/site-packages/pymavlink/generator/lib/minixsv/__pycache__/xsvalSimpleTypes.cpython-36.pyc robotpkg_delete: Couldn't remove /opt/openrobots/lib/python3.6/site-packages/pymavlink/generator/lib/minixsv/__pycache__/xsvalSimpleTypes.cpython-36.opt-1.pyc robotpkg_delete: Couldn't remove /opt/openrobots/lib/python3.6/site-packages/pymavlink/generator/lib/minixsv/__pycache__/xsvalUtils.cpython-36.pyc robotpkg_delete: Couldn't remove /opt/openrobots/lib/python3.6/site-packages/pymavlink/generator/lib/minixsv/__pycache__/xsvalUtils.cpython-36.opt-1.pyc robotpkg_delete: Directory `/opt/openrobots/share/mavlink' disappeared, skipping ===> Logging bulk summary for py36-mavlink-1.1.62 => Checking leftover files => Creating bulk log files => Logging bulk metadata ===> Cleaning temporary files for py36-mavlink-1.1.62 ===> Done bulk for py36-mavlink-1.1.62 [7%] Processing wip/talos-robot:talos-robot-0.0.14r1 ===> Cleaning temporary files for talos-robot-0.0.14r1 ===> Bulk building for talos-robot-0.0.14r1 => Checking for clear installation => Installing digest-20080510.tgz => Installing tnftp-20130505~ssl.tgz => Required robotpkg package digest>=20080510: digest-20080510 found => Required robotpkg package tnftp>=20091122: tnftp-20130505~ssl found => Required system package gzip: gzip-1.8 found => Required system package patch>=2.0: patch-2.7.5 found => Required system package pax and tar archivers: pax found => Required system package pkg_install>=20110805.7: pkg_install-20110805.7 found => Dependency digest-20080510 already installed => Installing ros-actionlib-1.11.9.tgz => Dependency ros-catkin-0.6.9r2 already installed => Dependency ros-comm-1.11.20 already installed => Dependency ros-common-msgs-1.11.4 already installed => Installing ros-control-toolbox-1.13.2r1.tgz => Dependency ros-genmsg-0.5.3 already installed => Installing ros-geometry-1.11.3r1.tgz => Dependency ros-message-generation-0.2.10 already installed => Dependency ros-message-runtime-0.4.12 already installed => Installing ros-pluginlib-1.10.1.tgz => Installing ros-robot-model-1.11.5.tgz => Dependency ros-ros-1.11.4 already installed => Dependency ros-std-msgs-0.5.9 already installed => Dependency tnftp-20130505~ssl already installed => Building with no option. => Use the GNU C++ compiler: c++-compiler provided by g++>=3 => Use the GNU C compiler: c-compiler provided by gcc>=3 => Use python-2.7: python>=2.5<3.7 provided by python27>=2.7<2.8 => Use ros indigo: ros>=groovy ros>=hydro provided by ros-indigo => Required system package boost-headers>=1.34.1: boost-headers-1.63 found => Required system package boostlib-thread>=1.34.1: boost-libs-1.63.0 found => Required system package cmake>=2.8.3: cmake-3.10.1 found => Required system package eigen3>=3.0.0: eigen3-3.3.4 found => Required system package g++>=3: g++-7 found => Required system package gcc>=3: gcc-7 found => Required system package googletest: googletest found => Required system package libstdc++: libstdc++ found => Required system package pkg-config>=0.22: pkg-config-1.3.12 found => Required system package py27-empy>=3: py27-empy-3.3.2 found => Required system package py27-nose>=0.10: py27-nose-1.3.7 found => Required system package python27>=2.7<2.8: python27-2.7.14 found => Required system package tinyxml>=2: tinyxml-2.6.2 found => Required robotpkg package ros-actionlib>=1.11<1.12: ros-actionlib-1.11.9 found => Required robotpkg package ros-catkin>=0.6<0.7: ros-catkin-0.6.9r2 found => Required robotpkg package ros-comm>=1.11<1.12: ros-comm-1.11.20 found => Required robotpkg package ros-common-msgs>=1.11<1.12: ros-common-msgs-1.11.4 found => Required robotpkg package ros-control-toolbox>=1.13<1.15: ros-control-toolbox-1.13.2r1 found => Required robotpkg package ros-genmsg>=0.5<0.6: ros-genmsg-0.5.3 found => Required robotpkg package ros-geometry>=1.11<1.12: ros-geometry-1.11.3r1 found => Required robotpkg package ros-message-generation>=0.2<0.3: ros-message-generation-0.2.10 found => Required robotpkg package ros-message-runtime>=0.4<0.5: ros-message-runtime-0.4.12 found => Required robotpkg package ros-pluginlib>=1.10<1.11: ros-pluginlib-1.10.1 found => Required robotpkg package ros-robot-model>=1.11<1.12: ros-robot-model-1.11.5 found => Required robotpkg package ros-ros>=1.11<1.12: ros-ros-1.11.4 found => Required robotpkg package ros-std-msgs>=0.5: ros-std-msgs-0.5.9 found => SHA1 checksums OK => RMD160 checksums OK => Applying robotpkg patches for talos-robot-0.0.14r1 => Running PRE-INSTALL script actions => Running POST-INSTALL script actions => Adding run-time search paths to pkg-config files => Compiling python files => Registering installation for talos-robot-0.0.14r1 => Linking package in /opt/robotpkg/var/lib/robotpkg/packages/bsd/Fedora-26-x86_64/jrl WARNING: talos-robot-0.0.14r1 may not be publicly available: WARNING: Redistribution of repackaged binaries not permitted ===> Logging bulk summary for talos-robot-0.0.14r1 => Checking leftover files => Creating bulk log files => Logging bulk metadata ===> Cleaning temporary files for talos-robot-0.0.14r1 ===> Done bulk for talos-robot-0.0.14r1 [8%] Processing wip/soth:soth-2.0.1r1 ===> Cleaning temporary files for soth-2.0.1r1 ===> Bulk building for soth-2.0.1r1 => Checking for clear installation => Installing digest-20080510.tgz => Installing tnftp-20130505~ssl.tgz => Required robotpkg package digest>=20080510: digest-20080510 found => Required robotpkg package tnftp>=20091122: tnftp-20130505~ssl found => Required system package gzip: gzip-1.8 found => Required system package pax and tar archivers: pax found => Required system package pkg_install>=20110805.7: pkg_install-20110805.7 found => Dependency digest-20080510 already installed => Dependency tnftp-20130505~ssl already installed => Building with no option. => Use the GNU C++ compiler: c++-compiler provided by g++>=3 => Use the GNU C compiler: c-compiler provided by gcc>=3 => Required system package boost-headers>=1.34.1: boost-headers-1.63 found => Required system package boostlib-filesystem>=1.34.1: boost-libs-1.63.0 found => Required system package boostlib-iostreams>=1.34.1: boost-libs-1.63.0 found => Required system package boostlib-math>=1.34.1: boost-libs-1.63.0 found => Required system package boostlib-thread>=1.34.1: boost-libs-1.63.0 found => Required system package cmake>=2.6: cmake-3.10.1 found => Required system package doxygen>=1.5: doxygen-1.8.13 found => Required system package eigen3>=3.0.0: eigen3-3.3.4 found => Required system package g++>=3: g++-7 found => Required system package gcc>=3: gcc-7 found => Required system package libstdc++: libstdc++ found => Required system package pkg-config>=0.22: pkg-config-1.3.12 found => SHA1 checksums OK => RMD160 checksums OK An unexpected error occured. The last 10 log lines are shown below. | && int(Dst::SizeAtCompileTime) * (int(DstEvaluator::CoeffReadCost)+int(SrcEvaluator::CoeffReadCost)) <= int(UnrollingLimit), | ^~~~~~~~~~~~~~~~~~~~~~~~~~~~~~~~ => Marking soth-2.0.1r1 as broken | /usr/include/eigen3/Eigen/src/Core/AssignEvaluator.h:122:78: error: 'CoeffReadCost' is not a member of 'Eigen::internal::evaluator, 0> >' | && int(InnerSize) * (int(DstEvaluator::CoeffReadCost)+int(SrcEvaluator::CoeffReadCost)) <= int(UnrollingLimit) | ^~~~~~~~~~~~~~~~~~~~~~~~~~~~~~~~ | make[2]: Leaving directory '/local/robotpkg/var/tmp/robotpkg/wip/soth/work/soth-2.0.1' | make[2]: *** [src/CMakeFiles/soth.dir/build.make:162: src/CMakeFiles/soth.dir/HCOD.cpp.o] Error 1 | make[1]: *** [CMakeFiles/Makefile2:505: src/CMakeFiles/soth.dir/all] Error 2 | make[1]: Leaving directory '/local/robotpkg/var/tmp/robotpkg/wip/soth/work/soth-2.0.1' | make: *** [Makefile:166: all] Error 2 For details or bug reports, check the complete log file in: /local/robotpkg/var/tmp/robotpkg/wip/soth/work/build.log make[3]: *** [/local/robotpkg/var/lib/robotpkg/mk/build/build.mk:197: do-build] Error 2 make[2]: *** [/local/robotpkg/var/lib/robotpkg/mk/pkg/package.mk:42: pkg-check-installed] Error 2 ERROR: make: *** [package] Error 2 ===> Logging bulk summary for soth-2.0.1r1 => Checking leftover files => Creating bulk log files => Logging bulk metadata ===> Cleaning temporary files for soth-2.0.1r1 ===> Done bulk for soth-2.0.1r1 [8%] Processing wip/gerard-bauzil:gerard-bauzil-1.0.1 ===> Cleaning temporary files for gerard-bauzil-1.0.1 ===> Bulk building for gerard-bauzil-1.0.1 => Checking for clear installation => Installing digest-20080510.tgz => Installing tnftp-20130505~ssl.tgz => Required robotpkg package digest>=20080510: digest-20080510 found => Required robotpkg package tnftp>=20091122: tnftp-20130505~ssl found => Required system package gzip: gzip-1.8 found => Required system package pax and tar archivers: pax found => Required system package pkg_install>=20110805.7: pkg_install-20110805.7 found => Dependency digest-20080510 already installed => Installing gepetto-viewer-2.0.0.tgz => Dependency tnftp-20130505~ssl already installed => Building with no option. => Use the GNU C++ compiler: c++-compiler provided by g++>=3 => Use the GNU C compiler: c-compiler provided by gcc>=3 => Required system package cmake>=2.6: cmake-3.10.1 found => Required system package g++>=3: g++-7 found => Required system package gcc>=3: gcc-7 found => Required system package libstdc++: libstdc++ found => Required system package pkg-config>=0.22: pkg-config-1.3.12 found => Required robotpkg package gepetto-viewer>=2.0.0: gepetto-viewer-2.0.0 found => SHA1 checksums OK => RMD160 checksums OK => Adding run-time search paths to pkg-config files robotpkg_create: can't stat `/opt/openrobots/lib/pkgconfig/gerard-bauzil.pc' => Registering installation for gerard-bauzil-1.0.1 robotpkg_admin: gerard-bauzil-1.0.1: File `/opt/openrobots/lib/pkgconfig/gerard-bauzil.pc' is in +CONTENTS but not on filesystem! robotpkg_create: can't stat `/opt/openrobots/lib/pkgconfig/gerard-bauzil.pc' robotpkg_create: lstat failed for file lib/pkgconfig/gerard-bauzil.pc: No such file or directory make[2]: *** [/local/robotpkg/var/lib/robotpkg/mk/pkg/package.mk:74: pkg-tarup] Error 2 => Marking gerard-bauzil-1.0.1 as broken ERROR: make: *** [package] Error 2 robotpkg_delete: Couldn't remove /opt/openrobots/lib/pkgconfig/gerard-bauzil.pc ===> Logging bulk summary for gerard-bauzil-1.0.1 => Checking leftover files => Creating bulk log files => Logging bulk metadata ===> Cleaning temporary files for gerard-bauzil-1.0.1 ===> Done bulk for gerard-bauzil-1.0.1 [9%] Processing wip/urg:urg-0.8.18 ===> Cleaning temporary files for urg-0.8.18 ===> Bulk building for urg-0.8.18 => Checking for clear installation => Installing digest-20080510.tgz => Installing tnftp-20130505~ssl.tgz => Required robotpkg package digest>=20080510: digest-20080510 found => Required robotpkg package tnftp>=20091122: tnftp-20130505~ssl found => Required system package gzip: gzip-1.8 found => Required system package patch>=2.0: patch-2.7.5 found => Required system package pkg_install>=20110805.7: pkg_install-20110805.7 found => Required system package unzip: unzip found => Dependency digest-20080510 already installed => Dependency tnftp-20130505~ssl already installed => Building with no option. => Use the GNU C++ compiler: c++-compiler provided by g++>=3 => Use the GNU C compiler: c-compiler provided by gcc>=3 => Required system package SDL_net>=1.2: SDL_net-1.2.8 found => Required system package g++>=3: g++-7 found => Required system package gcc>=3: gcc-7 found => Required system package libstdc++: libstdc++ found => Required system package pkg-config>=0.22: pkg-config-1.3.12 found => SHA1 checksums OK => RMD160 checksums OK => Applying robotpkg patches for urg-0.8.18 => Modifying GNU configure scripts to avoid --recheck => Adding run-time search paths to pkg-config files => Registering installation for urg-0.8.18 => Linking package in /opt/robotpkg/var/lib/robotpkg/packages/bsd/Fedora-26-x86_64/pub ===> Logging bulk summary for urg-0.8.18 => Checking leftover files => Creating bulk log files => Logging bulk metadata ===> Cleaning temporary files for urg-0.8.18 ===> Done bulk for urg-0.8.18 [9%] Processing wip/jafar-rtslam:jafar-rtslam-0.3~!* ===> Cleaning temporary files for jafar-rtslam-0.3 ===> Bulk building for jafar-rtslam-0.3 => Checking for clear installation => Installing digest-20080510.tgz => Installing tnftp-20130505~ssl.tgz => Required robotpkg package digest>=20080510: digest-20080510 found => Required robotpkg package tnftp>=20091122: tnftp-20130505~ssl found => Required system package gzip: gzip-1.8 found => Required system package patch>=2.0: patch-2.7.5 found => Required system package pax and tar archivers: pax found => Required system package pkg_install>=20110805.7: pkg_install-20110805.7 found => Installing boost-numeric-bindings-20101109.tgz => Dependency digest-20080510 already installed => Required robotpkg package jafar-correl>=0.1: N/A => Required robotpkg package jafar-image>=2.1: N/A => Installing jafar-jmath-0.5.tgz => Dependency jafar-kernel-0.6r1 already installed => Dependency tnftp-20130505~ssl already installed ===> Logging bulk summary for jafar-rtslam-0.3 => Checking leftover files => Creating bulk log files => Logging bulk metadata ===> Cleaning temporary files for jafar-rtslam-0.3 ===> Done bulk for jafar-rtslam-0.3 [10%] Processing wip/jafar-rtslam:~MTI ===> Cleaning temporary files for jafar-rtslam-0.3~MTI ===> Bulk building for jafar-rtslam-0.3~MTI => Checking for clear installation => Installing digest-20080510.tgz => Installing tnftp-20130505~ssl.tgz => Required robotpkg package digest>=20080510: digest-20080510 found => Required robotpkg package tnftp>=20091122: tnftp-20130505~ssl found => Required system package gzip: gzip-1.8 found => Required system package patch>=2.0: patch-2.7.5 found => Required system package pax and tar archivers: pax found => Required system package pkg_install>=20110805.7: pkg_install-20110805.7 found => Installing MTI-0.6.tgz => Installing boost-numeric-bindings-20101109.tgz => Dependency digest-20080510 already installed => Required robotpkg package jafar-correl>=0.1: N/A => Required robotpkg package jafar-image>=2.1: N/A => Installing jafar-jmath-0.5.tgz => Dependency jafar-kernel-0.6r1 already installed => Dependency tnftp-20130505~ssl already installed ===> Logging bulk summary for jafar-rtslam-0.3~MTI => Checking leftover files => Creating bulk log files => Logging bulk metadata ===> Cleaning temporary files for jafar-rtslam-0.3~MTI ===> Done bulk for jafar-rtslam-0.3~MTI [10%] Processing wip/robotModelParser-libs:robotModelParser-libs-1.0 ===> Cleaning temporary files for robotModelParser-libs-1.0 ===> Bulk building for robotModelParser-libs-1.0 => Checking for clear installation => Installing digest-20080510.tgz => Installing tnftp-20130505~ssl.tgz => Required robotpkg package digest>=20080510: digest-20080510 found => Required robotpkg package tnftp>=20091122: tnftp-20130505~ssl found => Required system package gzip: gzip-1.8 found => Required system package pax and tar archivers: pax found => Required system package pkg_install>=20110805.7: pkg_install-20110805.7 found => Installing collada-dom-2.3.1r2.tgz => Dependency digest-20080510 already installed => Dependency tnftp-20130505~ssl already installed => Building with no option. => Use the GNU C++ compiler: c++-compiler provided by g++>=3 => Use the GNU C compiler: c-compiler provided by gcc>=3 => Required system package cmake>=2.6: cmake-3.10.1 found => Required system package g++>=3: g++-7 found => Required system package gcc>=3: gcc-7 found => Required system package libstdc++: libstdc++ found => Required robotpkg package collada-dom>=2.3.1: collada-dom-2.3.1r2 found => SHA1 checksums OK => RMD160 checksums OK => Registering installation for robotModelParser-libs-1.0 => Linking package in /opt/robotpkg/var/lib/robotpkg/packages/bsd/Fedora-26-x86_64/pub ===> Logging bulk summary for robotModelParser-libs-1.0 => Checking leftover files => Creating bulk log files => Logging bulk metadata ===> Cleaning temporary files for robotModelParser-libs-1.0 ===> Done bulk for robotModelParser-libs-1.0 [11%] Processing wip/hrp2-computer-monitor:hrp2-computer-monitor-1.0.2 ===> Cleaning temporary files for hrp2-computer-monitor-1.0.2 ===> Bulk building for hrp2-computer-monitor-1.0.2 => Checking for clear installation => Installing digest-20080510.tgz => Installing tnftp-20130505~ssl.tgz => Required robotpkg package digest>=20080510: digest-20080510 found => Required robotpkg package tnftp>=20091122: tnftp-20130505~ssl found => Required system package gzip: gzip-1.8 found => Required system package pax and tar archivers: pax found => Required system package pkg_install>=20110805.7: pkg_install-20110805.7 found => Dependency digest-20080510 already installed => Installing ros-catkin-0.6.9r2.tgz => Installing ros-comm-1.11.20.tgz => Installing ros-common-msgs-1.11.4.tgz => Dependency ros-std-msgs-0.5.9 already installed => Dependency tnftp-20130505~ssl already installed => Building with no option. => Use the GNU C++ compiler: c++-compiler provided by g++>=3 => Use the GNU C compiler: c-compiler provided by gcc>=3 => Use python-2.7: python>=2.5<3.7 provided by python27>=2.7<2.8 => Use ros indigo: ros>=groovy provided by ros-indigo => Required system package cmake>=2.8.3: cmake-3.10.1 found => Required system package doxygen>=1.5: doxygen-1.8.13 found => Required system package g++>=3: g++-7 found => Required system package gcc>=3: gcc-7 found => Required system package googletest: googletest found => Required system package graphviz>=2: graphviz-2.40.1 found => Required system package libstdc++: libstdc++ found => Required system package pdflatex: pdflatex found => Required system package pkg-config>=0.22: pkg-config-1.3.12 found => Required system package py27-empy>=3: py27-empy-3.3.2 found => Required system package py27-nose>=0.10: py27-nose-1.3.7 found => Required system package python27>=2.7<2.8: python27-2.7.14 found => Required robotpkg package ros-catkin>=0.6<0.7: ros-catkin-0.6.9r2 found => Required robotpkg package ros-comm>=1.11<1.12: ros-comm-1.11.20 found => Required robotpkg package ros-common-msgs>=1.11<1.12: ros-common-msgs-1.11.4 found => Required robotpkg package ros-std-msgs>=0.5: ros-std-msgs-0.5.9 found => SHA1 checksums OK => RMD160 checksums OK => Running PRE-INSTALL script actions => Running POST-INSTALL script actions => Adding run-time search paths to pkg-config files => Compiling python files => Registering installation for hrp2-computer-monitor-1.0.2 => Linking package in /opt/robotpkg/var/lib/robotpkg/packages/bsd/Fedora-26-x86_64/jrl WARNING: hrp2-computer-monitor-1.0.2 may not be publicly available: WARNING: Redistribution of repackaged binaries not permitted ===> Logging bulk summary for hrp2-computer-monitor-1.0.2 => Checking leftover files => Creating bulk log files => Logging bulk metadata ===> Cleaning temporary files for hrp2-computer-monitor-1.0.2 ===> Done bulk for hrp2-computer-monitor-1.0.2 [11%] Processing wip/chilitags:chilitags-1.3.1 ===> Cleaning temporary files for chilitags-1.3.1 ===> Bulk building for chilitags-1.3.1 => Checking for clear installation => Installing digest-20080510.tgz => Installing tnftp-20130505~ssl.tgz => Required robotpkg package digest>=20080510: digest-20080510 found => Required robotpkg package tnftp>=20130505~ssl: tnftp-20130505~ssl found => Required system package gzip: gzip-1.8 found => Required system package pax and tar archivers: pax found => Required system package pkg_install>=20110805.7: pkg_install-20110805.7 found => Dependency digest-20080510 already installed => Dependency tnftp-20130505~ssl already installed => Building with no option. => Use the GNU C++ compiler: c++-compiler provided by g++>=4.7 => Required system package cmake>=2.6: cmake-3.10.1 found => Required system package g++>=4.7: g++-7 found => Required system package libstdc++: libstdc++ found => Required system package opencv>=2.4: opencv-3.2.0 found => SHA1 checksums OK => RMD160 checksums OK An unexpected error occured. The last 10 log lines are shown below. | CMake Error at /usr/share/cmake/Modules/FindPackageHandleStandardArgs.cmake:137 (message): | Could NOT find OpenCV (missing: ts) (found version "3.2.0") | Call Stack (most recent call first): | /usr/share/cmake/Modules/FindPackageHandleStandardArgs.cmake:378 (_FPHSA_FAILURE_MESSAGE) | /usr/lib64/OpenCV/OpenCVConfig.cmake:260 (find_package_handle_standard_args) | CMakeLists.txt:9 (find_package) | | | -- Configuring incomplete, errors occurred! | See also "/local/robotpkg/var/tmp/robotpkg/wip/chilitags/work/chilitags-1.3.1/CMakeFiles/CMakeOutput.log". For details or bug reports, check the complete log file in: /local/robotpkg/var/tmp/robotpkg/wip/chilitags/work/configure.log make[3]: *** [/local/robotpkg/var/lib/robotpkg/mk/configure/cmake-configure.mk:100: do-configure-cmake] Error 1 make[2]: *** [/local/robotpkg/var/lib/robotpkg/mk/pkg/package.mk:42: pkg-check-installed] Error 2 => Marking chilitags-1.3.1 as broken ERROR: make: *** [package] Error 2 ===> Logging bulk summary for chilitags-1.3.1 => Checking leftover files => Creating bulk log files => Logging bulk metadata ===> Cleaning temporary files for chilitags-1.3.1 ===> Done bulk for chilitags-1.3.1 [11%] Processing wip/move3d-assets:move3d-assets-20120125 ===> Cleaning temporary files for move3d-assets-20120125 ===> Bulk building for move3d-assets-20120125 => Checking for clear installation => Installing digest-20080510.tgz => Installing tnftp-20130505~ssl.tgz => Required robotpkg package digest>=20080510: digest-20080510 found => Required robotpkg package tnftp>=20091122: tnftp-20130505~ssl found => Required system package gzip: gzip-1.8 found => Required system package pax and tar archivers: pax found => Required system package pkg_install>=20110805.7: pkg_install-20110805.7 found => Dependency digest-20080510 already installed => Dependency tnftp-20130505~ssl already installed => Building with no option. => Use the GNU C compiler: c-compiler provided by gcc>=3 => Required system package gcc>=3: gcc-7 found => Required system package A BSD-compatible install program: install-sh found => Required system package pax and tar archivers: pax found => SHA1 checksums OK => RMD160 checksums OK => Registering installation for move3d-assets-20120125 robotpkg_admin: move3d-assets-20120125: Symlink `/opt/openrobots/share/move3d/assets/CostHriFunction/MACROS/jidoBaseFixedGripper.macro' exists and is in +CONTENTS but target does not exist! robotpkg_admin: move3d-assets-20120125: Symlink `/opt/openrobots/share/move3d/assets/JustinScenarios/LightPlanner/MACROS/Horse.macro' exists and is in +CONTENTS but target does not exist! robotpkg_admin: move3d-assets-20120125: Symlink `/opt/openrobots/share/move3d/assets/Kitchen/Ikea/MACROS/helico.macro' exists and is in +CONTENTS but target does not exist! robotpkg_admin: move3d-assets-20120125: Symlink `/opt/openrobots/share/move3d/assets/Kitchen/Ikea/MACROS/jidoHriGripperIK.macro' exists and is in +CONTENTS but target does not exist! robotpkg_admin: move3d-assets-20120125: Symlink `/opt/openrobots/share/move3d/assets/Kitchen/kitchen/MACROS/JidoParts' exists and is in +CONTENTS but target does not exist! robotpkg_admin: move3d-assets-20120125: Symlink `/opt/openrobots/share/move3d/assets/Kitchen/kitchen/MACROS/Superman.macro' exists and is in +CONTENTS but target does not exist! robotpkg_admin: move3d-assets-20120125: Symlink `/opt/openrobots/share/move3d/assets/Kitchen/kitchen/MACROS/jidoHriGripper.macro' exists and is in +CONTENTS but target does not exist! robotpkg_admin: move3d-assets-20120125: Symlink `/opt/openrobots/share/move3d/assets/Kitchen/kitchen/MACROS/robots/JidoParts' exists and is in +CONTENTS but target does not exist! robotpkg_admin: move3d-assets-20120125: Symlink `/opt/openrobots/share/move3d/assets/Kitchen/kitchen/MACROS/robots/jido.macro' exists and is in +CONTENTS but target does not exist! robotpkg_admin: move3d-assets-20120125: Symlink `/opt/openrobots/share/move3d/assets/Kitchen/kitchen/MACROS/robots/jidoHriGripper.macro' exists and is in +CONTENTS but target does not exist! robotpkg_admin: move3d-assets-20120125: Symlink `/opt/openrobots/share/move3d/assets/SAHand/MACROS/Horse.macro' exists and is in +CONTENTS but target does not exist! robotpkg_admin: move3d-assets-20120125: Symlink `/opt/openrobots/share/move3d/assets/environments/laas-grande-salle/MACROS/AchileM.macro' exists and is in +CONTENTS but target does not exist! robotpkg_admin: move3d-assets-20120125: Symlink `/opt/openrobots/share/move3d/assets/environments/laas-grande-salle/MACROS/AchileParts' exists and is in +CONTENTS but target does not exist! robotpkg_admin: move3d-assets-20120125: Symlink `/opt/openrobots/share/move3d/assets/environments/laas-grande-salle/MACROS/JidoParts' exists and is in +CONTENTS but target does not exist! robotpkg_admin: move3d-assets-20120125: Symlink `/opt/openrobots/share/move3d/assets/environments/laas-grande-salle/MACROS/Objects' exists and is in +CONTENTS but target does not exist! robotpkg_admin: move3d-assets-20120125: Symlink `/opt/openrobots/share/move3d/assets/environments/laas-grande-salle/MACROS/SAHandRight' exists and is in +CONTENTS but target does not exist! robotpkg_admin: move3d-assets-20120125: Symlink `/opt/openrobots/share/move3d/assets/environments/laas-grande-salle/MACROS/SAHandRight_robot.macro' exists and is in +CONTENTS but target does not exist! robotpkg_admin: move3d-assets-20120125: Symlink `/opt/openrobots/share/move3d/assets/environments/laas-grande-salle/MACROS/jidoKukaSAHand.macro' exists and is in +CONTENTS but target does not exist! robotpkg_admin: move3d-assets-20120125: Symlink `/opt/openrobots/share/move3d/assets/environments/laas-grande-salle/MACROS/pr2.macro' exists and is in +CONTENTS but target does not exist! robotpkg_admin: move3d-assets-20120125: Symlink `/opt/openrobots/share/move3d/assets/environments/laas-grande-salle/MACROS/pr2Parts' exists and is in +CONTENTS but target does not exist! robotpkg_admin: move3d-assets-20120125: Symlink `/opt/openrobots/share/move3d/assets/novela/MACROS/shelf.macro' exists and is in +CONTENTS but target does not exist! => Linking package in /opt/robotpkg/var/lib/robotpkg/packages/bsd/Fedora-26-x86_64/pub ===> Logging bulk summary for move3d-assets-20120125 => Checking leftover files => Creating bulk log files => Logging bulk metadata ===> Cleaning temporary files for move3d-assets-20120125 ===> Done bulk for move3d-assets-20120125 [12%] Processing wip/morse-hla:morse-hla-1.4 ===> Cleaning temporary files for morse-hla-1.4 ===> Bulk building for morse-hla-1.4 => Checking for clear installation => Installing digest-20080510.tgz => Installing tnftp-20130505~ssl.tgz => Required robotpkg package digest>=20080510: digest-20080510 found => Required robotpkg package tnftp>=20091122: tnftp-20130505~ssl found => Required system package gzip: gzip-1.8 found => Required system package patch>=2.0: patch-2.7.5 found => Required system package pax and tar archivers: pax found => Required system package pkg_install>=20110805.7: pkg_install-20110805.7 found => Dependency digest-20080510 already installed => Installing morse-1.4~doc.tgz ERROR: Required robotpkg package py36-hla>=1.1.1: BROKEN => Dependency tnftp-20130505~ssl already installed ===> Logging bulk summary for morse-hla-1.4 => Checking leftover files => Creating bulk log files => Logging bulk metadata ===> Cleaning temporary files for morse-hla-1.4 ===> Done bulk for morse-hla-1.4 [12%] Processing wip/py-dynamic-graph-v3:py27-dynamic-graph-v3-3.0.2 ===> Cleaning temporary files for py27-dynamic-graph-v3-3.0.2 ===> Bulk building for py27-dynamic-graph-v3-3.0.2 => Checking for clear installation => Installing digest-20080510.tgz => Installing tnftp-20130505~ssl.tgz => Required robotpkg package digest>=20080510: digest-20080510 found => Required robotpkg package tnftp>=20091122: tnftp-20130505~ssl found => Required system package gzip: gzip-1.8 found => Required system package pax and tar archivers: pax found => Required system package pkg_install>=20110805.7: pkg_install-20110805.7 found => Dependency digest-20080510 already installed => Installing dynamic-graph-v3-3.0.1.tgz => Dependency tnftp-20130505~ssl already installed => Building with no option. => Use the GNU C++ compiler: c++-compiler provided by g++>=3 => Use the GNU C compiler: c-compiler provided by gcc>=3 => Use python-2.7: python<3 provided by python27>=2.7<2.8 => Required system package cmake>=2.6: cmake-3.10.1 found => Required system package doxygen>=1.5: doxygen-1.8.13 found => Required system package eigen3>=3.0.0: eigen3-3.3.4 found => Required system package g++>=3: g++-7 found => Required system package gcc>=3: gcc-7 found => Required system package graphviz>=2: graphviz-2.40.1 found => Required system package libstdc++: libstdc++ found => Required system package pdflatex: pdflatex found => Required system package pkg-config>=0.22: pkg-config-1.3.12 found => Required system package py-sphinx>=1.1: py-sphinx-1.5.6 found => Required system package python27>=2.7<2.8: python27-2.7.14 found => Required robotpkg package dynamic-graph-v3>=3.0.0: dynamic-graph-v3-3.0.1 found => SHA1 checksums OK => RMD160 checksums OK => Adding run-time search paths to pkg-config files => Compiling python files => Registering installation for py27-dynamic-graph-v3-3.0.2 => Linking package in /opt/robotpkg/var/lib/robotpkg/packages/bsd/Fedora-26-x86_64/pub ===> Logging bulk summary for py27-dynamic-graph-v3-3.0.2 => Checking leftover files => Creating bulk log files => Logging bulk metadata ===> Cleaning temporary files for py27-dynamic-graph-v3-3.0.2 ===> Done bulk for py27-dynamic-graph-v3-3.0.2 [13%] Processing wip/morse-pocolibs:morse-pocolibs-1.4 ===> Cleaning temporary files for morse-pocolibs-1.4 ===> Bulk building for morse-pocolibs-1.4 => Checking for clear installation => Installing digest-20080510.tgz => Installing tnftp-20130505~ssl.tgz => Required robotpkg package digest>=20080510: digest-20080510 found => Required robotpkg package tnftp>=20091122: tnftp-20130505~ssl found => Required system package gzip: gzip-1.8 found => Required system package patch>=2.0: patch-2.7.5 found => Required system package pax and tar archivers: pax found => Required system package pkg_install>=20110805.7: pkg_install-20110805.7 found => Dependency digest-20080510 already installed => Installing morse-1.4~doc.tgz => Dependency tnftp-20130505~ssl already installed => Building with no option. => Use the GNU C++ compiler: c++-compiler provided by g++>=3 => Use the GNU C compiler: c-compiler provided by gcc>=3 => Use python-3.6: python>=3.3 provided by python36>=3.6<3.7 => Required system package blender>=2.65: blender-2.79 found => Required system package cmake>=2.6: cmake-3.10.1 found => Required system package g++>=3: g++-7 found => Required system package gcc>=3: gcc-7 found => Required system package libstdc++: libstdc++ found => Required system package pkg-config>=0.22: pkg-config-1.3.12 found => Required system package py36-numpy>=1: py36-numpy-1.12.1 found => Required system package python36>=3.6<3.7: python36-3.6.4 found => Required robotpkg package morse>=1.0: morse-1.4~doc found => SHA1 checksums OK => RMD160 checksums OK => Applying robotpkg patches for morse-pocolibs-1.4 => Compiling python files => Adding run-time search paths to pkg-config files => Registering installation for morse-pocolibs-1.4 => Linking package in /opt/robotpkg/var/lib/robotpkg/packages/bsd/Fedora-26-x86_64/pub ===> Logging bulk summary for morse-pocolibs-1.4 => Checking leftover files => Creating bulk log files => Logging bulk metadata ===> Cleaning temporary files for morse-pocolibs-1.4 ===> Done bulk for morse-pocolibs-1.4 [13%] Processing wip/qpOASES:qpOASES-3.2.0 ===> Cleaning temporary files for qpOASES-3.2.0 ===> Bulk building for qpOASES-3.2.0 => Checking for clear installation => Installing digest-20080510.tgz => Installing tnftp-20130505~ssl.tgz => Required robotpkg package digest>=20080510: digest-20080510 found => Required robotpkg package tnftp>=20091122: tnftp-20130505~ssl found => Required system package gzip: gzip-1.8 found => Required system package pax and tar archivers: pax found => Required system package pkg_install>=20110805.7: pkg_install-20110805.7 found => Dependency digest-20080510 already installed => Dependency tnftp-20130505~ssl already installed => Building with no option. => Use the GNU C++ compiler: c++-compiler provided by g++>=3 => Use the GNU C compiler: c-compiler provided by gcc>=3 => Use python-2.7: python>=2.5<3.7 provided by python27>=2.7<2.8 => Required system package cmake>=2.6: cmake-3.10.1 found => Required system package g++>=3: g++-7 found => Required system package gcc>=3: gcc-7 found => Required system package libstdc++: libstdc++ found => Required system package pkg-config>=0.22: pkg-config-1.3.12 found => Required system package python27>=2.7<2.8: python27-2.7.14 found => SHA1 checksums OK => RMD160 checksums OK => Adding run-time search paths to pkg-config files => Compiling python files => Registering installation for qpOASES-3.2.0 => Linking package in /opt/robotpkg/var/lib/robotpkg/packages/bsd/Fedora-26-x86_64/pub ===> Logging bulk summary for qpOASES-3.2.0 => Checking leftover files => Creating bulk log files => Logging bulk metadata ===> Cleaning temporary files for qpOASES-3.2.0 ===> Done bulk for qpOASES-3.2.0 [14%] Processing wip/py-laaswm:py27-laaswm-1.3r1 ===> Cleaning temporary files for py27-laaswm-1.3r1 ===> Bulk building for py27-laaswm-1.3r1 => Checking for clear installation => Installing digest-20080510.tgz => Installing tnftp-20130505~ssl.tgz => Required robotpkg package digest>=20080510: digest-20080510 found => Required robotpkg package tnftp>=20091122: tnftp-20130505~ssl found => Required system package gzip: gzip-1.8 found => Required system package pax and tar archivers: pax found => Required system package pkg_install>=20110805.7: pkg_install-20110805.7 found => Dependency digest-20080510 already installed => Dependency tnftp-20130505~ssl already installed => Building with no option. => Use the GNU C compiler: c-compiler provided by gcc>=3 => Use python-2.7: python<3 provided by python27>=2.7<2.8 => Required system package gcc>=3: gcc-7 found => Required system package python27>=2.7<2.8: python27-2.7.14 found => SHA1 checksums OK => RMD160 checksums OK => Compiling python files => Registering installation for py27-laaswm-1.3r1 => Linking package in /opt/robotpkg/var/lib/robotpkg/packages/bsd/Fedora-26-x86_64/pub ===> Logging bulk summary for py27-laaswm-1.3r1 => Checking leftover files => Creating bulk log files => Logging bulk metadata ===> Cleaning temporary files for py27-laaswm-1.3r1 ===> Done bulk for py27-laaswm-1.3r1 [14%] Processing wip/sot-core-v3:sot-core-v3-3.1.2 ===> Cleaning temporary files for sot-core-v3-3.1.2 ===> Bulk building for sot-core-v3-3.1.2 => Checking for clear installation => Installing digest-20080510.tgz => Installing tnftp-20130505~ssl.tgz => Required robotpkg package digest>=20080510: digest-20080510 found => Required robotpkg package tnftp>=20091122: tnftp-20130505~ssl found => Required system package gzip: gzip-1.8 found => Required system package pax and tar archivers: pax found => Required system package pkg_install>=20110805.7: pkg_install-20110805.7 found => Dependency digest-20080510 already installed => Installing dynamic-graph-v3-3.0.1.tgz => Installing py27-dynamic-graph-v3-3.0.2.tgz => Dependency tnftp-20130505~ssl already installed => Building with no option. => Use the GNU C++ compiler: c++-compiler provided by g++>=3 => Use the GNU C compiler: c-compiler provided by gcc>=3 => Use python-2.7: python>=2.5<3.7 provided by python27>=2.7<2.8 => Required system package boost-headers>=1.34.1: boost-headers-1.63 found => Required system package boostlib-filesystem>=1.34.1: boost-libs-1.63.0 found => Required system package boostlib-iostreams>=1.34.1: boost-libs-1.63.0 found => Required system package boostlib-math>=1.34.1: boost-libs-1.63.0 found => Required system package boostlib-thread>=1.34.1: boost-libs-1.63.0 found => Required system package cmake>=2.6: cmake-3.10.1 found => Required system package doxygen>=1.5: doxygen-1.8.13 found => Required system package eigen3>=3.0.0: eigen3-3.3.4 found => Required system package g++>=3: g++-7 found => Required system package gcc>=3: gcc-7 found => Required system package graphviz>=2: graphviz-2.40.1 found => Required system package libstdc++: libstdc++ found => Required system package pdflatex: pdflatex found => Required system package pkg-config>=0.22: pkg-config-1.3.12 found => Required system package py-sphinx>=1.1: py-sphinx-1.5.6 found => Required system package python27>=2.7<2.8: python27-2.7.14 found => Required robotpkg package dynamic-graph-v3>=3.0.0: dynamic-graph-v3-3.0.1 found => Required robotpkg package py27-dynamic-graph-v3>=3.0: py27-dynamic-graph-v3-3.0.2 found => SHA1 checksums OK => RMD160 checksums OK => Compiling python files => Adding run-time search paths to pkg-config files => Registering installation for sot-core-v3-3.1.2 => Linking package in /opt/robotpkg/var/lib/robotpkg/packages/bsd/Fedora-26-x86_64/pub ===> Logging bulk summary for sot-core-v3-3.1.2 => Checking leftover files => Creating bulk log files => Logging bulk metadata ===> Cleaning temporary files for sot-core-v3-3.1.2 ===> Done bulk for sot-core-v3-3.1.2 [15%] Processing wip/talos-data:talos-data-0.0.14r5 ===> Cleaning temporary files for talos-data-0.0.14r5 ===> Bulk building for talos-data-0.0.14r5 => Checking for clear installation => Installing digest-20080510.tgz => Installing tnftp-20130505~ssl.tgz => Required robotpkg package digest>=20080510: digest-20080510 found => Required robotpkg package tnftp>=20091122: tnftp-20130505~ssl found => Required system package gzip: gzip-1.8 found => Required system package pax and tar archivers: pax found => Required system package pkg_install>=20110805.7: pkg_install-20110805.7 found => Dependency digest-20080510 already installed => Installing ros-catkin-0.6.9r2.tgz => Installing ros-comm-1.11.20.tgz => Installing ros-common-msgs-1.11.4.tgz => Dependency ros-genmsg-0.5.3 already installed => Dependency ros-message-generation-0.2.10 already installed => Dependency ros-message-runtime-0.4.12 already installed => Dependency ros-std-msgs-0.5.9 already installed => Dependency tnftp-20130505~ssl already installed => Building with no option. => Use the GNU C++ compiler: c++-compiler provided by g++>=3 => Use the GNU C compiler: c-compiler provided by gcc>=3 => Use python-2.7: python>=2.5<3.7 provided by python27>=2.7<2.8 => Use ros indigo: ros>=groovy provided by ros-indigo => Required system package cmake>=2.8.3: cmake-3.10.1 found => Required system package doxygen>=1.5: doxygen-1.8.13 found => Required system package g++>=3: g++-7 found => Required system package gcc>=3: gcc-7 found => Required system package googletest: googletest found => Required system package graphviz>=2: graphviz-2.40.1 found => Required system package libstdc++: libstdc++ found => Required system package pdflatex: pdflatex found => Required system package pkg-config>=0.22: pkg-config-1.3.12 found => Required system package py27-empy>=3: py27-empy-3.3.2 found => Required system package py27-nose>=0.10: py27-nose-1.3.7 found => Required system package python27>=2.7<2.8: python27-2.7.14 found => Required robotpkg package ros-catkin>=0.6<0.7: ros-catkin-0.6.9r2 found => Required robotpkg package ros-comm>=1.11<1.12: ros-comm-1.11.20 found => Required robotpkg package ros-common-msgs>=1.11<1.12: ros-common-msgs-1.11.4 found => Required robotpkg package ros-genmsg>=0.5<0.6: ros-genmsg-0.5.3 found => Required robotpkg package ros-message-generation>=0.2<0.3: ros-message-generation-0.2.10 found => Required robotpkg package ros-message-runtime>=0.4<0.5: ros-message-runtime-0.4.12 found => Required robotpkg package ros-std-msgs>=0.5: ros-std-msgs-0.5.9 found => SHA1 checksums OK => RMD160 checksums OK => Running PRE-INSTALL script actions => Running POST-INSTALL script actions => Adding run-time search paths to pkg-config files => Compiling python files => Registering installation for talos-data-0.0.14r5 => Linking package in /opt/robotpkg/var/lib/robotpkg/packages/bsd/Fedora-26-x86_64/jrl WARNING: talos-data-0.0.14r5 may not be publicly available: WARNING: Redistribution of repackaged binaries not permitted ===> Logging bulk summary for talos-data-0.0.14r5 => Checking leftover files => Creating bulk log files => Logging bulk metadata ===> Cleaning temporary files for talos-data-0.0.14r5 ===> Done bulk for talos-data-0.0.14r5 [15%] Processing wip/FRILibrary:FRILibrary-1.2r1 ===> Cleaning temporary files for FRILibrary-1.2r1 ===> Bulk building for FRILibrary-1.2r1 => Checking for clear installation => Installing digest-20080510.tgz => Installing tnftp-20130505~ssl.tgz => Required robotpkg package digest>=20080510: digest-20080510 found => Required robotpkg package tnftp>=20091122: tnftp-20130505~ssl found => Required system package gzip: gzip-1.8 found => Required system package patch>=2.0: patch-2.7.5 found => Required system package pkg_install>=20110805.7: pkg_install-20110805.7 found => Required system package unzip: unzip found => Dependency digest-20080510 already installed => Dependency tnftp-20130505~ssl already installed => Building with no option. => Use the GNU C++ compiler: c++-compiler provided by g++>=3 => Required system package g++>=3: g++-7 found => Required system package A BSD-compatible install program: install-sh found => Required system package libstdc++: libstdc++ found => Required system package pax and tar archivers: pax found => SHA1 checksums OK => RMD160 checksums OK => Applying robotpkg patches for FRILibrary-1.2r1 => Registering installation for FRILibrary-1.2r1 => Linking package in /opt/robotpkg/var/lib/robotpkg/packages/bsd/Fedora-26-x86_64/pub robotpkg_delete: Directory `/opt/openrobots/etc' disappeared, skipping robotpkg_delete: Directory `/opt/openrobots/share/FRILibrary' disappeared, skipping ===> Logging bulk summary for FRILibrary-1.2r1 => Checking leftover files => Creating bulk log files => Logging bulk metadata ===> Cleaning temporary files for FRILibrary-1.2r1 ===> Done bulk for FRILibrary-1.2r1 [16%] Processing wip/sot-application:sot-application-1.0.0r1 ===> Cleaning temporary files for sot-application-1.0.0r1 ===> Bulk building for sot-application-1.0.0r1 => Checking for clear installation => Installing digest-20080510.tgz => Installing tnftp-20130505~ssl.tgz => Required robotpkg package digest>=20080510: digest-20080510 found => Required robotpkg package tnftp>=20091122: tnftp-20130505~ssl found => Required system package gzip: gzip-1.8 found => Required system package patch>=2.0: patch-2.7.5 found => Required system package pax and tar archivers: pax found => Required system package pkg_install>=20110805.7: pkg_install-20110805.7 found => Dependency digest-20080510 already installed => Installing sot-dynamic-2.9.2.tgz => Dependency tnftp-20130505~ssl already installed => Building with no option. => Use the GNU C++ compiler: c++-compiler provided by g++>=3 => Use the GNU C compiler: c-compiler provided by gcc>=3 => Use python-2.7: python>=2.5<3.7 provided by python27>=2.7<2.8 => Required system package cmake>=2.6: cmake-3.10.1 found => Required system package doxygen>=1.5: doxygen-1.8.13 found => Required system package g++>=3: g++-7 found => Required system package gcc>=3: gcc-7 found => Required system package graphviz>=2: graphviz-2.40.1 found => Required system package libstdc++: libstdc++ found => Required system package pdflatex: pdflatex found => Required system package pkg-config>=0.22: pkg-config-1.3.12 found => Required system package python27>=2.7<2.8: python27-2.7.14 found => Required robotpkg package sot-dynamic>=2.5: sot-dynamic-2.9.2 found => SHA1 checksums OK => RMD160 checksums OK => Applying robotpkg patches for sot-application-1.0.0r1 => Adding run-time search paths to pkg-config files => Compiling python files => Registering installation for sot-application-1.0.0r1 => Linking package in /opt/robotpkg/var/lib/robotpkg/packages/bsd/Fedora-26-x86_64/pub ===> Logging bulk summary for sot-application-1.0.0r1 => Checking leftover files => Creating bulk log files => Logging bulk metadata ===> Cleaning temporary files for sot-application-1.0.0r1 ===> Done bulk for sot-application-1.0.0r1 [16%] Processing wip/talos-moveit-config:talos-moveit-config-0.2.3 ===> Cleaning temporary files for talos-moveit-config-0.2.3 ===> Bulk building for talos-moveit-config-0.2.3 => Checking for clear installation => Installing digest-20080510.tgz => Installing tnftp-20130505~ssl.tgz => Required robotpkg package digest>=20080510: digest-20080510 found => Required robotpkg package tnftp>=20091122: tnftp-20130505~ssl found => Required system package gzip: gzip-1.8 found => Required system package pax and tar archivers: pax found => Required system package pkg_install>=20110805.7: pkg_install-20110805.7 found => Dependency digest-20080510 already installed => Installing ros-actionlib-1.11.9.tgz => Dependency ros-catkin-0.6.9r2 already installed => Dependency ros-comm-1.11.20 already installed => Dependency ros-common-msgs-1.11.4 already installed => Installing ros-control-toolbox-1.13.2r1.tgz => Dependency ros-genmsg-0.5.3 already installed => Installing ros-geometry-1.11.3r1.tgz => Dependency ros-message-generation-0.2.10 already installed => Dependency ros-message-runtime-0.4.12 already installed => Installing ros-pluginlib-1.10.1.tgz => Installing ros-robot-model-1.11.5.tgz => Dependency ros-ros-1.11.4 already installed => Dependency ros-std-msgs-0.5.9 already installed => Dependency tnftp-20130505~ssl already installed => Building with no option. => Use the GNU C++ compiler: c++-compiler provided by g++>=3 => Use the GNU C compiler: c-compiler provided by gcc>=3 => Use python-2.7: python>=2.5<3.7 provided by python27>=2.7<2.8 => Use ros indigo: ros>=groovy ros>=hydro provided by ros-indigo => Required system package boost-headers>=1.34.1: boost-headers-1.63 found => Required system package boostlib-filesystem>=1.34.1: boost-libs-1.63.0 found => Required system package boostlib-iostreams>=1.34.1: boost-libs-1.63.0 found => Required system package boostlib-math>=1.34.1: boost-libs-1.63.0 found => Required system package boostlib-thread>=1.34.1: boost-libs-1.63.0 found => Required system package cmake>=2.8.3: cmake-3.10.1 found => Required system package eigen3>=3.0.0: eigen3-3.3.4 found => Required system package g++>=3: g++-7 found => Required system package gcc>=3: gcc-7 found => Required system package googletest: googletest found => Required system package libstdc++: libstdc++ found => Required system package pkg-config>=0.22: pkg-config-1.3.12 found => Required system package py27-empy>=3: py27-empy-3.3.2 found => Required system package py27-nose>=0.10: py27-nose-1.3.7 found => Required system package python27>=2.7<2.8: python27-2.7.14 found => Required system package tinyxml>=2: tinyxml-2.6.2 found => Required robotpkg package ros-actionlib>=1.11<1.12: ros-actionlib-1.11.9 found => Required robotpkg package ros-catkin>=0.6<0.7: ros-catkin-0.6.9r2 found => Required robotpkg package ros-comm>=1.11<1.12: ros-comm-1.11.20 found => Required robotpkg package ros-common-msgs>=1.11<1.12: ros-common-msgs-1.11.4 found => Required robotpkg package ros-control-toolbox>=1.13<1.15: ros-control-toolbox-1.13.2r1 found => Required robotpkg package ros-genmsg>=0.5<0.6: ros-genmsg-0.5.3 found => Required robotpkg package ros-geometry>=1.11<1.12: ros-geometry-1.11.3r1 found => Required robotpkg package ros-message-generation>=0.2<0.3: ros-message-generation-0.2.10 found => Required robotpkg package ros-message-runtime>=0.4<0.5: ros-message-runtime-0.4.12 found => Required robotpkg package ros-pluginlib>=1.10<1.11: ros-pluginlib-1.10.1 found => Required robotpkg package ros-robot-model>=1.11<1.12: ros-robot-model-1.11.5 found => Required robotpkg package ros-ros>=1.11<1.12: ros-ros-1.11.4 found => Required robotpkg package ros-std-msgs>=0.5: ros-std-msgs-0.5.9 found => SHA1 checksums OK => RMD160 checksums OK => Running PRE-INSTALL script actions => Running POST-INSTALL script actions => Adding run-time search paths to pkg-config files => Compiling python files => Registering installation for talos-moveit-config-0.2.3 => Linking package in /opt/robotpkg/var/lib/robotpkg/packages/bsd/Fedora-26-x86_64/jrl WARNING: talos-moveit-config-0.2.3 may not be publicly available: WARNING: Redistribution of repackaged binaries not permitted ===> Logging bulk summary for talos-moveit-config-0.2.3 => Checking leftover files => Creating bulk log files => Logging bulk metadata ===> Cleaning temporary files for talos-moveit-config-0.2.3 ===> Done bulk for talos-moveit-config-0.2.3 [16%] Processing wip/sot-dyninv:sot-dyninv-2.0.0 ===> Cleaning temporary files for sot-dyninv-2.0.0 ===> Bulk building for sot-dyninv-2.0.0 => Checking for clear installation => Installing digest-20080510.tgz => Installing tnftp-20130505~ssl.tgz => Required robotpkg package digest>=20080510: digest-20080510 found => Required robotpkg package tnftp>=20091122: tnftp-20130505~ssl found => Required system package gzip: gzip-1.8 found => Required system package pax and tar archivers: pax found => Required system package pkg_install>=20110805.7: pkg_install-20110805.7 found => Dependency digest-20080510 already installed => Installing jrl-mal-1.19.6r1~jrl-mathtools.tgz => Installing py27-dynamic-graph-2.5.6r1.tgz => Installing sot-core-2.9.10.tgz ERROR: Required robotpkg package soth>=2.0.0: BROKEN => Dependency tnftp-20130505~ssl already installed ===> Logging bulk summary for sot-dyninv-2.0.0 => Checking leftover files => Creating bulk log files => Logging bulk metadata ===> Cleaning temporary files for sot-dyninv-2.0.0 ===> Done bulk for sot-dyninv-2.0.0 [17%] Processing wip/dptu-genom3:dptu-genom3-0.2~codels+pocolibs-client-c+openprs+pocolibs-server+!* ===> Cleaning temporary files for dptu-genom3-0.2~codels+openprs+pocolibs-client-c+pocolibs-server ===> Bulk building for dptu-genom3-0.2~codels+openprs+pocolibs-client-c+pocolibs-server => Checking for clear installation => Installing digest-20080510.tgz => Installing tnftp-20130505~ssl.tgz => Required robotpkg package digest>=20080510: digest-20080510 found => Required robotpkg package tnftp>=20130505~ssl: tnftp-20130505~ssl found => Required system package gzip: gzip-1.8 found => Required system package pax and tar archivers: pax found => Required system package pkg_install>=20110805.7: pkg_install-20110805.7 found => Dependency digest-20080510 already installed => Installing genom3-2.99.30.tgz => Installing genom3-openprs-1.0.9r5.tgz => Installing genom3-pocolibs-1.10.tgz => Dependency openprs-1.1b10 already installed => Installing openrobots-idl-1.5.tgz => Dependency pocolibs-2.16 already installed => Dependency tnftp-20130505~ssl already installed => Dependency transgen3-1.0b5 already installed => Building with the following options: => Use the GNU C compiler: c-compiler provided by gcc>=3 => Required system package autoconf>=2.59: autoconf-2.69 found => Required system package automake>=1.8: automake-1.15 found => Required system package gcc>=3: gcc-7 found => Required system package gm4>=1.4: gm4-1.4.18 found => Required system package libtool>=1.5.22: libtool-2.4.6 found => Required system package pkg-config>=0.22: pkg-config-1.3.12 found => Required robotpkg package genom3>=2.99.30: genom3-2.99.30 found => Required robotpkg package genom3-openprs>=1.0: genom3-openprs-1.0.9r5 found => Required robotpkg package genom3-pocolibs>=1.8: genom3-pocolibs-1.10 found => Required robotpkg package openprs>=1.1b7: openprs-1.1b10 found => Required robotpkg package openrobots-idl>=1.5: openrobots-idl-1.5 found => Required robotpkg package pocolibs>=2.11: pocolibs-2.16 found => Required robotpkg package transgen3>=1.0b2: transgen3-1.0b5 found => SHA1 checksums OK => RMD160 checksums OK => Generating openprs/client => Running autoreconf for openprs/client => Generating pocolibs/client/c => Running autoreconf for pocolibs/client/c => Generating pocolibs/server => Running autoreconf for pocolibs/server => Modifying GNU configure scripts to avoid --recheck => Disabling fatal errors with C++ preprocessor in GNU configure scripts => Adding run-time search paths to pkg-config files => Registering installation for dptu-genom3-0.2~codels+openprs+pocolibs-client-c+pocolibs-server => Linking package in /opt/robotpkg/var/lib/robotpkg/packages/bsd/Fedora-26-x86_64/pub ===> Logging bulk summary for dptu-genom3-0.2~codels+openprs+pocolibs-client-c+pocolibs-server => Checking leftover files => Creating bulk log files => Logging bulk metadata ===> Cleaning temporary files for dptu-genom3-0.2~codels+openprs+pocolibs-client-c+pocolibs-server ===> Done bulk for dptu-genom3-0.2~codels+openprs+pocolibs-client-c+pocolibs-server [17%] Processing wip/dptu-genom3:dptu-genom3-0.2~codels+openprs+ros-client-c+ros-client-ros+ros-server+!* ===> Cleaning temporary files for dptu-genom3-0.2~codels+openprs+ros-client-c+ros-client-ros+ros-server ===> Bulk building for dptu-genom3-0.2~codels+openprs+ros-client-c+ros-client-ros+ros-server => Checking for clear installation => Installing digest-20080510.tgz => Installing tnftp-20130505~ssl.tgz => Required robotpkg package digest>=20080510: digest-20080510 found => Required robotpkg package tnftp>=20130505~ssl: tnftp-20130505~ssl found => Required system package gzip: gzip-1.8 found => Required system package pax and tar archivers: pax found => Required system package pkg_install>=20110805.7: pkg_install-20110805.7 found => Dependency digest-20080510 already installed => Installing genom3-2.99.30.tgz => Installing genom3-openprs-1.0.9r5.tgz => Installing genom3-ros-1.18.tgz => Dependency openprs-1.1b10 already installed => Installing openrobots-idl-1.5.tgz => Dependency ros-actionlib-1.11.9 already installed => Dependency ros-comm-1.11.20 already installed => Dependency ros-common-msgs-1.11.4 already installed => Dependency ros-ros-1.11.4 already installed => Dependency ros-rospack-2.2.4 already installed => Dependency tnftp-20130505~ssl already installed => Dependency transgen3-1.0b5 already installed => Building with the following options: => Use the GNU C++ compiler: c++-compiler provided by g++>=3 => Use the GNU C compiler: c-compiler provided by gcc>=3 => Use python-2.7: python>=2.5<3.7 provided by python27>=2.7<2.8 => Use ros indigo: ros>=groovy provided by ros-indigo => Required system package autoconf>=2.59: autoconf-2.69 found => Required system package automake>=1.8: automake-1.15 found => Required system package boost-headers>=1.34.1: boost-headers-1.63 found => Required system package boostlib-thread>=1.34.1: boost-libs-1.63.0 found => Required system package g++>=3: g++-7 found => Required system package gcc>=3: gcc-7 found => Required system package gm4>=1.4: gm4-1.4.18 found => Required system package libstdc++: libstdc++ found => Required system package libtool>=1.5.22: libtool-2.4.6 found => Required system package pkg-config>=0.22: pkg-config-1.3.12 found => Required system package python27>=2.7<2.8: python27-2.7.14 found => Required robotpkg package genom3>=2.99.30: genom3-2.99.30 found => Required robotpkg package genom3-openprs>=1.0: genom3-openprs-1.0.9r5 found => Required robotpkg package genom3-ros>=1.18: genom3-ros-1.18 found => Required robotpkg package openprs>=1.1b7: openprs-1.1b10 found => Required robotpkg package openrobots-idl>=1.5: openrobots-idl-1.5 found => Required robotpkg package ros-actionlib>=1.11<1.12: ros-actionlib-1.11.9 found => Required robotpkg package ros-comm>=1.11<1.12: ros-comm-1.11.20 found => Required robotpkg package ros-common-msgs>=1.11<1.12: ros-common-msgs-1.11.4 found => Required robotpkg package ros-ros>=1.11<1.12: ros-ros-1.11.4 found => Required robotpkg package ros-rospack>=2.2<2.3: ros-rospack-2.2.4 found => Required robotpkg package transgen3>=1.0b2: transgen3-1.0b5 found => SHA1 checksums OK => RMD160 checksums OK => Generating openprs/client => Running autoreconf for openprs/client => Generating ros/client/c => Running autoreconf for ros/client/c => Generating ros/client/ros => Running autoreconf for ros/client/ros => Generating ros/server => Running autoreconf for ros/server => Modifying GNU configure scripts to avoid --recheck => Adding run-time search paths to pkg-config files => Compiling python files => Registering installation for dptu-genom3-0.2~codels+openprs+ros-client-c+ros-client-ros+ros-server => Linking package in /opt/robotpkg/var/lib/robotpkg/packages/bsd/Fedora-26-x86_64/pub ===> Logging bulk summary for dptu-genom3-0.2~codels+openprs+ros-client-c+ros-client-ros+ros-server => Checking leftover files => Creating bulk log files => Logging bulk metadata ===> Cleaning temporary files for dptu-genom3-0.2~codels+openprs+ros-client-c+ros-client-ros+ros-server ===> Done bulk for dptu-genom3-0.2~codels+openprs+ros-client-c+ros-client-ros+ros-server [18%] Processing wip/libmove3d:libmove3d-3.22.0r1 ===> Cleaning temporary files for libmove3d-3.22.0r1 ===> Bulk building for libmove3d-3.22.0r1 => Checking for clear installation => Installing digest-20080510.tgz => Installing tnftp-20130505~ssl.tgz => Required robotpkg package digest>=20080510: digest-20080510 found => Required robotpkg package tnftp>=20091122: tnftp-20130505~ssl found => Required system package gzip: gzip-1.8 found => Required system package pax and tar archivers: pax found => Required system package pkg_install>=20110805.7: pkg_install-20110805.7 found => Dependency digest-20080510 already installed => Installing gbM-0.11~tcl.tgz WARNING: Cannot check installed version of glpk WARNING: Cannot check installed version of libXpm => Installing softMotion-libs-3.12~tcl.tgz => Dependency tnftp-20130505~ssl already installed => Building with no option. => Use the GNU C++ compiler: c++-compiler provided by g++>=3 => Use the GNU C compiler: c-compiler provided by gcc>=3 => Required system package boost-headers>=1.34.1: boost-headers-1.63 found => Required system package boostlib-filesystem>=1.34.1: boost-libs-1.63.0 found => Required system package boostlib-iostreams>=1.34.1: boost-libs-1.63.0 found => Required system package boostlib-math>=1.34.1: boost-libs-1.63.0 found => Required system package boostlib-thread>=1.34.1: boost-libs-1.63.0 found => Required system package cmake>=2.6: cmake-3.10.1 found => Required system package freeglut: freeglut found => Required system package g++>=3: g++-7 found => Required system package gcc>=3: gcc-7 found => Required system package glib2>=2.20: glib2-2.52.3 found => Required system package glpk>=4.36: glpk found => Required system package glu>=7: glu-9.0.0 found => Required system package gsl>=1: gsl-2.3 found => Required system package gts>=0.7: gts-0.7.6 found => Required system package libXpm>=3.5.7: libXpm found => Required system package libstdc++: libstdc++ found => Required system package libxml2>=2: libxml2-2.9.7 found => Required system package qhull: qhull found WARNING: Cannot check installed version of glpk WARNING: Cannot check installed version of libXpm => Required robotpkg package gbM>=0.9: gbM-0.11~tcl found => Required robotpkg package softMotion-libs>=3.10: softMotion-libs-3.12~tcl found => SHA1 checksums OK => RMD160 checksums OK An unexpected error occured. The last 10 log lines are shown below. | ^ | /local/robotpkg/var/tmp/robotpkg/wip/libmove3d/work/libmove3d-3.22.0/graspPlanning/gpConvexHull.cpp:906:32: error: cannot convert 'std::basic_istream::__istream_type {aka std::basic_istream}' to 'bool' in assignment | result= (iss >> index ); | ^ | make[2]: *** [CMakeFiles/move3d.dir/build.make:1204: CMakeFiles/move3d.dir/graspPlanning/gpConvexHull.cpp.o] Error 1 | make[2]: *** Waiting for unfinished jobs.... | make[2]: Leaving directory '/local/robotpkg/var/tmp/robotpkg/wip/libmove3d/work/libmove3d-3.22.0' | make[1]: Leaving directory '/local/robotpkg/var/tmp/robotpkg/wip/libmove3d/work/libmove3d-3.22.0' | make[1]: *** [CMakeFiles/Makefile2:71: CMakeFiles/move3d.dir/all] Error 2 | make: *** [Makefile:144: all] Error 2 For details or bug reports, check the complete log file in: /local/robotpkg/var/tmp/robotpkg/wip/libmove3d/work/build.log make[3]: *** [/local/robotpkg/var/lib/robotpkg/mk/build/build.mk:197: do-build] Error 2 make[2]: *** [/local/robotpkg/var/lib/robotpkg/mk/pkg/package.mk:42: pkg-check-installed] Error 2 => Marking libmove3d-3.22.0r1 as broken ERROR: make: *** [package] Error 2 ===> Logging bulk summary for libmove3d-3.22.0r1 => Checking leftover files => Creating bulk log files => Logging bulk metadata ===> Cleaning temporary files for libmove3d-3.22.0r1 ===> Done bulk for libmove3d-3.22.0r1 [18%] Processing wip/parametric-curves:parametric-curves-1.0.3 ===> Cleaning temporary files for parametric-curves-1.0.3 ===> Bulk building for parametric-curves-1.0.3 => Checking for clear installation => Installing digest-20080510.tgz => Installing tnftp-20130505~ssl.tgz => Required robotpkg package digest>=20080510: digest-20080510 found => Required robotpkg package tnftp>=20091122: tnftp-20130505~ssl found => Required system package gzip: gzip-1.8 found => Required system package pax and tar archivers: pax found => Required system package pkg_install>=20110805.7: pkg_install-20110805.7 found => Dependency digest-20080510 already installed => Dependency tnftp-20130505~ssl already installed => Building with no option. => Use the GNU C++ compiler: c++-compiler provided by g++>=3 => Use the GNU C compiler: c-compiler provided by gcc>=3 => Required system package cmake>=2.6: cmake-3.10.1 found => Required system package doxygen>=1.5: doxygen-1.8.13 found => Required system package g++>=3: g++-7 found => Required system package gcc>=3: gcc-7 found => Required system package graphviz>=2: graphviz-2.40.1 found => Required system package libstdc++: libstdc++ found => Required system package pdflatex: pdflatex found => Required system package pkg-config>=0.22: pkg-config-1.3.12 found => SHA1 checksums OK => RMD160 checksums OK An unexpected error occured. The last 10 log lines are shown below. | Call Stack (most recent call first): | /usr/share/cmake/Modules/FindPkgConfig.cmake:593 (_pkg_check_modules_internal) | cmake/pkg-config.cmake:288 (PKG_CHECK_MODULES) | cmake/pkg-config.cmake:512 (ADD_DEPENDENCY) | python/CMakeLists.txt:5 (ADD_COMPILE_DEPENDENCY) | | | -- Package 'eigenpy', required by 'virtual:world', not found | -- Configuring incomplete, errors occurred! | See also "/local/robotpkg/var/tmp/robotpkg/wip/parametric-curves/work/parametric-curves-1.0.3/CMakeFiles/CMakeOutput.log". For details or bug reports, check the complete log file in: => Marking parametric-curves-1.0.3 as broken /local/robotpkg/var/tmp/robotpkg/wip/parametric-curves/work/configure.log make[3]: *** [/local/robotpkg/var/lib/robotpkg/mk/configure/cmake-configure.mk:100: do-configure-cmake] Error 1 make[2]: *** [/local/robotpkg/var/lib/robotpkg/mk/pkg/package.mk:42: pkg-check-installed] Error 2 ERROR: make: *** [package] Error 2 ===> Logging bulk summary for parametric-curves-1.0.3 => Checking leftover files => Creating bulk log files => Logging bulk metadata ===> Cleaning temporary files for parametric-curves-1.0.3 ===> Done bulk for parametric-curves-1.0.3 [19%] Processing wip/mrpt:mrpt-1.2.2r2 ===> Cleaning temporary files for mrpt-1.2.2r2 ===> Bulk building for mrpt-1.2.2r2 => Checking for clear installation => Installing digest-20080510.tgz => Installing tnftp-20130505~ssl.tgz => Required robotpkg package digest>=20080510: digest-20080510 found => Required robotpkg package tnftp>=20091122: tnftp-20130505~ssl found => Required system package gzip: gzip-1.8 found => Required system package patch>=2.0: patch-2.7.5 found => Required system package pax and tar archivers: pax found => Required system package pkg_install>=20110805.7: pkg_install-20110805.7 found => Dependency digest-20080510 already installed => Dependency tnftp-20130505~ssl already installed => Building with no option. => Use the GNU C++ compiler: c++-compiler provided by g++>=3 => Use the GNU C compiler: c-compiler provided by gcc>=3 => Required system package assimp>=2.0: assimp-3.3.1 found => Required system package cmake>=2.6: cmake-3.10.1 found => Required system package doxygen>=1.5: doxygen-1.8.13 found => Required system package eigen3>=3.0.0: eigen3-3.3.4 found => Required system package freeglut: freeglut found => Required system package g++>=3: g++-7 found => Required system package gcc>=3: gcc-7 found => Required system package libjpeg: libjpeg found => Required system package libstdc++: libstdc++ found => Required system package opencv>=2.2.0: opencv-3.2.0 found => Required system package pkg-config>=0.22: pkg-config-1.3.12 found => Required system package podlators: podlators found => Required system package wxwidgets>=2.8: wxwidgets-3.0.3 found => Required system package zlib>=1.2.3: zlib-1.2.11 found => SHA1 checksums OK => RMD160 checksums OK => Applying robotpkg patches for mrpt-1.2.2r2 An unexpected error occured. The last 10 log lines are shown below. | -- Phidgets : No | -- RoboPeak LIDAR : Yes | -- SwissRanger 3/4000 3D camera : No | -- Videre SVS stereo camera : No | -- xSENS MT 3rd generation : Yes (Built-in) | -- xSENS MT 4th generation : Yes (Built-in) | -- | -- Configuring incomplete, errors occurred! | See also "/local/robotpkg/var/tmp/robotpkg/wip/mrpt/work/mrpt-1.2.2/CMakeFiles/CMakeOutput.log". | See also "/local/robotpkg/var/tmp/robotpkg/wip/mrpt/work/mrpt-1.2.2/CMakeFiles/CMakeError.log". For details or bug reports, check the complete log file in: /local/robotpkg/var/tmp/robotpkg/wip/mrpt/work/configure.log make[3]: *** [/local/robotpkg/var/lib/robotpkg/mk/configure/cmake-configure.mk:100: do-configure-cmake] Error 1 make[2]: *** [/local/robotpkg/var/lib/robotpkg/mk/pkg/package.mk:42: pkg-check-installed] Error 2 => Marking mrpt-1.2.2r2 as broken ERROR: make: *** [package] Error 2 ===> Logging bulk summary for mrpt-1.2.2r2 => Checking leftover files => Creating bulk log files => Logging bulk metadata ===> Cleaning temporary files for mrpt-1.2.2r2 ===> Done bulk for mrpt-1.2.2r2 [19%] Processing wip/pinocchio:pinocchio-1.2.6r1 ===> Cleaning temporary files for pinocchio-1.2.6r1 ===> Bulk building for pinocchio-1.2.6r1 => Checking for clear installation => Installing digest-20080510.tgz => Installing tnftp-20130505~ssl.tgz => Required robotpkg package digest>=20080510: digest-20080510 found => Required robotpkg package tnftp>=20091122: tnftp-20130505~ssl found => Required system package gzip: gzip-1.8 found => Required system package patch>=2.0: patch-2.7.5 found => Required system package pax and tar archivers: pax found => Required system package pkg_install>=20110805.7: pkg_install-20110805.7 found => Dependency digest-20080510 already installed => Installing eigenpy-1.4.0r2.tgz => Installing hpp-fcl-0.5.1r1.tgz => Dependency tnftp-20130505~ssl already installed => Installing urdfdom-0.3.0r2.tgz => Building with no option. => Use the GNU C++ compiler: c++-compiler provided by g++>=3 => Use the GNU C compiler: c-compiler provided by gcc>=3 => Use python-2.7: python>=2.5<3.7 python<3 provided by python27>=2.7<2.8 => Required system package boost-headers>=1.34.1: boost-headers-1.63 found => Required system package boostlib-filesystem>=1.34.1: boost-libs-1.63.0 found => Required system package boostlib-python>=1.34.1: boost-libs-1.63.0 found => Required system package boostlib-system>=1.34.1: boost-libs-1.63.0 found => Required system package cmake>=2.6: cmake-3.10.1 found => Required system package doxygen>=1.5: doxygen-1.8.13 found => Required system package eigen3>=3.0.0: eigen3-3.3.4 found => Required system package g++>=3: g++-7 found => Required system package gcc>=3: gcc-7 found => Required system package libstdc++: libstdc++ found => Required system package pkg-config>=0.22: pkg-config-1.3.12 found => Required system package py27-numpy>=1: py27-numpy-1.12.1 found => Required system package python27>=2.7<2.8: python27-2.7.14 found => Required system package tinyxml>=2: tinyxml-2.6.2 found => Required robotpkg package eigenpy>=1.3.1: eigenpy-1.4.0r2 found => Required robotpkg package hpp-fcl>=0.5: hpp-fcl-0.5.1r1 found => Required robotpkg package urdfdom>=0.2.8<1: urdfdom-0.3.0r2 found WARNING: Using urdfdom-0.3.0 in /opt/openrobots WARNING: The following packages may interfere with the build because they WARNING: are located in paths used by other dependencies: WARNING: urdfdom-0.4.2 in /usr => SHA1 checksums OK => RMD160 checksums OK => Applying robotpkg patches for pinocchio-1.2.6r1 => Adding run-time search paths to pkg-config files => Compiling python files => Registering installation for pinocchio-1.2.6r1 => Linking package in /opt/robotpkg/var/lib/robotpkg/packages/bsd/Fedora-26-x86_64/pub ===> Logging bulk summary for pinocchio-1.2.6r1 => Checking leftover files => Creating bulk log files => Logging bulk metadata ===> Cleaning temporary files for pinocchio-1.2.6r1 ===> Done bulk for pinocchio-1.2.6r1 [20%] Processing wip/kukaFri-libs:kukaFri-libs-1.3 ===> Bulk building for kukaFri-libs-1.3 => Bulk cancelled by /local/robotpkg/var/log/bulk/STOP ===> Done bulk for rbulk wip set --- Bulk started Thu Feb 22 09:30:26 CET 2018 --- Bulk stopped Thu Feb 22 11:01:18 CET 2018