robotpkg/wip bulk build results

Log for Fedora-24-x86_64 (Back)

--- Updating robotpkg ------------------------------------------------ Pulling /local/robotpkg/var/lib/robotpkg/wip Already up-to-date. Updating pkgtools/pkg_install ===> Updating for pkg_install-20110805.7 pkg_install-20110805.7 is already installed and up-to-date. Updating pkgtools/rbulkit ===> Updating for rbulkit-20170123 rbulkit-20170123 is already installed and up-to-date. --- Running build for bulk-rbulk-wip ----------------------------------- ===> Sorting packages for rbulk wip set Scanning wip/py-mavlink:* Scanning wip/talos-robot:* Scanning wip/orocos-dot_service:* Scanning pkgtools/tnftp:tnftp>=20130505~ssl Scanning wip/soth:* Scanning wip/pr2-pick-object:* Scanning wip/py-sot-tools-v3:* Scanning wip/hyper-viewer:* Scanning wip/urg:* Scanning wip/gerard-bauzil:* Scanning wip/jafar-rtslam:* Scanning wip/robotModelParser-libs:* Scanning wip/hrp2-computer-monitor:* Scanning wip/hatptester:* Scanning wip/laaswm-gui:* Scanning wip/move3d-studio:* Scanning wip/chilitags:* Scanning wip/talos-ros-control-sot:* Scanning wip/sot-hrp2:* Scanning wip/move3d-assets:* Scanning wip/py-dynamic-graph-v3:* Scanning wip/morse-hla:* Scanning wip/qpOASES:* Scanning wip/morse-pocolibs:* Scanning wip/talos-simulation:* Scanning wip/libmove3d-hri:* Scanning wip/py-laaswm:* Scanning wip/sot-core-v3:* Scanning wip/msgconnector:* Scanning wip/talos-data:* Scanning wip/FRILibrary:* Scanning wip/sot-application:* Scanning wip/talos-moveit-config:* Scanning wip/openhrp3-hrp2:* Scanning wip/libpointmatcher:* Scanning wip/sot-application-v3:* Scanning wip/sot-dyninv:* Scanning wip/MPC_avoidObs-genom:* [wip/MPC_avoidObs-genom:*] Warning: the LICENSE of wip/MPC_avoidObs-genom is undefined. Scanning wip/dptu-genom3:* Scanning wip/talos-pal-transmissions:* [wip/talos-pal-transmissions:*] Display something for talos-ros-controllers /local/robotpkg Scanning wip/libmove3d:* Scanning wip/py-jsbsim:* Scanning wip/morse-mavlink:* Scanning wip/dynamic-graph-bridge-v3:* Scanning wip/mhp-genom:* Scanning wip/pinocchio:* Scanning wip/mrpt:* Scanning wip/libmove3d-planners:* Scanning wip/atlaas-genom:* Scanning wip/kukaFri-libs:* Scanning wip/hatpconsole:* Scanning wip/gdalwrap:* Scanning wip/talos-ros-control:* Scanning wip/atlaas:* Scanning wip/talos-pal-hardware-interfaces:* Scanning wip/MPC_DEMTreatment-genom:* [wip/MPC_DEMTreatment-genom:*] Warning: the LICENSE of wip/MPC_DEMTreatment-genom is undefined. Scanning wip/talos-roboticsgroup-gazebo-plugins:* Scanning wip/joystick-genom:* Scanning wip/hrp2-bringup:* Scanning wip/antlr2:* Scanning wip/mavlink:* Scanning wip/libnabo:* Scanning wip/spark-genom:* Scanning wip/jointStateMapper:* Scanning wip/osg-dae:* Scanning wip/MPC_controller-genom:* [wip/MPC_controller-genom:*] Warning: the LICENSE of wip/MPC_controller-genom is undefined. Scanning wip/pal-msgs:* Scanning wip/talos-ros-controllers:* Scanning wip/sot-dynamic-pinocchio-v3:* Scanning wip/sot-romeo-v3:* Scanning wip/openhrp3-simulator-wo-rtm:* Scanning wip/hrp2-14-description:* Scanning wip/talos-pal-hardware-gazebo:* Scanning wip/eigen-quadprog:* Scanning wip/jafar-qdisplay:* Scanning wip/octovis:* Scanning wip/hyper:* Scanning wip/talos-gazebo-ros-control:* Scanning wip/libfreenect:* Scanning wip/jsbsim:* Scanning wip/talos-pal-gazebo-plugins:* Scanning wip/track-target-genom:* Scanning wip/MPC_planner-genom:* [wip/MPC_planner-genom:*] Warning: the LICENSE of wip/MPC_planner-genom is undefined. Scanning wip/gladys:* Scanning wip/hatponboard-lib:* Scanning wip/orocos-yarp_transport:* Scanning middleware/orocos-rtt:orocos-rtt>=2.5 Scanning wip/sot-dyninv-v3:* Scanning wip/can-utils:* Scanning wip/libhatp:* Scanning wip/tsid:* Scanning wip/roralink:* Scanning wip/metapod:* [wip/metapod:*] Warning: DOXYGEN_PLIST_DIR in wip/metapod is deprecated. [wip/metapod:*] Warning: use DYNAMIC_PLIST_DIRS instead. Scanning wip/sot-pattern-generator-v3:* Scanning wip/jrl-walkgen-v3:* Scanning wip/simple-humanoid-description:* Scanning wip/hri-simulation:* Scanning wip/certi:* Scanning wip/ompl:* Scanning wip/sot-hrp2-v3:* Scanning wip/dynamic-graph-v3:* Scanning wip/morse-ros:* Scanning wip/vnet-yarp:* Scanning wip/sot-talos:* Scanning wip/mumps:* Scanning wip/histodet:* Scanning wip/orocos-bfl:* Scanning wip/sot-hrprtc-hrp2:* Scanning wip/py-hla:* Scanning wip/hyper-genom-plugin:* Scanning wip/py-eigen:* Scanning wip/hrp2-machine:* Scanning wip/py-morse:* Scanning wip/lua-rfsm:* Scanning wip/MPC:* Scanning wip/py-hla:py35-hla-1.1.1r1 Scanning wip/py-jsbsim:py35-jsbsim-20150424r1 Scanning wip/dptu-genom3:dptu-genom3-0.2~codels+openprs+ros-client-c+ros-client-ros+ros-server+!* Scanning wip/dptu-genom3:dptu-genom3-0.2~codels+pocolibs-client-c+openprs+pocolibs-server+!* Scanning wip/jafar-rtslam:~MTI Scanning wip/py-mavlink:py35-mavlink-1.1.62 Scanned 256 packages (213 unique) [0%] Processing wip/ompl:ompl-1.0.0 ===> Cleaning temporary files for ompl-1.0.0 ===> Bulk building for ompl-1.0.0 => Checking for clear installation => Installing digest-20080510.tgz => Installing tnftp-20130505~ssl.tgz => Required robotpkg package digest>=20080510: digest-20080510 found => Required robotpkg package tnftp>=20130505~ssl: tnftp-20130505~ssl found => Required system package gzip: gzip-1.6 found => Required system package pax and tar archivers: pax found => Required system package pkg_install>=20110805.7: pkg_install-20110805.7 found => Dependency digest-20080510 already installed => Dependency tnftp-20130505~ssl already installed => Building with no option. => Use the GNU C++ compiler: c++-compiler provided by g++>=3 => Use the GNU C compiler: c-compiler provided by gcc>=3 => Required system package boost-headers>=1.34.1: boost-headers-1.60 found => Required system package boostlib-filesystem>=1.34.1: boost-libs-1.60.0 found => Required system package boostlib-iostreams>=1.34.1: boost-libs-1.60.0 found => Required system package boostlib-math>=1.34.1: boost-libs-1.60.0 found => Required system package boostlib-thread>=1.34.1: boost-libs-1.60.0 found => Required system package cmake>=2.8.7: cmake-3.9.0 found => Required system package g++>=3: g++-6.3.1 found => Required system package gcc>=3: gcc-6.3.1 found => Required system package libstdc++: libstdc++ found => SHA1 checksums OK => RMD160 checksums OK An unexpected error occured. The last 10 log lines are shown below. | ^~~~~~~~~~~~~~~~~~~~ | src/ompl/CMakeFiles/ompl.dir/build.make:2201: recipe for target 'src/ompl/CMakeFiles/ompl.dir/control/planners/syclop/src/Syclop.cpp.o' failed | make[2]: *** [src/ompl/CMakeFiles/ompl.dir/control/planners/syclop/src/Syclop.cpp.o] Error 1 | make[2]: *** Waiting for unfinished jobs.... | make[2]: Leaving directory '/local/robotpkg/var/tmp/robotpkg/wip/ompl/work/ompl-1.0.0-Source' | make[1]: *** [src/ompl/CMakeFiles/ompl.dir/all] Error 2 | make: *** [all] Error 2 | CMakeFiles/Makefile2:221: recipe for target 'src/ompl/CMakeFiles/ompl.dir/all' failed | make[1]: Leaving directory '/local/robotpkg/var/tmp/robotpkg/wip/ompl/work/ompl-1.0.0-Source' | Makefile:165: recipe for target 'all' failed For details or bug reports, check the complete log file in: /local/robotpkg/var/tmp/robotpkg/wip/ompl/work/build.log make[3]: *** [do-build] Error 1 make[2]: *** [pkg-check-installed] Error 2 => Marking ompl-1.0.0 as broken ERROR: make: *** [package] Error 2 ===> Logging bulk summary for ompl-1.0.0 => Checking leftover files => Creating bulk log files => Logging bulk metadata ===> Cleaning temporary files for ompl-1.0.0 ===> Done bulk for ompl-1.0.0 [0%] Processing wip/certi:certi-3.5.1 ===> Bulk building for certi-3.5.1 Binary package for certi-3.5.1 is up-to-date. [0%] Processing wip/dynamic-graph-v3:dynamic-graph-v3-3.0.1 ===> Bulk building for dynamic-graph-v3-3.0.1 Binary package for dynamic-graph-v3-3.0.1 is up-to-date. [1%] Processing wip/morse-ros:morse-ros-1.4 ===> Cleaning temporary files for morse-ros-1.4 ===> Bulk building for morse-ros-1.4 => Checking for clear installation => Installing digest-20080510.tgz => Installing tnftp-20130505~ssl.tgz => Required robotpkg package digest>=20080510: digest-20080510 found => Required robotpkg package tnftp>=20091122: tnftp-20130505~ssl found => Required system package gzip: gzip-1.6 found => Required system package patch>=2.0: patch-2.7.5 found => Required system package pax and tar archivers: pax found => Required system package pkg_install>=20110805.7: pkg_install-20110805.7 found => Dependency digest-20080510 already installed => Installing morse-1.4~doc.tgz => Installing py35-catkin-pkg-0.2.4.tgz => Required system package py35-yaml>=3: MISSING => Dependency tnftp-20130505~ssl already installed ERROR: ====================================================================== ERROR: Missing system packages required for morse-ros-1.4: ERROR: ERROR: py35-yaml>=3 ERROR: ERROR: Please use the system package management tool to install these ERROR: dependencies. If a robotpkg version of a dependency is available, ERROR: you can configure robotpkg.conf to use this version instead. ERROR: ERROR: See /local/robotpkg/var/tmp/robotpkg/wip/morse-ros/work/sysdep.log for details. ERROR: ====================================================================== make[2]: *** [sys-depends] Error 2 ===> Logging bulk summary for morse-ros-1.4 => Checking leftover files => Creating bulk log files => Logging bulk metadata ===> Cleaning temporary files for morse-ros-1.4 ===> Done bulk for morse-ros-1.4 [1%] Processing wip/vnet-yarp:vnet-yarp-0.2r2 ===> Cleaning temporary files for vnet-yarp-0.2r2 ===> Bulk building for vnet-yarp-0.2r2 => Checking for clear installation => Installing digest-20080510.tgz => Installing tnftp-20130505~ssl.tgz => Required robotpkg package digest>=20080510: digest-20080510 found => Required robotpkg package tnftp>=20091122: tnftp-20130505~ssl found => Required system package gzip: gzip-1.6 found => Required system package patch>=2.0: patch-2.7.5 found => Required system package pax and tar archivers: pax found => Required system package pkg_install>=20110805.7: pkg_install-20110805.7 found => Installing ace-6.0.4r2.tgz => Dependency digest-20080510 already installed => Dependency tnftp-20130505~ssl already installed => Installing yarp-2.3.64r3~gui.tgz => Building with no option. => Use the GNU C++ compiler: c++-compiler provided by g++>=3 => Use the GNU C compiler: c-compiler provided by gcc>=3 => Required system package boost-headers>=1.34.1: boost-headers-1.60 found => Required system package boostlib-filesystem>=1.43: boost-libs-1.60.0 found => Required system package boostlib-iostreams>=1.43: boost-libs-1.60.0 found => Required system package boostlib-math>=1.43: boost-libs-1.60.0 found => Required system package boostlib-thread>=1.43: boost-libs-1.60.0 found => Required system package cmake>=2.6: cmake-3.9.0 found => Required system package g++>=3: g++-6.3.1 found => Required system package gcc>=3: gcc-6.3.1 found => Required system package libstdc++: libstdc++ found => Required system package pkg-config>=0.22: pkg-config-0.29 found => Required robotpkg package ace>=5.6: ace-6.0.4r2 found => Required robotpkg package yarp>=2.3.1: yarp-2.3.64r3~gui found => SHA1 checksums OK => RMD160 checksums OK => Applying robotpkg patches for vnet-yarp-0.2r2 An unexpected error occured. The last 10 log lines are shown below. | /usr/lib64/libpthread.so.0: error adding symbols: DSO missing from command line | collect2: error: ld returned 1 exit status | make[2]: *** [vnet] Error 1 | make[1]: *** [CMakeFiles/vnet.dir/all] Error 2 | make: *** [all] Error 2 | CMakeFiles/vnet.dir/build.make:109: recipe for target 'vnet' failed | make[2]: Leaving directory '/local/robotpkg/var/tmp/robotpkg/wip/vnet-yarp/work/vnet-yarp-0.2' | CMakeFiles/Makefile2:144: recipe for target 'CMakeFiles/vnet.dir/all' failed | make[1]: Leaving directory '/local/robotpkg/var/tmp/robotpkg/wip/vnet-yarp/work/vnet-yarp-0.2' | Makefile:143: recipe for target 'all' failed For details or bug reports, check the complete log file in: /local/robotpkg/var/tmp/robotpkg/wip/vnet-yarp/work/build.log make[3]: *** [do-build] Error 1 make[2]: *** [pkg-check-installed] Error 2 => Marking vnet-yarp-0.2r2 as broken ERROR: make: *** [package] Error 2 ===> Logging bulk summary for vnet-yarp-0.2r2 => Checking leftover files => Creating bulk log files => Logging bulk metadata ===> Cleaning temporary files for vnet-yarp-0.2r2 ===> Done bulk for vnet-yarp-0.2r2 [2%] Processing wip/orocos-bfl:orocos-bfl-0.8.0 ===> Bulk building for orocos-bfl-0.8.0 Binary package for orocos-bfl-0.8.0 is up-to-date. [2%] Processing wip/histodet:histodet-1.0r2 ===> Bulk building for histodet-1.0r2 Binary package for histodet-1.0r2 is up-to-date. [3%] Processing wip/mumps:mumps-4.10.0 ===> Bulk building for mumps-4.10.0 Binary package for mumps-4.10.0 is up-to-date. [3%] Processing wip/py-eigen:eigenpy-1.3.3 ===> Bulk building for eigenpy-1.3.3 Binary package for eigenpy-1.3.3 is up-to-date. [4%] Processing wip/py-hla:py35-hla-1.1.1r1 ===> Cleaning temporary files for py35-hla-1.1.1r1 ===> Bulk building for py35-hla-1.1.1r1 => Checking for clear installation => Installing digest-20080510.tgz => Installing tnftp-20130505~ssl.tgz => Required robotpkg package digest>=20080510: digest-20080510 found => Required robotpkg package tnftp>=20091122: tnftp-20130505~ssl found => Required system package gzip: gzip-1.6 found => Required system package patch>=2.0: patch-2.7.5 found => Required system package pax and tar archivers: pax found => Required system package pkg_install>=20110805.7: pkg_install-20110805.7 found => Installing certi-3.5.1.tgz => Dependency digest-20080510 already installed => Dependency tnftp-20130505~ssl already installed => Building with no option. => Use the GNU C++ compiler: c++-compiler provided by g++>=3 => Use the GNU C compiler: c-compiler provided by gcc>=3 => Use python-3.5: python>=2.5<3.7 provided by python35>=3.5<3.6 => Required system package cmake>=2.6: cmake-3.9.0 found => Required system package g++>=3: g++-6.3.1 found => Required system package gcc>=3: gcc-6.3.1 found => Required system package libstdc++: libstdc++ found => Required system package python35>=3.5<3.6: python35-3.5.3 found => Required robotpkg package certi>=3.4.0: certi-3.5.1 found => SHA1 checksums OK => RMD160 checksums OK => Applying robotpkg patches for py35-hla-1.1.1r1 => Compiling python files robotpkg_create: can't stat `/opt/openrobots/lib/python3.5/site-packages/hla/__pycache__/__init__.cpython-35.pyo' robotpkg_create: can't stat `/opt/openrobots/lib/python3.5/site-packages/hla/omt/__pycache__/__init__.cpython-35.pyo' robotpkg_create: can't stat `/opt/openrobots/lib/python3.5/site-packages/hla/omt/__pycache__/array.cpython-35.pyo' robotpkg_create: can't stat `/opt/openrobots/lib/python3.5/site-packages/hla/omt/__pycache__/basic.cpython-35.pyo' robotpkg_create: can't stat `/opt/openrobots/lib/python3.5/site-packages/hla/omt/__pycache__/enumerated.cpython-35.pyo' robotpkg_create: can't stat `/opt/openrobots/lib/python3.5/site-packages/hla/omt/__pycache__/record.cpython-35.pyo' robotpkg_create: can't stat `/opt/openrobots/lib/python3.5/site-packages/hla/rti/__pycache__/__init__.cpython-35.pyo' => Registering installation for py35-hla-1.1.1r1 robotpkg_admin: py35-hla-1.1.1r1: File `/opt/openrobots/lib/python3.5/site-packages/hla/__pycache__/__init__.cpython-35.pyo' is in +CONTENTS but not on filesystem! robotpkg_admin: py35-hla-1.1.1r1: File `/opt/openrobots/lib/python3.5/site-packages/hla/omt/__pycache__/__init__.cpython-35.pyo' is in +CONTENTS but not on filesystem! robotpkg_admin: py35-hla-1.1.1r1: File `/opt/openrobots/lib/python3.5/site-packages/hla/omt/__pycache__/array.cpython-35.pyo' is in +CONTENTS but not on filesystem! robotpkg_admin: py35-hla-1.1.1r1: File `/opt/openrobots/lib/python3.5/site-packages/hla/omt/__pycache__/basic.cpython-35.pyo' is in +CONTENTS but not on filesystem! robotpkg_admin: py35-hla-1.1.1r1: File `/opt/openrobots/lib/python3.5/site-packages/hla/omt/__pycache__/enumerated.cpython-35.pyo' is in +CONTENTS but not on filesystem! robotpkg_admin: py35-hla-1.1.1r1: File `/opt/openrobots/lib/python3.5/site-packages/hla/omt/__pycache__/record.cpython-35.pyo' is in +CONTENTS but not on filesystem! robotpkg_admin: py35-hla-1.1.1r1: File `/opt/openrobots/lib/python3.5/site-packages/hla/rti/__pycache__/__init__.cpython-35.pyo' is in +CONTENTS but not on filesystem! robotpkg_create: can't stat `/opt/openrobots/lib/python3.5/site-packages/hla/__pycache__/__init__.cpython-35.pyo' robotpkg_create: can't stat `/opt/openrobots/lib/python3.5/site-packages/hla/omt/__pycache__/__init__.cpython-35.pyo' robotpkg_create: can't stat `/opt/openrobots/lib/python3.5/site-packages/hla/omt/__pycache__/array.cpython-35.pyo' robotpkg_create: can't stat `/opt/openrobots/lib/python3.5/site-packages/hla/omt/__pycache__/basic.cpython-35.pyo' robotpkg_create: can't stat `/opt/openrobots/lib/python3.5/site-packages/hla/omt/__pycache__/enumerated.cpython-35.pyo' robotpkg_create: can't stat `/opt/openrobots/lib/python3.5/site-packages/hla/omt/__pycache__/record.cpython-35.pyo' robotpkg_create: can't stat `/opt/openrobots/lib/python3.5/site-packages/hla/rti/__pycache__/__init__.cpython-35.pyo' robotpkg_create: lstat failed for file lib/python3.5/site-packages/hla/__pycache__/__init__.cpython-35.pyo: No such file or directory make[2]: *** [pkg-tarup] Error 2 => Marking py35-hla-1.1.1r1 as broken ERROR: make: *** [package] Error 2 robotpkg_delete: Couldn't remove /opt/openrobots/lib/python3.5/site-packages/hla/__pycache__/__init__.cpython-35.pyo robotpkg_delete: Couldn't remove /opt/openrobots/lib/python3.5/site-packages/hla/omt/__pycache__/__init__.cpython-35.pyo robotpkg_delete: Couldn't remove /opt/openrobots/lib/python3.5/site-packages/hla/omt/__pycache__/array.cpython-35.pyo robotpkg_delete: Couldn't remove /opt/openrobots/lib/python3.5/site-packages/hla/omt/__pycache__/basic.cpython-35.pyo robotpkg_delete: Couldn't remove /opt/openrobots/lib/python3.5/site-packages/hla/omt/__pycache__/enumerated.cpython-35.pyo robotpkg_delete: Couldn't remove /opt/openrobots/lib/python3.5/site-packages/hla/omt/__pycache__/record.cpython-35.pyo robotpkg_delete: Couldn't remove /opt/openrobots/lib/python3.5/site-packages/hla/rti/__pycache__/__init__.cpython-35.pyo ===> Logging bulk summary for py35-hla-1.1.1r1 => Checking leftover files => Creating bulk log files => Logging bulk metadata ===> Cleaning temporary files for py35-hla-1.1.1r1 ===> Done bulk for py35-hla-1.1.1r1 [4%] Processing wip/py-hla:py27-hla-1.1.1r1 ===> Bulk building for py27-hla-1.1.1r1 Binary package for py27-hla-1.1.1r1 is up-to-date. [5%] Processing wip/py-morse:py35-morse-1.4 ===> Bulk building for py35-morse-1.4 Binary package for py35-morse-1.4 is up-to-date. [5%] Processing wip/hrp2-machine:hrp2-machine-1.0.2 ===> Bulk building for hrp2-machine-1.0.2 Binary package for hrp2-machine-1.0.2 is up-to-date. [6%] Processing wip/lua-rfsm:lua-rfsm-20131212.44fcec2db5r2 ===> Bulk building for lua-rfsm-20131212.44fcec2db5r2 Binary package for lua-rfsm-20131212.44fcec2db5r2 is up-to-date. [6%] Processing wip/MPC:MPC-1.0r2 ===> Cleaning temporary files for MPC-1.0r2 ===> Bulk building for MPC-1.0r2 => Checking for clear installation => Installing digest-20080510.tgz => Installing tnftp-20130505~ssl.tgz => Required robotpkg package digest>=20080510: digest-20080510 found => Required robotpkg package tnftp>=20091122: tnftp-20130505~ssl found => Required system package gzip: gzip-1.6 found => Required system package patch>=2.0: patch-2.7.5 found => Required system package pax and tar archivers: pax found => Required system package pkg_install>=20110805.7: pkg_install-20110805.7 found => Dependency digest-20080510 already installed => Dependency tnftp-20130505~ssl already installed => Building with no option. => Use the GNU C++ compiler: c++-compiler provided by g++>=3 => Use the GNU C compiler: c-compiler provided by gcc>=3 => Required system package boost-headers>=1.34.1: boost-headers-1.60 found => Required system package boostlib-filesystem>=1.34.1: boost-libs-1.60.0 found => Required system package boostlib-iostreams>=1.34.1: boost-libs-1.60.0 found => Required system package boostlib-math>=1.34.1: boost-libs-1.60.0 found => Required system package boostlib-thread>=1.34.1: boost-libs-1.60.0 found => Required system package cmake>=2.6: cmake-3.9.0 found => Required system package freeglut: freeglut found => Required system package g++>=3: g++-6.3.1 found => Required system package gcc>=3: gcc-6.3.1 found => Required system package glib2>=2.20: glib2-2.48.2 found => Required system package glu>=7: glu-9.0.0 found => Required system package libX11>=1: libX11-1.6.3 found => Required system package libstdc++: libstdc++ found => Required system package mesa>=6.5: mesa-12.0.3 found => Required system package pkg-config>=0.22: pkg-config-0.29 found => SHA1 checksums OK => RMD160 checksums OK => Applying robotpkg patches for MPC-1.0r2 An unexpected error occured. The last 10 log lines are shown below. | ^~~~~~~~~~~ | /local/robotpkg/var/tmp/robotpkg/wip/MPC/work/MPC-1.0/MPC/core/./trajGen/inc/TrajGen.hpp:91:34: error: 'constexpr' needed for in-class initialization of static data member 'const double mpc::TrajGen::UnSurE' of non-integral type [-fpermissive] | static const double UnSurE = 1000000000.0; /**< great value for computation of the derivatives by finite differences */ | ^~~~~~~~~~~~ | core/CMakeFiles/MPC-core.dir/build.make:1790: recipe for target 'core/CMakeFiles/MPC-core.dir/planner/src/RoadMapTP.cpp.o' failed | make[2]: *** [core/CMakeFiles/MPC-core.dir/planner/src/RoadMapTP.cpp.o] Error 1 | CMakeFiles/Makefile2:135: recipe for target 'core/CMakeFiles/MPC-core.dir/all' failed | Makefile:129: recipe for target 'all' failed | make[1]: *** [core/CMakeFiles/MPC-core.dir/all] Error 2 | make: *** [all] Error 2 For details or bug reports, check the complete log file in: /local/robotpkg/var/tmp/robotpkg/wip/MPC/work/build.log make[3]: *** [do-build] Error 1 make[2]: *** [pkg-check-installed] Error 2 => Marking MPC-1.0r2 as broken ERROR: make: *** [package] Error 2 ===> Logging bulk summary for MPC-1.0r2 => Checking leftover files => Creating bulk log files => Logging bulk metadata ===> Cleaning temporary files for MPC-1.0r2 ===> Done bulk for MPC-1.0r2 [7%] Processing wip/py-mavlink:py27-mavlink-1.1.62 ===> Bulk building for py27-mavlink-1.1.62 Binary package for py27-mavlink-1.1.62 is up-to-date. [7%] Processing wip/py-mavlink:py35-mavlink-1.1.62 ===> Cleaning temporary files for py35-mavlink-1.1.62 ===> Bulk building for py35-mavlink-1.1.62 => Checking for clear installation => Installing digest-20080510.tgz => Installing tnftp-20130505~ssl.tgz => Required robotpkg package digest>=20080510: digest-20080510 found => Required robotpkg package tnftp>=20091122: tnftp-20130505~ssl found => Required system package git>=1.6: git-2.7.5 found => Required system package gzip: gzip-1.6 found => Required system package pax and tar archivers: pax found => Required system package pkg_install>=20110805.7: pkg_install-20110805.7 found => Dependency digest-20080510 already installed => Dependency tnftp-20130505~ssl already installed => Building with no option. => Use the GNU C compiler: c-compiler provided by gcc>=3 => Use python-3.5: python>=2.5<3.7 provided by python35>=3.5<3.6 => Required system package gcc>=3: gcc-6.3.1 found => Required system package python35>=3.5<3.6: python35-3.5.3 found => SHA1 checksums OK => RMD160 checksums OK => Compiling python files File "/opt/openrobots/lib/python3.5/site-packages/pymavlink/generator/lib/genxmlif/__init__.py", line 81 raise AttributeError, "Unknown XML interface: %s" %(xmlIf) ^ SyntaxError: invalid syntax File "/opt/openrobots/lib/python3.5/site-packages/pymavlink/generator/lib/genxmlif/xmlif4Dom.py", line 58 print "Using 4Dom interface module..." ^ SyntaxError: Missing parentheses in call to 'print' File "/opt/openrobots/lib/python3.5/site-packages/pymavlink/generator/lib/genxmlif/xmlifApi.py", line 370 raise AttributeError, "Attribute %s not found!" %(repr(tupleOrAttrName)) ^ SyntaxError: invalid syntax File "/opt/openrobots/lib/python3.5/site-packages/pymavlink/generator/lib/genxmlif/xmlifDom.py", line 69 print "Xinclude: %s" %href ^ SyntaxError: Missing parentheses in call to 'print' File "/opt/openrobots/lib/python3.5/site-packages/pymavlink/generator/lib/genxmlif/xmlifElementTree.py", line 72 print "Using elementtree interface module..." ^ SyntaxError: Missing parentheses in call to 'print' File "/opt/openrobots/lib/python3.5/site-packages/pymavlink/generator/lib/genxmlif/xmlifMinidom.py", line 63 print "Using minidom interface module..." ^ SyntaxError: Missing parentheses in call to 'print' File "/opt/openrobots/lib/python3.5/site-packages/pymavlink/generator/lib/genxmlif/xmlifUtils.py", line 193 raise LookupError, "Prefix for namespaceURI '%s' not found!" % (ns) ^ SyntaxError: invalid syntax File "/opt/openrobots/lib/python3.5/site-packages/pymavlink/generator/lib/genxmlif/xmliftest.py", line 12 print xmlTree.printTree(prettyPrint=1) ^ SyntaxError: invalid syntax File "/opt/openrobots/lib/python3.5/site-packages/pymavlink/generator/lib/minixsv/minixsvWrapper.py", line 36 print validSyntaxText ^ SyntaxError: Missing parentheses in call to 'print' File "/opt/openrobots/lib/python3.5/site-packages/pymavlink/generator/lib/minixsv/pyxsval.py", line 93 raise KeyError, "xmlIfKey %s already implemented!" %(xmlIfKey) ^ SyntaxError: invalid syntax File "/opt/openrobots/lib/python3.5/site-packages/pymavlink/generator/lib/minixsv/xsvalBase.py", line 135 except TagException, errInst: ^ SyntaxError: invalid syntax File "/opt/openrobots/lib/python3.5/site-packages/pymavlink/generator/lib/minixsv/xsvalErrorHandler.py", line 122 print string.join (self.infoDict.keys(), "n") ^ SyntaxError: invalid syntax File "/opt/openrobots/lib/python3.5/site-packages/pymavlink/generator/lib/minixsv/xsvalSchema.py", line 431 except TagException, errInst: ^ SyntaxError: invalid syntax File "/opt/openrobots/lib/python3.5/site-packages/pymavlink/generator/lib/minixsv/xsvalSimpleTypes.py", line 78 except BaseTypeError, errstr: ^ SyntaxError: invalid syntax File "/opt/openrobots/lib/python3.5/site-packages/pymavlink/generator/lib/minixsv/xsvalUtils.py", line 48 r"Cc" : ur"x00-x1fx7f-x9f", ^ SyntaxError: invalid syntax File "/opt/openrobots/lib/python3.5/site-packages/pymavlink/generator/lib/genxmlif/__init__.py", line 81 raise AttributeError, "Unknown XML interface: %s" %(xmlIf) ^ SyntaxError: invalid syntax File "/opt/openrobots/lib/python3.5/site-packages/pymavlink/generator/lib/genxmlif/xmlif4Dom.py", line 58 print "Using 4Dom interface module..." ^ SyntaxError: Missing parentheses in call to 'print' File "/opt/openrobots/lib/python3.5/site-packages/pymavlink/generator/lib/genxmlif/xmlifApi.py", line 370 raise AttributeError, "Attribute %s not found!" %(repr(tupleOrAttrName)) ^ SyntaxError: invalid syntax File "/opt/openrobots/lib/python3.5/site-packages/pymavlink/generator/lib/genxmlif/xmlifDom.py", line 69 print "Xinclude: %s" %href ^ SyntaxError: Missing parentheses in call to 'print' File "/opt/openrobots/lib/python3.5/site-packages/pymavlink/generator/lib/genxmlif/xmlifElementTree.py", line 72 print "Using elementtree interface module..." ^ SyntaxError: Missing parentheses in call to 'print' File "/opt/openrobots/lib/python3.5/site-packages/pymavlink/generator/lib/genxmlif/xmlifMinidom.py", line 63 print "Using minidom interface module..." ^ SyntaxError: Missing parentheses in call to 'print' File "/opt/openrobots/lib/python3.5/site-packages/pymavlink/generator/lib/genxmlif/xmlifUtils.py", line 193 raise LookupError, "Prefix for namespaceURI '%s' not found!" % (ns) ^ SyntaxError: invalid syntax File "/opt/openrobots/lib/python3.5/site-packages/pymavlink/generator/lib/genxmlif/xmliftest.py", line 12 print xmlTree.printTree(prettyPrint=1) ^ SyntaxError: invalid syntax File "/opt/openrobots/lib/python3.5/site-packages/pymavlink/generator/lib/minixsv/minixsvWrapper.py", line 36 print validSyntaxText ^ SyntaxError: Missing parentheses in call to 'print' File "/opt/openrobots/lib/python3.5/site-packages/pymavlink/generator/lib/minixsv/pyxsval.py", line 93 raise KeyError, "xmlIfKey %s already implemented!" %(xmlIfKey) ^ SyntaxError: invalid syntax File "/opt/openrobots/lib/python3.5/site-packages/pymavlink/generator/lib/minixsv/xsvalBase.py", line 135 except TagException, errInst: ^ SyntaxError: invalid syntax File "/opt/openrobots/lib/python3.5/site-packages/pymavlink/generator/lib/minixsv/xsvalErrorHandler.py", line 122 print string.join (self.infoDict.keys(), "n") ^ SyntaxError: invalid syntax File "/opt/openrobots/lib/python3.5/site-packages/pymavlink/generator/lib/minixsv/xsvalSchema.py", line 431 except TagException, errInst: ^ SyntaxError: invalid syntax File "/opt/openrobots/lib/python3.5/site-packages/pymavlink/generator/lib/minixsv/xsvalSimpleTypes.py", line 78 except BaseTypeError, errstr: ^ SyntaxError: invalid syntax File "/opt/openrobots/lib/python3.5/site-packages/pymavlink/generator/lib/minixsv/xsvalUtils.py", line 48 r"Cc" : ur"x00-x1fx7f-x9f", ^ SyntaxError: invalid syntax robotpkg_create: can't stat `/opt/openrobots/lib/python3.5/site-packages/mavnative.so' robotpkg_create: can't stat `/opt/openrobots/lib/python3.5/site-packages/pymavlink/generator/lib/genxmlif/__pycache__/__init__.cpython-35.pyc' robotpkg_create: can't stat `/opt/openrobots/lib/python3.5/site-packages/pymavlink/generator/lib/genxmlif/__pycache__/__init__.cpython-35.opt-1.pyc' robotpkg_create: can't stat `/opt/openrobots/lib/python3.5/site-packages/pymavlink/generator/lib/genxmlif/__pycache__/xmlif4Dom.cpython-35.pyc' robotpkg_create: can't stat `/opt/openrobots/lib/python3.5/site-packages/pymavlink/generator/lib/genxmlif/__pycache__/xmlif4Dom.cpython-35.opt-1.pyc' robotpkg_create: can't stat `/opt/openrobots/lib/python3.5/site-packages/pymavlink/generator/lib/genxmlif/__pycache__/xmlifApi.cpython-35.pyc' robotpkg_create: can't stat `/opt/openrobots/lib/python3.5/site-packages/pymavlink/generator/lib/genxmlif/__pycache__/xmlifApi.cpython-35.opt-1.pyc' robotpkg_create: can't stat `/opt/openrobots/lib/python3.5/site-packages/pymavlink/generator/lib/genxmlif/__pycache__/xmlifDom.cpython-35.pyc' robotpkg_create: can't stat `/opt/openrobots/lib/python3.5/site-packages/pymavlink/generator/lib/genxmlif/__pycache__/xmlifDom.cpython-35.opt-1.pyc' robotpkg_create: can't stat `/opt/openrobots/lib/python3.5/site-packages/pymavlink/generator/lib/genxmlif/__pycache__/xmlifElementTree.cpython-35.pyc' robotpkg_create: can't stat `/opt/openrobots/lib/python3.5/site-packages/pymavlink/generator/lib/genxmlif/__pycache__/xmlifElementTree.cpython-35.opt-1.pyc' robotpkg_create: can't stat `/opt/openrobots/lib/python3.5/site-packages/pymavlink/generator/lib/genxmlif/__pycache__/xmlifMinidom.cpython-35.pyc' robotpkg_create: can't stat `/opt/openrobots/lib/python3.5/site-packages/pymavlink/generator/lib/genxmlif/__pycache__/xmlifMinidom.cpython-35.opt-1.pyc' robotpkg_create: can't stat `/opt/openrobots/lib/python3.5/site-packages/pymavlink/generator/lib/genxmlif/__pycache__/xmlifUtils.cpython-35.pyc' robotpkg_create: can't stat `/opt/openrobots/lib/python3.5/site-packages/pymavlink/generator/lib/genxmlif/__pycache__/xmlifUtils.cpython-35.opt-1.pyc' robotpkg_create: can't stat `/opt/openrobots/lib/python3.5/site-packages/pymavlink/generator/lib/genxmlif/__pycache__/xmliftest.cpython-35.pyc' robotpkg_create: can't stat `/opt/openrobots/lib/python3.5/site-packages/pymavlink/generator/lib/genxmlif/__pycache__/xmliftest.cpython-35.opt-1.pyc' robotpkg_create: can't stat `/opt/openrobots/lib/python3.5/site-packages/pymavlink/generator/lib/minixsv/__pycache__/minixsvWrapper.cpython-35.pyc' robotpkg_create: can't stat `/opt/openrobots/lib/python3.5/site-packages/pymavlink/generator/lib/minixsv/__pycache__/minixsvWrapper.cpython-35.opt-1.pyc' robotpkg_create: can't stat `/opt/openrobots/lib/python3.5/site-packages/pymavlink/generator/lib/minixsv/__pycache__/pyxsval.cpython-35.pyc' robotpkg_create: can't stat `/opt/openrobots/lib/python3.5/site-packages/pymavlink/generator/lib/minixsv/__pycache__/pyxsval.cpython-35.opt-1.pyc' robotpkg_create: can't stat `/opt/openrobots/lib/python3.5/site-packages/pymavlink/generator/lib/minixsv/__pycache__/xsvalBase.cpython-35.pyc' robotpkg_create: can't stat `/opt/openrobots/lib/python3.5/site-packages/pymavlink/generator/lib/minixsv/__pycache__/xsvalBase.cpython-35.opt-1.pyc' robotpkg_create: can't stat `/opt/openrobots/lib/python3.5/site-packages/pymavlink/generator/lib/minixsv/__pycache__/xsvalErrorHandler.cpython-35.pyc' robotpkg_create: can't stat `/opt/openrobots/lib/python3.5/site-packages/pymavlink/generator/lib/minixsv/__pycache__/xsvalErrorHandler.cpython-35.opt-1.pyc' robotpkg_create: can't stat `/opt/openrobots/lib/python3.5/site-packages/pymavlink/generator/lib/minixsv/__pycache__/xsvalSchema.cpython-35.pyc' robotpkg_create: can't stat `/opt/openrobots/lib/python3.5/site-packages/pymavlink/generator/lib/minixsv/__pycache__/xsvalSchema.cpython-35.opt-1.pyc' robotpkg_create: can't stat `/opt/openrobots/lib/python3.5/site-packages/pymavlink/generator/lib/minixsv/__pycache__/xsvalSimpleTypes.cpython-35.pyc' robotpkg_create: can't stat `/opt/openrobots/lib/python3.5/site-packages/pymavlink/generator/lib/minixsv/__pycache__/xsvalSimpleTypes.cpython-35.opt-1.pyc' robotpkg_create: can't stat `/opt/openrobots/lib/python3.5/site-packages/pymavlink/generator/lib/minixsv/__pycache__/xsvalUtils.cpython-35.pyc' robotpkg_create: can't stat `/opt/openrobots/lib/python3.5/site-packages/pymavlink/generator/lib/minixsv/__pycache__/xsvalUtils.cpython-35.opt-1.pyc' => Registering installation for py35-mavlink-1.1.62 robotpkg_admin: py35-mavlink-1.1.62: File `/opt/openrobots/lib/python3.5/site-packages/mavnative.so' is in +CONTENTS but not on filesystem! robotpkg_admin: py35-mavlink-1.1.62: File `/opt/openrobots/lib/python3.5/site-packages/pymavlink/generator/lib/genxmlif/__pycache__/__init__.cpython-35.pyc' is in +CONTENTS but not on filesystem! robotpkg_admin: py35-mavlink-1.1.62: File `/opt/openrobots/lib/python3.5/site-packages/pymavlink/generator/lib/genxmlif/__pycache__/__init__.cpython-35.opt-1.pyc' is in +CONTENTS but not on filesystem! robotpkg_admin: py35-mavlink-1.1.62: File `/opt/openrobots/lib/python3.5/site-packages/pymavlink/generator/lib/genxmlif/__pycache__/xmlif4Dom.cpython-35.pyc' is in +CONTENTS but not on filesystem! robotpkg_admin: py35-mavlink-1.1.62: File `/opt/openrobots/lib/python3.5/site-packages/pymavlink/generator/lib/genxmlif/__pycache__/xmlif4Dom.cpython-35.opt-1.pyc' is in +CONTENTS but not on filesystem! robotpkg_admin: py35-mavlink-1.1.62: File `/opt/openrobots/lib/python3.5/site-packages/pymavlink/generator/lib/genxmlif/__pycache__/xmlifApi.cpython-35.pyc' is in +CONTENTS but not on filesystem! robotpkg_admin: py35-mavlink-1.1.62: File `/opt/openrobots/lib/python3.5/site-packages/pymavlink/generator/lib/genxmlif/__pycache__/xmlifApi.cpython-35.opt-1.pyc' is in +CONTENTS but not on filesystem! robotpkg_admin: py35-mavlink-1.1.62: File `/opt/openrobots/lib/python3.5/site-packages/pymavlink/generator/lib/genxmlif/__pycache__/xmlifDom.cpython-35.pyc' is in +CONTENTS but not on filesystem! robotpkg_admin: py35-mavlink-1.1.62: File `/opt/openrobots/lib/python3.5/site-packages/pymavlink/generator/lib/genxmlif/__pycache__/xmlifDom.cpython-35.opt-1.pyc' is in +CONTENTS but not on filesystem! robotpkg_admin: py35-mavlink-1.1.62: File `/opt/openrobots/lib/python3.5/site-packages/pymavlink/generator/lib/genxmlif/__pycache__/xmlifElementTree.cpython-35.pyc' is in +CONTENTS but not on filesystem! robotpkg_admin: py35-mavlink-1.1.62: File `/opt/openrobots/lib/python3.5/site-packages/pymavlink/generator/lib/genxmlif/__pycache__/xmlifElementTree.cpython-35.opt-1.pyc' is in +CONTENTS but not on filesystem! robotpkg_admin: py35-mavlink-1.1.62: File `/opt/openrobots/lib/python3.5/site-packages/pymavlink/generator/lib/genxmlif/__pycache__/xmlifMinidom.cpython-35.pyc' is in +CONTENTS but not on filesystem! robotpkg_admin: py35-mavlink-1.1.62: File `/opt/openrobots/lib/python3.5/site-packages/pymavlink/generator/lib/genxmlif/__pycache__/xmlifMinidom.cpython-35.opt-1.pyc' is in +CONTENTS but not on filesystem! robotpkg_admin: py35-mavlink-1.1.62: File `/opt/openrobots/lib/python3.5/site-packages/pymavlink/generator/lib/genxmlif/__pycache__/xmlifUtils.cpython-35.pyc' is in +CONTENTS but not on filesystem! robotpkg_admin: py35-mavlink-1.1.62: File `/opt/openrobots/lib/python3.5/site-packages/pymavlink/generator/lib/genxmlif/__pycache__/xmlifUtils.cpython-35.opt-1.pyc' is in +CONTENTS but not on filesystem! robotpkg_admin: py35-mavlink-1.1.62: File `/opt/openrobots/lib/python3.5/site-packages/pymavlink/generator/lib/genxmlif/__pycache__/xmliftest.cpython-35.pyc' is in +CONTENTS but not on filesystem! robotpkg_admin: py35-mavlink-1.1.62: File `/opt/openrobots/lib/python3.5/site-packages/pymavlink/generator/lib/genxmlif/__pycache__/xmliftest.cpython-35.opt-1.pyc' is in +CONTENTS but not on filesystem! robotpkg_admin: py35-mavlink-1.1.62: File `/opt/openrobots/lib/python3.5/site-packages/pymavlink/generator/lib/minixsv/__pycache__/minixsvWrapper.cpython-35.pyc' is in +CONTENTS but not on filesystem! robotpkg_admin: py35-mavlink-1.1.62: File `/opt/openrobots/lib/python3.5/site-packages/pymavlink/generator/lib/minixsv/__pycache__/minixsvWrapper.cpython-35.opt-1.pyc' is in +CONTENTS but not on filesystem! robotpkg_admin: py35-mavlink-1.1.62: File `/opt/openrobots/lib/python3.5/site-packages/pymavlink/generator/lib/minixsv/__pycache__/pyxsval.cpython-35.pyc' is in +CONTENTS but not on filesystem! robotpkg_admin: py35-mavlink-1.1.62: File `/opt/openrobots/lib/python3.5/site-packages/pymavlink/generator/lib/minixsv/__pycache__/pyxsval.cpython-35.opt-1.pyc' is in +CONTENTS but not on filesystem! robotpkg_admin: py35-mavlink-1.1.62: File `/opt/openrobots/lib/python3.5/site-packages/pymavlink/generator/lib/minixsv/__pycache__/xsvalBase.cpython-35.pyc' is in +CONTENTS but not on filesystem! robotpkg_admin: py35-mavlink-1.1.62: File `/opt/openrobots/lib/python3.5/site-packages/pymavlink/generator/lib/minixsv/__pycache__/xsvalBase.cpython-35.opt-1.pyc' is in +CONTENTS but not on filesystem! robotpkg_admin: py35-mavlink-1.1.62: File `/opt/openrobots/lib/python3.5/site-packages/pymavlink/generator/lib/minixsv/__pycache__/xsvalErrorHandler.cpython-35.pyc' is in +CONTENTS but not on filesystem! robotpkg_admin: py35-mavlink-1.1.62: File `/opt/openrobots/lib/python3.5/site-packages/pymavlink/generator/lib/minixsv/__pycache__/xsvalErrorHandler.cpython-35.opt-1.pyc' is in +CONTENTS but not on filesystem! robotpkg_admin: py35-mavlink-1.1.62: File `/opt/openrobots/lib/python3.5/site-packages/pymavlink/generator/lib/minixsv/__pycache__/xsvalSchema.cpython-35.pyc' is in +CONTENTS but not on filesystem! robotpkg_admin: py35-mavlink-1.1.62: File `/opt/openrobots/lib/python3.5/site-packages/pymavlink/generator/lib/minixsv/__pycache__/xsvalSchema.cpython-35.opt-1.pyc' is in +CONTENTS but not on filesystem! robotpkg_admin: py35-mavlink-1.1.62: File `/opt/openrobots/lib/python3.5/site-packages/pymavlink/generator/lib/minixsv/__pycache__/xsvalSimpleTypes.cpython-35.pyc' is in +CONTENTS but not on filesystem! robotpkg_admin: py35-mavlink-1.1.62: File `/opt/openrobots/lib/python3.5/site-packages/pymavlink/generator/lib/minixsv/__pycache__/xsvalSimpleTypes.cpython-35.opt-1.pyc' is in +CONTENTS but not on filesystem! robotpkg_admin: py35-mavlink-1.1.62: File `/opt/openrobots/lib/python3.5/site-packages/pymavlink/generator/lib/minixsv/__pycache__/xsvalUtils.cpython-35.pyc' is in +CONTENTS but not on filesystem! robotpkg_admin: py35-mavlink-1.1.62: File `/opt/openrobots/lib/python3.5/site-packages/pymavlink/generator/lib/minixsv/__pycache__/xsvalUtils.cpython-35.opt-1.pyc' is in +CONTENTS but not on filesystem! robotpkg_create: can't stat `/opt/openrobots/lib/python3.5/site-packages/mavnative.so' robotpkg_create: can't stat `/opt/openrobots/lib/python3.5/site-packages/pymavlink/generator/lib/genxmlif/__pycache__/__init__.cpython-35.pyc' robotpkg_create: can't stat `/opt/openrobots/lib/python3.5/site-packages/pymavlink/generator/lib/genxmlif/__pycache__/__init__.cpython-35.opt-1.pyc' robotpkg_create: can't stat `/opt/openrobots/lib/python3.5/site-packages/pymavlink/generator/lib/genxmlif/__pycache__/xmlif4Dom.cpython-35.pyc' robotpkg_create: can't stat `/opt/openrobots/lib/python3.5/site-packages/pymavlink/generator/lib/genxmlif/__pycache__/xmlif4Dom.cpython-35.opt-1.pyc' robotpkg_create: can't stat `/opt/openrobots/lib/python3.5/site-packages/pymavlink/generator/lib/genxmlif/__pycache__/xmlifApi.cpython-35.pyc' robotpkg_create: can't stat `/opt/openrobots/lib/python3.5/site-packages/pymavlink/generator/lib/genxmlif/__pycache__/xmlifApi.cpython-35.opt-1.pyc' robotpkg_create: can't stat `/opt/openrobots/lib/python3.5/site-packages/pymavlink/generator/lib/genxmlif/__pycache__/xmlifDom.cpython-35.pyc' robotpkg_create: can't stat `/opt/openrobots/lib/python3.5/site-packages/pymavlink/generator/lib/genxmlif/__pycache__/xmlifDom.cpython-35.opt-1.pyc' robotpkg_create: can't stat `/opt/openrobots/lib/python3.5/site-packages/pymavlink/generator/lib/genxmlif/__pycache__/xmlifElementTree.cpython-35.pyc' robotpkg_create: can't stat `/opt/openrobots/lib/python3.5/site-packages/pymavlink/generator/lib/genxmlif/__pycache__/xmlifElementTree.cpython-35.opt-1.pyc' robotpkg_create: can't stat `/opt/openrobots/lib/python3.5/site-packages/pymavlink/generator/lib/genxmlif/__pycache__/xmlifMinidom.cpython-35.pyc' robotpkg_create: can't stat `/opt/openrobots/lib/python3.5/site-packages/pymavlink/generator/lib/genxmlif/__pycache__/xmlifMinidom.cpython-35.opt-1.pyc' robotpkg_create: can't stat `/opt/openrobots/lib/python3.5/site-packages/pymavlink/generator/lib/genxmlif/__pycache__/xmlifUtils.cpython-35.pyc' robotpkg_create: can't stat `/opt/openrobots/lib/python3.5/site-packages/pymavlink/generator/lib/genxmlif/__pycache__/xmlifUtils.cpython-35.opt-1.pyc' robotpkg_create: can't stat `/opt/openrobots/lib/python3.5/site-packages/pymavlink/generator/lib/genxmlif/__pycache__/xmliftest.cpython-35.pyc' robotpkg_create: can't stat `/opt/openrobots/lib/python3.5/site-packages/pymavlink/generator/lib/genxmlif/__pycache__/xmliftest.cpython-35.opt-1.pyc' robotpkg_create: can't stat `/opt/openrobots/lib/python3.5/site-packages/pymavlink/generator/lib/minixsv/__pycache__/minixsvWrapper.cpython-35.pyc' robotpkg_create: can't stat `/opt/openrobots/lib/python3.5/site-packages/pymavlink/generator/lib/minixsv/__pycache__/minixsvWrapper.cpython-35.opt-1.pyc' robotpkg_create: can't stat `/opt/openrobots/lib/python3.5/site-packages/pymavlink/generator/lib/minixsv/__pycache__/pyxsval.cpython-35.pyc' robotpkg_create: can't stat `/opt/openrobots/lib/python3.5/site-packages/pymavlink/generator/lib/minixsv/__pycache__/pyxsval.cpython-35.opt-1.pyc' robotpkg_create: can't stat `/opt/openrobots/lib/python3.5/site-packages/pymavlink/generator/lib/minixsv/__pycache__/xsvalBase.cpython-35.pyc' robotpkg_create: can't stat `/opt/openrobots/lib/python3.5/site-packages/pymavlink/generator/lib/minixsv/__pycache__/xsvalBase.cpython-35.opt-1.pyc' robotpkg_create: can't stat `/opt/openrobots/lib/python3.5/site-packages/pymavlink/generator/lib/minixsv/__pycache__/xsvalErrorHandler.cpython-35.pyc' robotpkg_create: can't stat `/opt/openrobots/lib/python3.5/site-packages/pymavlink/generator/lib/minixsv/__pycache__/xsvalErrorHandler.cpython-35.opt-1.pyc' robotpkg_create: can't stat `/opt/openrobots/lib/python3.5/site-packages/pymavlink/generator/lib/minixsv/__pycache__/xsvalSchema.cpython-35.pyc' robotpkg_create: can't stat `/opt/openrobots/lib/python3.5/site-packages/pymavlink/generator/lib/minixsv/__pycache__/xsvalSchema.cpython-35.opt-1.pyc' robotpkg_create: can't stat `/opt/openrobots/lib/python3.5/site-packages/pymavlink/generator/lib/minixsv/__pycache__/xsvalSimpleTypes.cpython-35.pyc' robotpkg_create: can't stat `/opt/openrobots/lib/python3.5/site-packages/pymavlink/generator/lib/minixsv/__pycache__/xsvalSimpleTypes.cpython-35.opt-1.pyc' robotpkg_create: can't stat `/opt/openrobots/lib/python3.5/site-packages/pymavlink/generator/lib/minixsv/__pycache__/xsvalUtils.cpython-35.pyc' robotpkg_create: can't stat `/opt/openrobots/lib/python3.5/site-packages/pymavlink/generator/lib/minixsv/__pycache__/xsvalUtils.cpython-35.opt-1.pyc' robotpkg_create: lstat failed for file lib/python3.5/site-packages/mavnative.so: No such file or directory => Marking py35-mavlink-1.1.62 as broken make[2]: *** [pkg-tarup] Error 2 ERROR: make: *** [package] Error 2 robotpkg_delete: Couldn't remove /opt/openrobots/lib/python3.5/site-packages/mavnative.so robotpkg_delete: Couldn't remove /opt/openrobots/lib/python3.5/site-packages/pymavlink/generator/lib/genxmlif/__pycache__/__init__.cpython-35.pyc robotpkg_delete: Couldn't remove /opt/openrobots/lib/python3.5/site-packages/pymavlink/generator/lib/genxmlif/__pycache__/__init__.cpython-35.opt-1.pyc robotpkg_delete: Couldn't remove /opt/openrobots/lib/python3.5/site-packages/pymavlink/generator/lib/genxmlif/__pycache__/xmlif4Dom.cpython-35.pyc robotpkg_delete: Couldn't remove /opt/openrobots/lib/python3.5/site-packages/pymavlink/generator/lib/genxmlif/__pycache__/xmlif4Dom.cpython-35.opt-1.pyc robotpkg_delete: Couldn't remove /opt/openrobots/lib/python3.5/site-packages/pymavlink/generator/lib/genxmlif/__pycache__/xmlifApi.cpython-35.pyc robotpkg_delete: Couldn't remove /opt/openrobots/lib/python3.5/site-packages/pymavlink/generator/lib/genxmlif/__pycache__/xmlifApi.cpython-35.opt-1.pyc robotpkg_delete: Couldn't remove /opt/openrobots/lib/python3.5/site-packages/pymavlink/generator/lib/genxmlif/__pycache__/xmlifDom.cpython-35.pyc robotpkg_delete: Couldn't remove /opt/openrobots/lib/python3.5/site-packages/pymavlink/generator/lib/genxmlif/__pycache__/xmlifDom.cpython-35.opt-1.pyc robotpkg_delete: Couldn't remove /opt/openrobots/lib/python3.5/site-packages/pymavlink/generator/lib/genxmlif/__pycache__/xmlifElementTree.cpython-35.pyc robotpkg_delete: Couldn't remove /opt/openrobots/lib/python3.5/site-packages/pymavlink/generator/lib/genxmlif/__pycache__/xmlifElementTree.cpython-35.opt-1.pyc robotpkg_delete: Couldn't remove /opt/openrobots/lib/python3.5/site-packages/pymavlink/generator/lib/genxmlif/__pycache__/xmlifMinidom.cpython-35.pyc robotpkg_delete: Couldn't remove /opt/openrobots/lib/python3.5/site-packages/pymavlink/generator/lib/genxmlif/__pycache__/xmlifMinidom.cpython-35.opt-1.pyc robotpkg_delete: Couldn't remove /opt/openrobots/lib/python3.5/site-packages/pymavlink/generator/lib/genxmlif/__pycache__/xmlifUtils.cpython-35.pyc robotpkg_delete: Couldn't remove /opt/openrobots/lib/python3.5/site-packages/pymavlink/generator/lib/genxmlif/__pycache__/xmlifUtils.cpython-35.opt-1.pyc robotpkg_delete: Couldn't remove /opt/openrobots/lib/python3.5/site-packages/pymavlink/generator/lib/genxmlif/__pycache__/xmliftest.cpython-35.pyc robotpkg_delete: Couldn't remove /opt/openrobots/lib/python3.5/site-packages/pymavlink/generator/lib/genxmlif/__pycache__/xmliftest.cpython-35.opt-1.pyc robotpkg_delete: Couldn't remove /opt/openrobots/lib/python3.5/site-packages/pymavlink/generator/lib/minixsv/__pycache__/minixsvWrapper.cpython-35.pyc robotpkg_delete: Couldn't remove /opt/openrobots/lib/python3.5/site-packages/pymavlink/generator/lib/minixsv/__pycache__/minixsvWrapper.cpython-35.opt-1.pyc robotpkg_delete: Couldn't remove /opt/openrobots/lib/python3.5/site-packages/pymavlink/generator/lib/minixsv/__pycache__/pyxsval.cpython-35.pyc robotpkg_delete: Couldn't remove /opt/openrobots/lib/python3.5/site-packages/pymavlink/generator/lib/minixsv/__pycache__/pyxsval.cpython-35.opt-1.pyc robotpkg_delete: Couldn't remove /opt/openrobots/lib/python3.5/site-packages/pymavlink/generator/lib/minixsv/__pycache__/xsvalBase.cpython-35.pyc robotpkg_delete: Couldn't remove /opt/openrobots/lib/python3.5/site-packages/pymavlink/generator/lib/minixsv/__pycache__/xsvalBase.cpython-35.opt-1.pyc robotpkg_delete: Couldn't remove /opt/openrobots/lib/python3.5/site-packages/pymavlink/generator/lib/minixsv/__pycache__/xsvalErrorHandler.cpython-35.pyc robotpkg_delete: Couldn't remove /opt/openrobots/lib/python3.5/site-packages/pymavlink/generator/lib/minixsv/__pycache__/xsvalErrorHandler.cpython-35.opt-1.pyc robotpkg_delete: Couldn't remove /opt/openrobots/lib/python3.5/site-packages/pymavlink/generator/lib/minixsv/__pycache__/xsvalSchema.cpython-35.pyc robotpkg_delete: Couldn't remove /opt/openrobots/lib/python3.5/site-packages/pymavlink/generator/lib/minixsv/__pycache__/xsvalSchema.cpython-35.opt-1.pyc robotpkg_delete: Couldn't remove /opt/openrobots/lib/python3.5/site-packages/pymavlink/generator/lib/minixsv/__pycache__/xsvalSimpleTypes.cpython-35.pyc robotpkg_delete: Couldn't remove /opt/openrobots/lib/python3.5/site-packages/pymavlink/generator/lib/minixsv/__pycache__/xsvalSimpleTypes.cpython-35.opt-1.pyc robotpkg_delete: Couldn't remove /opt/openrobots/lib/python3.5/site-packages/pymavlink/generator/lib/minixsv/__pycache__/xsvalUtils.cpython-35.pyc robotpkg_delete: Couldn't remove /opt/openrobots/lib/python3.5/site-packages/pymavlink/generator/lib/minixsv/__pycache__/xsvalUtils.cpython-35.opt-1.pyc robotpkg_delete: Directory `/opt/openrobots/share/mavlink' disappeared, skipping ===> Logging bulk summary for py35-mavlink-1.1.62 => Checking leftover files => Creating bulk log files => Logging bulk metadata ===> Cleaning temporary files for py35-mavlink-1.1.62 ===> Done bulk for py35-mavlink-1.1.62 [7%] Processing wip/talos-robot:talos-robot-0.0.14r1 ===> Bulk building for talos-robot-0.0.14r1 Binary package for talos-robot-0.0.14r1 is up-to-date. [8%] Processing wip/soth:soth-2.0.1r1 ===> Cleaning temporary files for soth-2.0.1r1 ===> Bulk building for soth-2.0.1r1 => Checking for clear installation => Installing digest-20080510.tgz => Installing tnftp-20130505~ssl.tgz => Required robotpkg package digest>=20080510: digest-20080510 found => Required robotpkg package tnftp>=20091122: tnftp-20130505~ssl found => Required system package gzip: gzip-1.6 found => Required system package pax and tar archivers: pax found => Required system package pkg_install>=20110805.7: pkg_install-20110805.7 found => Dependency digest-20080510 already installed => Dependency tnftp-20130505~ssl already installed => Building with no option. => Use the GNU C++ compiler: c++-compiler provided by g++>=3 => Use the GNU C compiler: c-compiler provided by gcc>=3 => Required system package boost-headers>=1.34.1: boost-headers-1.60 found => Required system package boostlib-filesystem>=1.34.1: boost-libs-1.60.0 found => Required system package boostlib-iostreams>=1.34.1: boost-libs-1.60.0 found => Required system package boostlib-math>=1.34.1: boost-libs-1.60.0 found => Required system package boostlib-thread>=1.34.1: boost-libs-1.60.0 found => Required system package cmake>=2.6: cmake-3.9.0 found => Required system package doxygen>=1.5: doxygen-1.8.11 found => Required system package eigen3>=3.0.0: eigen3-3.2.10 found => Required system package g++>=3: g++-6.3.1 found => Required system package gcc>=3: gcc-6.3.1 found => Required system package libstdc++: libstdc++ found => Required system package pkg-config>=0.22: pkg-config-0.29 found => SHA1 checksums OK => RMD160 checksums OK => Adding run-time search paths to pkg-config files robotpkg_create: can't stat `/opt/openrobots/lib/libsoth.so' robotpkg_create: can't stat `/opt/openrobots/lib/libsoth.so.2.0.1' robotpkg_create: can't stat `/opt/openrobots/lib/pkgconfig/soth.pc' => Registering installation for soth-2.0.1r1 robotpkg_admin: soth-2.0.1r1: File `/opt/openrobots/lib/libsoth.so' is in +CONTENTS but not on filesystem! robotpkg_admin: soth-2.0.1r1: File `/opt/openrobots/lib/libsoth.so.2.0.1' is in +CONTENTS but not on filesystem! robotpkg_admin: soth-2.0.1r1: File `/opt/openrobots/lib/pkgconfig/soth.pc' is in +CONTENTS but not on filesystem! robotpkg_create: can't stat `/opt/openrobots/lib/libsoth.so' robotpkg_create: can't stat `/opt/openrobots/lib/libsoth.so.2.0.1' robotpkg_create: can't stat `/opt/openrobots/lib/pkgconfig/soth.pc' robotpkg_create: lstat failed for file lib/libsoth.so: No such file or directory make[2]: *** [pkg-tarup] Error 2 => Marking soth-2.0.1r1 as broken ERROR: make: *** [package] Error 2 robotpkg_delete: Couldn't remove /opt/openrobots/lib/libsoth.so robotpkg_delete: Couldn't remove /opt/openrobots/lib/libsoth.so.2.0.1 robotpkg_delete: Couldn't remove /opt/openrobots/lib/pkgconfig/soth.pc ===> Logging bulk summary for soth-2.0.1r1 => Checking leftover files => Creating bulk log files => Logging bulk metadata ===> Cleaning temporary files for soth-2.0.1r1 ===> Done bulk for soth-2.0.1r1 [8%] Processing wip/gerard-bauzil:gerard-bauzil-1.0.1 ===> Cleaning temporary files for gerard-bauzil-1.0.1 ===> Bulk building for gerard-bauzil-1.0.1 => Checking for clear installation => Installing digest-20080510.tgz => Installing tnftp-20130505~ssl.tgz => Required robotpkg package digest>=20080510: digest-20080510 found => Required robotpkg package tnftp>=20091122: tnftp-20130505~ssl found => Required system package gzip: gzip-1.6 found => Required system package pax and tar archivers: pax found => Required system package pkg_install>=20110805.7: pkg_install-20110805.7 found => Dependency digest-20080510 already installed => Installing gepetto-viewer-1.2.1.tgz => Dependency tnftp-20130505~ssl already installed => Building with no option. => Use the GNU C++ compiler: c++-compiler provided by g++>=3 => Use the GNU C compiler: c-compiler provided by gcc>=3 => Required system package cmake>=2.6: cmake-3.9.0 found => Required system package g++>=3: g++-6.3.1 found => Required system package gcc>=3: gcc-6.3.1 found => Required system package libstdc++: libstdc++ found => Required system package pkg-config>=0.22: pkg-config-0.29 found => Required robotpkg package gepetto-viewer>=1.2.0: gepetto-viewer-1.2.1 found => SHA1 checksums OK => RMD160 checksums OK => Adding run-time search paths to pkg-config files robotpkg_create: can't stat `/opt/openrobots/lib/pkgconfig/gerard-bauzil.pc' => Registering installation for gerard-bauzil-1.0.1 robotpkg_admin: gerard-bauzil-1.0.1: File `/opt/openrobots/lib/pkgconfig/gerard-bauzil.pc' is in +CONTENTS but not on filesystem! robotpkg_create: can't stat `/opt/openrobots/lib/pkgconfig/gerard-bauzil.pc' robotpkg_create: lstat failed for file lib/pkgconfig/gerard-bauzil.pc: No such file or directory make[2]: *** [pkg-tarup] Error 2 => Marking gerard-bauzil-1.0.1 as broken ERROR: make: *** [package] Error 2 robotpkg_delete: Couldn't remove /opt/openrobots/lib/pkgconfig/gerard-bauzil.pc ===> Logging bulk summary for gerard-bauzil-1.0.1 => Checking leftover files => Creating bulk log files => Logging bulk metadata ===> Cleaning temporary files for gerard-bauzil-1.0.1 ===> Done bulk for gerard-bauzil-1.0.1 [9%] Processing wip/urg:urg-0.8.18 ===> Bulk building for urg-0.8.18 Binary package for urg-0.8.18 is up-to-date. [9%] Processing wip/jafar-rtslam:jafar-rtslam-0.3~!* ===> Bulk building for jafar-rtslam-0.3 Binary package for jafar-rtslam-0.3 is up-to-date. [10%] Processing wip/jafar-rtslam:~MTI ===> Bulk building for jafar-rtslam-0.3~MTI Binary package for jafar-rtslam-0.3~MTI is up-to-date. [10%] Processing wip/robotModelParser-libs:robotModelParser-libs-1.0 ===> Bulk building for robotModelParser-libs-1.0 Binary package for robotModelParser-libs-1.0 is up-to-date. [11%] Processing wip/hrp2-computer-monitor:hrp2-computer-monitor-1.0.2 ===> Bulk building for hrp2-computer-monitor-1.0.2 Binary package for hrp2-computer-monitor-1.0.2 is up-to-date. [11%] Processing wip/chilitags:chilitags-1.3.1 ===> Bulk building for chilitags-1.3.1 Binary package for chilitags-1.3.1 is up-to-date. [12%] Processing wip/move3d-assets:move3d-assets-20120125 ===> Bulk building for move3d-assets-20120125 Binary package for move3d-assets-20120125 is up-to-date. [12%] Processing wip/morse-hla:morse-hla-1.4 ===> Cleaning temporary files for morse-hla-1.4 ===> Bulk building for morse-hla-1.4 => Checking for clear installation => Installing digest-20080510.tgz => Installing tnftp-20130505~ssl.tgz => Required robotpkg package digest>=20080510: digest-20080510 found => Required robotpkg package tnftp>=20091122: tnftp-20130505~ssl found => Required system package gzip: gzip-1.6 found => Required system package patch>=2.0: patch-2.7.5 found => Required system package pax and tar archivers: pax found => Required system package pkg_install>=20110805.7: pkg_install-20110805.7 found => Dependency digest-20080510 already installed => Installing morse-1.4~doc.tgz ERROR: Required robotpkg package py35-hla>=1.1.1: BROKEN => Dependency tnftp-20130505~ssl already installed ===> Logging bulk summary for morse-hla-1.4 => Checking leftover files => Creating bulk log files => Logging bulk metadata ===> Cleaning temporary files for morse-hla-1.4 ===> Done bulk for morse-hla-1.4 [13%] Processing wip/py-dynamic-graph-v3:py27-dynamic-graph-v3-3.0.2 ===> Bulk building for py27-dynamic-graph-v3-3.0.2 Binary package for py27-dynamic-graph-v3-3.0.2 is up-to-date. [13%] Processing wip/morse-pocolibs:morse-pocolibs-1.4 ===> Bulk building for morse-pocolibs-1.4 Binary package for morse-pocolibs-1.4 is up-to-date. [14%] Processing wip/qpOASES:qpOASES-3.2.0 ===> Bulk building for qpOASES-3.2.0 Binary package for qpOASES-3.2.0 is up-to-date. [14%] Processing wip/py-laaswm:py27-laaswm-1.3r1 ===> Bulk building for py27-laaswm-1.3r1 Binary package for py27-laaswm-1.3r1 is up-to-date. [15%] Processing wip/sot-core-v3:sot-core-v3-3.1.0 ===> Bulk building for sot-core-v3-3.1.0 Binary package for sot-core-v3-3.1.0 is up-to-date. [15%] Processing wip/talos-data:talos-data-0.0.14r5 ===> Cleaning temporary files for talos-data-0.0.14r5 ===> Bulk building for talos-data-0.0.14r5 => Checking for clear installation => Installing digest-20080510.tgz => Installing tnftp-20130505~ssl.tgz => Required robotpkg package digest>=20080510: digest-20080510 found => Required robotpkg package tnftp>=20091122: tnftp-20130505~ssl found => Required system package gzip: gzip-1.6 found => Required system package pax and tar archivers: pax found => Required system package pkg_install>=20110805.7: pkg_install-20110805.7 found => Dependency digest-20080510 already installed => Installing ros-catkin-0.6.9r2.tgz => Installing ros-comm-1.11.20.tgz => Installing ros-common-msgs-1.11.4.tgz => Dependency ros-genmsg-0.5.3 already installed => Dependency ros-message-generation-0.2.10 already installed => Dependency ros-message-runtime-0.4.12 already installed => Dependency ros-std-msgs-0.5.9 already installed => Dependency tnftp-20130505~ssl already installed => Building with no option. => Use the GNU C++ compiler: c++-compiler provided by g++>=3 => Use the GNU C compiler: c-compiler provided by gcc>=3 => Use python-2.7: python>=2.5<3.7 provided by python27>=2.7<2.8 => Use ros indigo: ros>=groovy provided by ros-indigo => Required system package cmake>=2.8.3: cmake-3.9.0 found => Required system package doxygen>=1.5: doxygen-1.8.11 found => Required system package g++>=3: g++-6.3.1 found => Required system package gcc>=3: gcc-6.3.1 found => Required system package googletest: googletest found => Required system package graphviz>=2: graphviz-2.38.0 found => Required system package libstdc++: libstdc++ found => Required system package pdflatex: pdflatex found => Required system package pkg-config>=0.22: pkg-config-0.29 found => Required system package py27-nose>=0.10: py27-nose-1.3.7 found => Required system package python27>=2.7<2.8: python27-2.7.13 found => Required robotpkg package ros-catkin>=0.6<0.7: ros-catkin-0.6.9r2 found => Required robotpkg package ros-comm>=1.11<1.12: ros-comm-1.11.20 found => Required robotpkg package ros-common-msgs>=1.11<1.12: ros-common-msgs-1.11.4 found => Required robotpkg package ros-genmsg>=0.5<0.6: ros-genmsg-0.5.3 found => Required robotpkg package ros-message-generation>=0.2<0.3: ros-message-generation-0.2.10 found => Required robotpkg package ros-message-runtime>=0.4<0.5: ros-message-runtime-0.4.12 found => Required robotpkg package ros-std-msgs>=0.5: ros-std-msgs-0.5.9 found => SHA1 checksums OK => RMD160 checksums OK An unexpected error occured. The last 10 log lines are shown below. | /usr/share/cmake/Modules/FindPkgConfig.cmake:588 (_pkg_check_modules_internal) | cmake/pkg-config.cmake:282 (PKG_CHECK_MODULES) | cmake/pkg-config.cmake:447 (ADD_DEPENDENCY) | CMakeLists.txt:22 (ADD_REQUIRED_DEPENDENCY) | | | -- No package 'urdfdom' found | -- Configuring incomplete, errors occurred! | See also "/local/robotpkg/var/tmp/robotpkg/wip/talos-data/work/talos_data-0.0.14/CMakeFiles/CMakeOutput.log". | See also "/local/robotpkg/var/tmp/robotpkg/wip/talos-data/work/talos_data-0.0.14/CMakeFiles/CMakeError.log". For details or bug reports, check the complete log file in: /local/robotpkg/var/tmp/robotpkg/wip/talos-data/work/configure.log make[3]: *** [do-configure-cmake] Error 1 => Marking talos-data-0.0.14r5 as broken make[2]: *** [pkg-check-installed] Error 2 ERROR: make: *** [package] Error 2 ===> Logging bulk summary for talos-data-0.0.14r5 => Checking leftover files => Creating bulk log files => Logging bulk metadata ===> Cleaning temporary files for talos-data-0.0.14r5 ===> Done bulk for talos-data-0.0.14r5 [15%] Processing wip/FRILibrary:FRILibrary-1.2 ===> Bulk building for FRILibrary-1.2 Binary package for FRILibrary-1.2 is up-to-date. [16%] Processing wip/sot-application:sot-application-1.0.0r1 ===> Bulk building for sot-application-1.0.0r1 Binary package for sot-application-1.0.0r1 is up-to-date. [16%] Processing wip/talos-moveit-config:talos-moveit-config-0.2.3 ===> Bulk building for talos-moveit-config-0.2.3 Binary package for talos-moveit-config-0.2.3 is up-to-date. [17%] Processing wip/sot-dyninv:sot-dyninv-2.0.0 ===> Cleaning temporary files for sot-dyninv-2.0.0 ===> Bulk building for sot-dyninv-2.0.0 => Checking for clear installation => Installing digest-20080510.tgz => Installing tnftp-20130505~ssl.tgz => Required robotpkg package digest>=20080510: digest-20080510 found => Required robotpkg package tnftp>=20091122: tnftp-20130505~ssl found => Required system package gzip: gzip-1.6 found => Required system package pax and tar archivers: pax found => Required system package pkg_install>=20110805.7: pkg_install-20110805.7 found => Dependency digest-20080510 already installed => Installing jrl-mal-1.19.6r1~jrl-mathtools.tgz => Installing py27-dynamic-graph-2.5.6r1.tgz => Installing sot-core-2.9.10.tgz ERROR: Required robotpkg package soth>=2.0.0: BROKEN => Dependency tnftp-20130505~ssl already installed ===> Logging bulk summary for sot-dyninv-2.0.0 => Checking leftover files => Creating bulk log files => Logging bulk metadata ===> Cleaning temporary files for sot-dyninv-2.0.0 ===> Done bulk for sot-dyninv-2.0.0 [17%] Processing wip/dptu-genom3:dptu-genom3-0.2~codels+pocolibs-client-c+openprs+pocolibs-server+!* ===> Bulk building for dptu-genom3-0.2~codels+openprs+pocolibs-client-c+pocolibs-server Binary package for dptu-genom3-0.2~codels+openprs+pocolibs-client-c+pocolibs-server is up-to-date. [18%] Processing wip/dptu-genom3:dptu-genom3-0.2~codels+openprs+ros-client-c+ros-client-ros+ros-server+!* ===> Bulk building for dptu-genom3-0.2~codels+openprs+ros-client-c+ros-client-ros+ros-server Binary package for dptu-genom3-0.2~codels+openprs+ros-client-c+ros-client-ros+ros-server is up-to-date. [18%] Processing wip/libmove3d:libmove3d-3.22.0r1 ===> Cleaning temporary files for libmove3d-3.22.0r1 ===> Bulk building for libmove3d-3.22.0r1 => Checking for clear installation => Installing digest-20080510.tgz => Installing tnftp-20130505~ssl.tgz => Required robotpkg package digest>=20080510: digest-20080510 found => Required robotpkg package tnftp>=20091122: tnftp-20130505~ssl found => Required system package gzip: gzip-1.6 found => Required system package pax and tar archivers: pax found => Required system package pkg_install>=20110805.7: pkg_install-20110805.7 found => Dependency digest-20080510 already installed => Installing gbM-0.11~tcl.tgz WARNING: Cannot check installed version of glpk WARNING: Cannot check installed version of libXpm => Installing softMotion-libs-3.12~tcl.tgz => Dependency tnftp-20130505~ssl already installed => Building with no option. => Use the GNU C++ compiler: c++-compiler provided by g++>=3 => Use the GNU C compiler: c-compiler provided by gcc>=3 => Required system package boost-headers>=1.34.1: boost-headers-1.60 found => Required system package boostlib-filesystem>=1.34.1: boost-libs-1.60.0 found => Required system package boostlib-iostreams>=1.34.1: boost-libs-1.60.0 found => Required system package boostlib-math>=1.34.1: boost-libs-1.60.0 found => Required system package boostlib-thread>=1.34.1: boost-libs-1.60.0 found => Required system package cmake>=2.6: cmake-3.9.0 found => Required system package freeglut: freeglut found => Required system package g++>=3: g++-6.3.1 found => Required system package gcc>=3: gcc-6.3.1 found => Required system package glib2>=2.20: glib2-2.48.2 found => Required system package glpk>=4.36: glpk found => Required system package glu>=7: glu-9.0.0 found => Required system package gsl>=1: gsl-2.1 found => Required system package gts>=0.7: gts-0.7.6 found => Required system package libXpm>=3.5.7: libXpm found => Required system package libstdc++: libstdc++ found => Required system package libxml2>=2: libxml2-2.9.4 found => Required system package qhull: qhull found WARNING: Cannot check installed version of glpk WARNING: Cannot check installed version of libXpm => Required robotpkg package gbM>=0.9: gbM-0.11~tcl found => Required robotpkg package softMotion-libs>=3.10: softMotion-libs-3.12~tcl found => SHA1 checksums OK => RMD160 checksums OK An unexpected error occured. The last 10 log lines are shown below. | /usr/bin/g++ -DBAR -DBIOMOVE3D_VERSION="" -DDEBUG_STATUS -DFOO -DGENERATE_LIBMOVE3D -DGRASP_PLANNING -DKCD_MOVE3D -DLIGHT_PLANNER -DLINUX -DMOVE3D_CORE -DMOVE3D_ROBOTICS -DMULTIGRAPH -DMULTILOCALPATH -DP3D_COLLISION_CHECKING -DP3D_CONSTRAINTS -DP3D_LOCALPATH -DP3D_PLANNER -DPRINT_ERROR -DPRINT_INFO -DQT_CORE_LIB -DQT_GL -DQT_GUI_LIB -DQT_LIBRARY -DQT_NO_DEBUG -DQT_OPENGL_LIB -DUNIX -DUSE_GBM -DUSE_GLUT -DUSE_GSL -DUSE_P3D_BODY_AABB -Dmove3d_EXPORTS -isystem /usr/include/QtOpenGL -isystem /usr/include/QtGui -isystem /usr/include/QtCore -I/usr/include/libxml2 -I/opt/openrobots/include -I/usr/include/glib-2.0 -I/usr/lib64/glib-2.0/include -I/local/robotpkg/var/tmp/robotpkg/wip/libmove3d/work/libmove3d-3.22.0/collision/proto -I/local/robotpkg/var/tmp/robotpkg/wip/libmove3d/work/libmove3d-3.22.0/collision/Kcd/proto -I/local/robotpkg/var/tmp/robotpkg/wip/libmove3d/work/libmove3d-3.22.0/collision/Kcd/include -I/local/robotpkg/var/tmp/robotpkg/wip/libmove3d/work/libmove3d-3.22.0/collision/PQP/include -I/local/robotpkg/var/tmp/robotpkg/wip/libmove3d/work/libmove3d-3.22.0/graphic/proto -I/local/robotpkg/var/tmp/robotpkg/wip/libmove3d/work/libmove3d-3.22.0/graspPlanning/proto -I/local/robotpkg/var/tmp/robotpkg/wip/libmove3d/work/libmove3d-3.22.0/graspPlanning/include -I/local/robotpkg/var/tmp/robotpkg/wip/libmove3d/work/libmove3d-3.22.0/groundHeight/src -I/local/robotpkg/var/tmp/robotpkg/wip/libmove3d/work/libmove3d-3.22.0/lightPlanner/proto -I/local/robotpkg/var/tmp/robotpkg/wip/libmove3d/work/libmove3d-3.22.0/localpath/proto -I/local/robotpkg/var/tmp/robotpkg/wip/libmove3d/work/libmove3d-3.22.0/localpath/include -I/local/robotpkg/var/tmp/robotpkg/wip/libmove3d/work/libmove3d-3.22.0/localpath/flat/include -I/local/robotpkg/var/tmp/robotpkg/wip/libmove3d/work/libmove3d-3.22.0/p3d -I/local/robotpkg/var/tmp/robotpkg/wip/libmove3d/work/libmove3d-3.22.0/p3d/proto -I/local/robotpkg/var/tmp/robotpkg/wip/libmove3d/work/libmove3d-3.22.0/planner/proto -I/local/robotpkg/var/tmp/robotpkg/wip/libmove3d/work/libmove3d-3.22.0/planner -I/local/robotpkg/var/tmp/robotpkg/wip/libmove3d/work/libmove3d-3.22.0/planner/astar/proto -I/local/robotpkg/var/tmp/robotpkg/wip/libmove3d/work/libmove3d-3.22.0/planner/dfs/proto -I/local/robotpkg/var/tmp/robotpkg/wip/libmove3d/work/libmove3d-3.22.0/planner/dfs/include -I/local/robotpkg/var/tmp/robotpkg/wip/libmove3d/work/libmove3d-3.22.0/planner/Diffusion/proto -I/local/robotpkg/var/tmp/robotpkg/wip/libmove3d/work/libmove3d-3.22.0/planner/rwGraph/proto -I/local/robotpkg/var/tmp/robotpkg/wip/libmove3d/work/libmove3d-3.22.0/util/proto -I/local/robotpkg/var/tmp/robotpkg/wip/libmove3d/work/libmove3d-3.22.0/include -I/local/robotpkg/var/tmp/robotpkg/wip/libmove3d/work/libmove3d-3.22.0 -pipe -O3 -DNDEBUG -fPIC -mtune=native -o CMakeFiles/move3d.dir/graspPlanning/gpGrasp.cpp.o -c /local/robotpkg/var/tmp/robotpkg/wip/libmove3d/work/libmove3d-3.22.0/graspPlanning/gpGrasp.cpp | CMakeFiles/move3d.dir/build.make:1203: recipe for target 'CMakeFiles/move3d.dir/graspPlanning/gpConvexHull.cpp.o' failed | make[2]: *** [CMakeFiles/move3d.dir/graspPlanning/gpConvexHull.cpp.o] Error 1 | make[2]: *** Waiting for unfinished jobs.... | make[2]: Leaving directory '/local/robotpkg/var/tmp/robotpkg/wip/libmove3d/work/libmove3d-3.22.0' | make[1]: *** [CMakeFiles/move3d.dir/all] Error 2 | CMakeFiles/Makefile2:139: recipe for target 'CMakeFiles/move3d.dir/all' failed | make: *** [all] Error 2 | make[1]: Leaving directory '/local/robotpkg/var/tmp/robotpkg/wip/libmove3d/work/libmove3d-3.22.0' | Makefile:143: recipe for target 'all' failed For details or bug reports, check the complete log file in: => Marking libmove3d-3.22.0r1 as broken /local/robotpkg/var/tmp/robotpkg/wip/libmove3d/work/build.log make[3]: *** [do-build] Error 1 make[2]: *** [pkg-check-installed] Error 2 ERROR: make: *** [package] Error 2 ===> Logging bulk summary for libmove3d-3.22.0r1 => Checking leftover files => Creating bulk log files => Logging bulk metadata ===> Cleaning temporary files for libmove3d-3.22.0r1 ===> Done bulk for libmove3d-3.22.0r1 [19%] Processing wip/mrpt:mrpt-1.2.2r2 ===> Cleaning temporary files for mrpt-1.2.2r2 ===> Bulk building for mrpt-1.2.2r2 => Checking for clear installation => Installing digest-20080510.tgz => Installing tnftp-20130505~ssl.tgz => Required robotpkg package digest>=20080510: digest-20080510 found => Required robotpkg package tnftp>=20091122: tnftp-20130505~ssl found => Required system package gzip: gzip-1.6 found => Required system package patch>=2.0: patch-2.7.5 found => Required system package pax and tar archivers: pax found => Required system package pkg_install>=20110805.7: pkg_install-20110805.7 found => Dependency digest-20080510 already installed => Dependency tnftp-20130505~ssl already installed => Building with no option. => Use the GNU C++ compiler: c++-compiler provided by g++>=3 => Use the GNU C compiler: c-compiler provided by gcc>=3 => Required system package assimp>=2.0: assimp-3.2.0 found => Required system package cmake>=2.6: cmake-3.9.0 found => Required system package doxygen>=1.5: doxygen-1.8.11 found => Required system package eigen3>=3.0.0: eigen3-3.2.10 found => Required system package freeglut: freeglut found => Required system package g++>=3: g++-6.3.1 found => Required system package gcc>=3: gcc-6.3.1 found => Required system package libjpeg: libjpeg found => Required system package libstdc++: libstdc++ found => Required system package opencv>=2.2.0: opencv-2.4.12.2 found => Required system package pkg-config>=0.22: pkg-config-0.29 found => Required system package podlators: podlators found => Required system package wxwidgets>=2.8: wxwidgets-3.0.2 found => Required system package zlib>=1.2.3: zlib-1.2.8 found => SHA1 checksums OK => RMD160 checksums OK => Applying robotpkg patches for mrpt-1.2.2r2 An unexpected error occured. The last 10 log lines are shown below. | ^ | compilation terminated. | make[2]: *** [libs/base/CMakeFiles/mrpt-base.dir/src/compress/zip.cpp.o] Error 1 | libs/base/CMakeFiles/mrpt-base.dir/build.make:113: recipe for target 'libs/base/CMakeFiles/mrpt-base.dir/src/compress/zip.cpp.o' failed | make[2]: Leaving directory '/local/robotpkg/var/tmp/robotpkg/wip/mrpt/work/mrpt-1.2.2' | CMakeFiles/Makefile2:265: recipe for target 'libs/base/CMakeFiles/mrpt-base.dir/all' failed | make[1]: Leaving directory '/local/robotpkg/var/tmp/robotpkg/wip/mrpt/work/mrpt-1.2.2' | make[1]: *** [libs/base/CMakeFiles/mrpt-base.dir/all] Error 2 | make: *** [all] Error 2 | Makefile:154: recipe for target 'all' failed For details or bug reports, check the complete log file in: /local/robotpkg/var/tmp/robotpkg/wip/mrpt/work/build.log make[3]: *** [do-build] Error 1 make[2]: *** [pkg-check-installed] Error 2 => Marking mrpt-1.2.2r2 as broken ERROR: make: *** [package] Error 2 ===> Logging bulk summary for mrpt-1.2.2r2 => Checking leftover files => Creating bulk log files => Logging bulk metadata ===> Cleaning temporary files for mrpt-1.2.2r2 ===> Done bulk for mrpt-1.2.2r2 [19%] Processing wip/pinocchio:pinocchio-1.2.4r3 ===> Cleaning temporary files for pinocchio-1.2.4r3 ===> Bulk building for pinocchio-1.2.4r3 => Checking for clear installation => Installing digest-20080510.tgz => Installing tnftp-20130505~ssl.tgz => Required robotpkg package digest>=20080510: digest-20080510 found => Required robotpkg package tnftp>=20091122: tnftp-20130505~ssl found => Required system package gzip: gzip-1.6 found => Required system package patch>=2.0: patch-2.7.5 found => Required system package pax and tar archivers: pax found => Required system package pkg_install>=20110805.7: pkg_install-20110805.7 found => Dependency digest-20080510 already installed => Installing eigenpy-1.3.3.tgz => Installing hpp-fcl-0.4.2r2.tgz => Dependency tnftp-20130505~ssl already installed => Installing urdfdom-0.3.0r2.tgz => Building with no option. => Use the GNU C++ compiler: c++-compiler provided by g++>=3 => Use the GNU C compiler: c-compiler provided by gcc>=3 => Use python-2.7: python>=2.5<3.7 python<3 provided by python27>=2.7<2.8 => Required system package boost-headers>=1.34.1: boost-headers-1.60 found => Required system package boostlib-filesystem>=1.34.1: boost-libs-1.60.0 found => Required system package boostlib-python>=1.34.1: boost-libs-1.60.0 found => Required system package boostlib-system>=1.34.1: boost-libs-1.60.0 found => Required system package boostlib-unit_test_framework>=1.34.1: boost-libs-1.60.0 found => Required system package cmake>=2.6: cmake-3.9.0 found => Required system package doxygen>=1.5: doxygen-1.8.11 found => Required system package eigen3>=3.0.0: eigen3-3.2.10 found => Required system package g++>=3: g++-6.3.1 found => Required system package gcc>=3: gcc-6.3.1 found => Required system package libstdc++: libstdc++ found => Required system package pkg-config>=0.22: pkg-config-0.29 found => Required system package py27-numpy>=1: py27-numpy-1.11.0 found => Required system package python27>=2.7<2.8: python27-2.7.13 found => Required system package tinyxml>=2: tinyxml-2.6.2 found => Required robotpkg package eigenpy>=1.3.1: eigenpy-1.3.3 found => Required robotpkg package hpp-fcl>=0.4.2: hpp-fcl-0.4.2r2 found => Required robotpkg package urdfdom>=0.2.8<1: urdfdom-0.3.0r2 found => SHA1 checksums OK => RMD160 checksums OK => Applying robotpkg patches for pinocchio-1.2.4r3 An unexpected error occured. The last 10 log lines are shown below. | ^~~~~~~~~~ => Marking pinocchio-1.2.4r3 as broken | /usr/include/boost/variant/detail/initializer.hpp:104:24: note: no known conversion for argument 2 from 'boost::move_detail::remove_reference, se3::JointModelRevolute<1>, se3::JointModelRevolute<2>, se3::JointModelRevoluteUnaligned, se3::JointModelSpherical, se3::JointModelSphericalZYX, se3::JointModelPrismatic<0>, se3::JointModelPrismatic<1>, se3::JointModelPrismatic<2>, se3::JointModelPrismaticUnaligned, se3::JointModelFreeFlyer, se3::JointModelPlanar, se3::JointModelTranslation, se3::JointModelRevoluteUnbounded<0>, se3::JointModelRevoluteUnbounded<1>, se3::JointModelRevoluteUnbounded<2>, boost::recursive_wrapper > >&>::type {aka boost::python::extract, se3::JointModelRevolute<1>, se3::JointModelRevolute<2>, se3::JointModelRevoluteUnaligned, se3::JointModelSpherical, se3::JointModelSphericalZYX, se3::JointModelPrismatic<0>, se3::JointModelPrismatic<1>, se3::JointModelPrismatic<2>, se3::JointModelPrismaticUnaligned, se3::JointModelFreeFlyer, se3::JointModelPlanar, se3::JointModelTranslation, se3::JointModelRevoluteUnbounded<0>, se3::JointModelRevoluteUnbounded<1>, se3::JointModelRevoluteUnbounded<2>, boost::recursive_wrapper > >}' to 'boost::detail::variant::make_initializer_node::apply >, boost::mpl::l_iter, se3::JointModelRevolute<1>, se3::JointModelRevolute<2>, se3::JointModelRevoluteUnaligned, se3::JointModelSpherical, se3::JointModelSphericalZYX, se3::JointModelPrismatic<0>, se3::JointModelPrismatic<1>, se3::JointModelPrismatic<2>, se3::JointModelPrismaticUnaligned, se3::JointModelFreeFlyer, se3::JointModelPlanar, se3::JointModelTranslation, se3::JointModelRevoluteUnbounded<0>, se3::JointModelRevoluteUnbounded<1>, se3::JointModelRevoluteUnbounded<2>, boost::recursive_wrapper > > >::initializer_node, mpl_::int_<1> >, boost::mpl::l_iter, se3::JointModelRevolute<2>, se3::JointModelRevoluteUnaligned, se3::JointModelSpherical, se3::JointModelSphericalZYX, se3::JointModelPrismatic<0>, se3::JointModelPrismatic<1>, se3::JointModelPrismatic<2>, se3::JointModelPrismaticUnaligned, se3::JointModelFreeFlyer, se3::JointModelPlanar, se3::JointModelTranslation, se3::JointModelRevoluteUnbounded<0>, se3::JointModelRevoluteUnbounded<1>, se3::JointModelRevoluteUnbounded<2>, boost::recursive_wrapper > > >::initializer_node, mpl_::int_<2> >, boost::mpl::l_iter, se3::JointModelRevoluteUnaligned, se3::JointModelSpherical, se3::JointModelSphericalZYX, se3::JointModelPrismatic<0>, se3::JointModelPrismatic<1>, se3::JointModelPrismatic<2>, se3::JointModelPrismaticUnaligned, se3::JointModelFreeFlyer, se3::JointModelPlanar, se3::JointModelTranslation, se3::JointModelRevoluteUnbounded<0>, se3::JointModelRevoluteUnbounded<1>, se3::JointModelRevoluteUnbounded<2>, boost::recursive_wrapper > > >::initializer_node, mpl_::int_<3> >, boost::mpl::l_iter, se3::JointModelPrismatic<1>, se3::JointModelPrismatic<2>, se3::JointModelPrismaticUnaligned, se3::JointModelFreeFlyer, se3::JointModelPlanar, se3::JointModelTranslation, se3::JointModelRevoluteUnbounded<0>, se3::JointModelRevoluteUnbounded<1>, se3::JointModelRevoluteUnbounded<2>, boost::recursive_wrapper > > >::initializer_node, mpl_::int_<4> >, boost::mpl::l_iter, se3::JointModelPrismatic<1>, se3::JointModelPrismatic<2>, se3::JointModelPrismaticUnaligned, se3::JointModelFreeFlyer, se3::JointModelPlanar, se3::JointModelTranslation, se3::JointModelRevoluteUnbounded<0>, se3::JointModelRevoluteUnbounded<1>, se3::JointModelRevoluteUnbounded<2>, boost::recursive_wrapper > > >::initializer_node, mpl_::int_<5> >, boost::mpl::l_iter, se3::JointModelPrismatic<1>, se3::JointModelPrismatic<2>, se3::JointModelPrismaticUnaligned, se3::JointModelFreeFlyer, se3::JointModelPlanar, se3::JointModelTranslation, se3::JointModelRevoluteUnbounded<0>, se3::JointModelRevoluteUnbounded<1>, se3::JointModelRevoluteUnbounded<2>, boost::recursive_wrapper > > >::initializer_node, mpl_::int_<6> >, boost::mpl::l_iter, se3::JointModelPrismatic<1>, se3::JointModelPrismatic<2>, se3::JointModelPrismaticUnaligned, se3::JointModelFreeFlyer, se3::JointModelPlanar, se3::JointModelTranslation, se3::JointModelRevoluteUnbounded<0>, se3::JointModelRevoluteUnbounded<1>, se3::JointModelRevoluteUnbounded<2>, boost::recursive_wrapper > > >::initializer_node, mpl_::int_<7> >, boost::mpl::l_iter, se3::JointModelPrismatic<2>, se3::JointModelPrismaticUnaligned, se3::JointModelFreeFlyer, se3::JointModelPlanar, se3::JointModelTranslation, se3::JointModelRevoluteUnbounded<0>, se3::JointModelRevoluteUnbounded<1>, se3::JointModelRevoluteUnbounded<2>, boost::recursive_wrapper > > >::initializer_node, mpl_::int_<8> >, boost::mpl::l_iter, se3::JointModelPrismaticUnaligned, se3::JointModelFreeFlyer, se3::JointModelPlanar, se3::JointModelTranslation, se3::JointModelRevoluteUnbounded<0>, se3::JointModelRevoluteUnbounded<1>, se3::JointModelRevoluteUnbounded<2>, boost::recursive_wrapper > > >::initializer_node, mpl_::int_<9> >, boost::mpl::l_iter, se3::JointModelRevoluteUnbounded<1>, se3::JointModelRevoluteUnbounded<2>, boost::recursive_wrapper > > >::initializer_node, mpl_::int_<10> >, boost::mpl::l_iter, se3::JointModelRevoluteUnbounded<1>, se3::JointModelRevoluteUnbounded<2>, boost::recursive_wrapper > > >::initializer_node, mpl_::int_<11> >, boost::mpl::l_iter, se3::JointModelRevoluteUnbounded<1>, se3::JointModelRevoluteUnbounded<2>, boost::recursive_wrapper > > >::initializer_node, mpl_::int_<12> >, boost::mpl::l_iter, se3::JointModelRevoluteUnbounded<1>, se3::JointModelRevoluteUnbounded<2>, boost::recursive_wrapper > > >::initializer_node, mpl_::int_<13> >, boost::mpl::l_iter, se3::JointModelRevoluteUnbounded<1>, se3::JointModelRevoluteUnbounded<2>, boost::recursive_wrapper > > >::initializer_node, mpl_::int_<14> >, boost::mpl::l_iter, se3::JointModelRevoluteUnbounded<2>, boost::recursive_wrapper > > >::initializer_node, mpl_::int_<15> >, boost::mpl::l_iter, boost::recursive_wrapper > > >::initializer_node::param_T {aka const se3::JointModelRevoluteUnbounded<2>&}' | bindings/python/CMakeFiles/pinocchio_pywrap.dir/build.make:233: recipe for target 'bindings/python/CMakeFiles/pinocchio_pywrap.dir/multibody/expose-model.cpp.o' failed | make[2]: Leaving directory '/local/robotpkg/var/tmp/robotpkg/wip/pinocchio/work/pinocchio-1.2.4' | CMakeFiles/Makefile2:577: recipe for target 'bindings/python/CMakeFiles/pinocchio_pywrap.dir/all' failed | make[1]: Leaving directory '/local/robotpkg/var/tmp/robotpkg/wip/pinocchio/work/pinocchio-1.2.4' | Makefile:143: recipe for target 'all' failed | make[2]: *** [bindings/python/CMakeFiles/pinocchio_pywrap.dir/multibody/expose-model.cpp.o] Error 1 | make[1]: *** [bindings/python/CMakeFiles/pinocchio_pywrap.dir/all] Error 2 | make: *** [all] Error 2 For details or bug reports, check the complete log file in: /local/robotpkg/var/tmp/robotpkg/wip/pinocchio/work/build.log make[3]: *** [do-build] Error 1 make[2]: *** [pkg-check-installed] Error 2 ERROR: make: *** [package] Error 2 ===> Logging bulk summary for pinocchio-1.2.4r3 => Checking leftover files => Creating bulk log files => Logging bulk metadata ===> Cleaning temporary files for pinocchio-1.2.4r3 ===> Done bulk for pinocchio-1.2.4r3 [20%] Processing wip/kukaFri-libs:kukaFri-libs-1.3 ===> Bulk building for kukaFri-libs-1.3 Binary package for kukaFri-libs-1.3 is up-to-date. [20%] Processing wip/gdalwrap:gdalwrap-0.1.10 ===> Bulk building for gdalwrap-0.1.10 Binary package for gdalwrap-0.1.10 is up-to-date. [21%] Processing wip/atlaas:atlaas-0.1.6 ===> Bulk building for atlaas-0.1.6 Binary package for atlaas-0.1.6 is up-to-date. [21%] Processing wip/talos-ros-control:talos-ros-control-0.2.10 ===> Bulk building for talos-ros-control-0.2.10 Binary package for talos-ros-control-0.2.10 is up-to-date. [22%] Processing wip/talos-pal-hardware-interfaces:talos-pal-hardware-interfaces-0.0.3 ===> Bulk building for talos-pal-hardware-interfaces-0.0.3 Binary package for talos-pal-hardware-interfaces-0.0.3 is up-to-date. [22%] Processing wip/MPC_DEMTreatment-genom:MPC_DEMTreatment-genom-0.2 ===> Cleaning temporary files for MPC_DEMTreatment-genom-0.2~openprs+tcl+tclserv_client ===> Bulk building for MPC_DEMTreatment-genom-0.2~openprs+tcl+tclserv_client => Checking for clear installation Warning: the LICENSE of wip/MPC_DEMTreatment-genom is undefined. => Installing digest-20080510.tgz => Installing tnftp-20130505~ssl.tgz Warning: the LICENSE of wip/MPC_DEMTreatment-genom is undefined. => Required robotpkg package digest>=20080510: digest-20080510 found => Required robotpkg package tnftp>=20091122: tnftp-20130505~ssl found => Required system package gzip: gzip-1.6 found => Required system package pax and tar archivers: pax found => Required system package pkg_install>=20110805.7: pkg_install-20110805.7 found Warning: the LICENSE of wip/MPC_DEMTreatment-genom is undefined. Warning: the LICENSE of wip/MPC_DEMTreatment-genom is undefined. ERROR: Required robotpkg package MPC>=1.0: BROKEN => Dependency digest-20080510 already installed => Installing dtm-genom-1.5~openprs+tcl+tclserv_client.tgz => Dependency genBasic-genom-0.4r1~openprs+tcl+tclserv_client already installed => Dependency genPos-genom-0.3r1~openprs+tcl+tclserv_client already installed => Dependency genom-2.12~doc already installed => Dependency libt3d-2.6~doc already installed => Dependency libtclserv_client-0.5r1 already installed => Installing mkdep-2.7r1.tgz => Dependency pocolibs-2.16 already installed => Dependency pom-genom-0.7~openprs+tcl+tclserv_client already installed => Dependency stereopixel-genom-1.3~openprs+tcl+tclserv_client already installed => Dependency tclserv-2.8.1 already installed => Dependency tnftp-20130505~ssl already installed => Dependency transgen-1.1b1 already installed => Dependency velodyne-genom-1.6~openprs+tcl+tclserv_client already installed Warning: the LICENSE of wip/MPC_DEMTreatment-genom is undefined. Warning: the LICENSE of wip/MPC_DEMTreatment-genom is undefined. ===> Logging bulk summary for MPC_DEMTreatment-genom-0.2~openprs+tcl+tclserv_client => Checking leftover files => Creating bulk log files => Logging bulk metadata ===> Cleaning temporary files for MPC_DEMTreatment-genom-0.2~openprs+tcl+tclserv_client ===> Done bulk for MPC_DEMTreatment-genom-0.2~openprs+tcl+tclserv_client [23%] Processing wip/talos-roboticsgroup-gazebo-plugins:talos-roboticsgroup-gazebo-plugins-0.0.3 ===> Bulk building for talos-roboticsgroup-gazebo-plugins-0.0.3 Binary package for talos-roboticsgroup-gazebo-plugins-0.0.3 is up-to-date. [23%] Processing wip/joystick-genom:joystick-genom-1.0 ===> Bulk building for joystick-genom-1.0~openprs+tcl+tclserv_client Binary package for joystick-genom-1.0~openprs+tcl+tclserv_client is up-to-date. [23%] Processing wip/antlr2:antlr2-2.7.7 ===> Bulk building for antlr2-2.7.7 Binary package for antlr2-2.7.7 is up-to-date. [24%] Processing wip/mavlink:mavlink-20150929 ===> Bulk building for mavlink-20150929 Binary package for mavlink-20150929 is up-to-date. [24%] Processing wip/libnabo:libnabo-1.0.4 ===> Bulk building for libnabo-1.0.4 Binary package for libnabo-1.0.4 is up-to-date. [25%] Processing wip/jointStateMapper:jointStateMapper-1.2.1r1 ===> Cleaning temporary files for jointStateMapper-1.2.1r1 ===> Bulk building for jointStateMapper-1.2.1r1 => Checking for clear installation => Installing digest-20080510.tgz => Installing tnftp-20130505~ssl.tgz => Required robotpkg package digest>=20080510: digest-20080510 found => Required robotpkg package tnftp>=20091122: tnftp-20130505~ssl found => Required system package gzip: gzip-1.6 found => Required system package pax and tar archivers: pax found => Required system package pkg_install>=20110805.7: pkg_install-20110805.7 found => Dependency digest-20080510 already installed => Required robotpkg package openrobots-pose>=1.2: NOT found ERROR: Required robotpkg package openrobots-pose>=1.2: NOT found => Dependency tnftp-20130505~ssl already installed ===> Logging bulk summary for jointStateMapper-1.2.1r1 => Checking leftover files => Creating bulk log files => Logging bulk metadata ===> Cleaning temporary files for jointStateMapper-1.2.1r1 ===> Done bulk for jointStateMapper-1.2.1r1 [25%] Processing wip/osg-dae:osg-dae-3.2.0r1 ===> Cleaning temporary files for osg-dae-3.2.0r1 ===> Bulk building for osg-dae-3.2.0r1 => Checking for clear installation => Installing digest-20080510.tgz => Installing tnftp-20130505~ssl.tgz => Required robotpkg package digest>=20080510: digest-20080510 found => Required robotpkg package tnftp>=20091122: tnftp-20130505~ssl found => Required system package gzip: gzip-1.6 found => Required system package pax and tar archivers: pax found => Required system package pkg_install>=20110805.7: pkg_install-20110805.7 found => Installing collada-dom-2.3.1r2.tgz => Dependency digest-20080510 already installed => Dependency tnftp-20130505~ssl already installed => Building with no option. => Use the GNU C++ compiler: c++-compiler provided by g++>=3 => Use the GNU C compiler: c-compiler provided by gcc>=3 => Required system package boost-headers>=1.34.1: boost-headers-1.60 found => Required system package boostlib-filesystem>=1.34.1: boost-libs-1.60.0 found => Required system package boostlib-system>=1.34.1: boost-libs-1.60.0 found => Required system package cmake>=2.6: cmake-3.9.0 found => Required system package doxygen>=1.5: doxygen-1.8.11 found => Required system package g++>=3: g++-6.3.1 found => Required system package gcc>=3: gcc-6.3.1 found => Required system package libstdc++: libstdc++ found => Required system package openscenegraph>=3: openscenegraph-3.4.0 found => Required system package pkg-config>=0.22: pkg-config-0.29 found => Required robotpkg package collada-dom>=2.3.1: collada-dom-2.3.1r2 found => SHA1 checksums OK => RMD160 checksums OK An unexpected error occured. The last 10 log lines are shown below. | A required package was not found | Call Stack (most recent call first): | /usr/share/cmake/Modules/FindPkgConfig.cmake:588 (_pkg_check_modules_internal) | cmake/pkg-config.cmake:273 (PKG_CHECK_MODULES) | cmake/pkg-config.cmake:438 (ADD_DEPENDENCY) | CMakeLists.txt:60 (ADD_REQUIRED_DEPENDENCY) | | | -- Configuring incomplete, errors occurred! | See also "/local/robotpkg/var/tmp/robotpkg/wip/osg-dae/work/osg-dae-3.2.0/CMakeFiles/CMakeOutput.log". For details or bug reports, check the complete log file in: /local/robotpkg/var/tmp/robotpkg/wip/osg-dae/work/configure.log make[3]: *** [do-configure-cmake] Error 1 make[2]: *** [pkg-check-installed] Error 2 => Marking osg-dae-3.2.0r1 as broken ERROR: make: *** [package] Error 2 ===> Logging bulk summary for osg-dae-3.2.0r1 => Checking leftover files => Creating bulk log files => Logging bulk metadata ===> Cleaning temporary files for osg-dae-3.2.0r1 ===> Done bulk for osg-dae-3.2.0r1 [26%] Processing wip/talos-ros-controllers:talos-ros-controllers-0.2.11 ===> Cleaning temporary files for talos-ros-controllers-0.2.11 ===> Bulk building for talos-ros-controllers-0.2.11 => Checking for clear installation => Installing digest-20080510.tgz => Installing tnftp-20130505~ssl.tgz => Required robotpkg package digest>=20080510: digest-20080510 found => Required robotpkg package tnftp>=20091122: tnftp-20130505~ssl found => Required system package gzip: gzip-1.6 found => Required system package pax and tar archivers: pax found => Required system package pkg_install>=20110805.7: pkg_install-20110805.7 found => Dependency digest-20080510 already installed => Installing ros-actionlib-1.11.9.tgz => Dependency ros-catkin-0.6.9r2 already installed => Dependency ros-comm-1.11.20 already installed => Dependency ros-common-msgs-1.11.4 already installed => Installing ros-control-msgs-1.3.1.tgz => Installing ros-control-toolbox-1.13.2r1.tgz => Dependency ros-genmsg-0.5.3 already installed => Installing ros-geometry-1.11.3r1.tgz => Dependency ros-message-generation-0.2.10 already installed => Dependency ros-message-runtime-0.4.12 already installed => Installing ros-pluginlib-1.10.1.tgz => Installing ros-robot-model-1.11.5.tgz => Dependency ros-ros-1.11.4 already installed => Dependency ros-std-msgs-0.5.9 already installed => Installing ros-xacro-1.9.2.tgz => Installing talos-pal-hardware-interfaces-0.0.3.tgz => Dependency talos-ros-control-0.2.10 already installed => Dependency tnftp-20130505~ssl already installed => Building with no option. => Use the GNU C++ compiler: c++-compiler provided by g++>=3 => Use the GNU C compiler: c-compiler provided by gcc>=3 => Use python-2.7: python>=2.5<3.7 provided by python27>=2.7<2.8 => Use ros indigo: ros>=groovy ros>=hydro provided by ros-indigo => Required system package boost-headers>=1.34.1: boost-headers-1.60 found => Required system package boostlib-filesystem>=1.34.1: boost-libs-1.60.0 found => Required system package boostlib-iostreams>=1.34.1: boost-libs-1.60.0 found => Required system package boostlib-math>=1.34.1: boost-libs-1.60.0 found => Required system package boostlib-thread>=1.34.1: boost-libs-1.60.0 found => Required system package cmake>=2.8.3: cmake-3.9.0 found => Required system package eigen3>=3.0.0: eigen3-3.2.10 found => Required system package g++>=3: g++-6.3.1 found => Required system package gcc>=3: gcc-6.3.1 found => Required system package googletest: googletest found => Required system package libstdc++: libstdc++ found => Required system package pkg-config>=0.22: pkg-config-0.29 found => Required system package py27-nose>=0.10: py27-nose-1.3.7 found => Required system package python27>=2.7<2.8: python27-2.7.13 found => Required system package tinyxml>=2: tinyxml-2.6.2 found => Required robotpkg package ros-actionlib>=1.11<1.12: ros-actionlib-1.11.9 found => Required robotpkg package ros-catkin>=0.6<0.7: ros-catkin-0.6.9r2 found => Required robotpkg package ros-comm>=1.11<1.12: ros-comm-1.11.20 found => Required robotpkg package ros-common-msgs>=1.11<1.12: ros-common-msgs-1.11.4 found => Required robotpkg package ros-control-msgs>=1.3<1.4: ros-control-msgs-1.3.1 found => Required robotpkg package ros-control-toolbox>=1.13<1.15: ros-control-toolbox-1.13.2r1 found => Required robotpkg package ros-genmsg>=0.5<0.6: ros-genmsg-0.5.3 found => Required robotpkg package ros-geometry>=1.11<1.12: ros-geometry-1.11.3r1 found => Required robotpkg package ros-message-generation>=0.2<0.3: ros-message-generation-0.2.10 found => Required robotpkg package ros-message-runtime>=0.4<0.5: ros-message-runtime-0.4.12 found => Required robotpkg package ros-pluginlib>=1.10<1.11: ros-pluginlib-1.10.1 found => Required robotpkg package ros-robot-model>=1.11<1.12: ros-robot-model-1.11.5 found => Required robotpkg package ros-ros>=1.11<1.12: ros-ros-1.11.4 found => Required robotpkg package ros-std-msgs>=0.5: ros-std-msgs-0.5.9 found => Required robotpkg package ros-xacro>=1.9<1.10: ros-xacro-1.9.2 found => Required robotpkg package talos-pal-hardware-interfaces>=0.0.2: talos-pal-hardware-interfaces-0.0.3 found => Required robotpkg package talos-ros-control>=0.2: talos-ros-control-0.2.10 found => SHA1 checksums OK => RMD160 checksums OK An unexpected error occured. The last 10 log lines are shown below. | "cmake_modules_DIR" to a directory containing one of the above files. If | "cmake_modules" provides a separate development package or SDK, be sure it | has been installed. | Call Stack (most recent call first): | talos_joint_trajectory_controller/CMakeLists.txt:51 (find_package) | | | -- Configuring incomplete, errors occurred! | See also "/local/robotpkg/var/tmp/robotpkg/wip/talos-ros-controllers/work/talos_ros_controllers-0.2.11/build/CMakeFiles/CMakeOutput.log". | See also "/local/robotpkg/var/tmp/robotpkg/wip/talos-ros-controllers/work/talos_ros_controllers-0.2.11/build/CMakeFiles/CMakeError.log". For details or bug reports, check the complete log file in: /local/robotpkg/var/tmp/robotpkg/wip/talos-ros-controllers/work/configure.log make[3]: *** [do-configure-cmake] Error 1 make[2]: *** [pkg-check-installed] Error 2 => Marking talos-ros-controllers-0.2.11 as broken ERROR: make: *** [package] Error 2 ===> Logging bulk summary for talos-ros-controllers-0.2.11 => Checking leftover files => Creating bulk log files => Logging bulk metadata ===> Cleaning temporary files for talos-ros-controllers-0.2.11 ===> Done bulk for talos-ros-controllers-0.2.11 [26%] Processing wip/pal-msgs:pal-msgs-0.11.3 ===> Cleaning temporary files for pal-msgs-0.11.3 ===> Bulk building for pal-msgs-0.11.3 => Checking for clear installation => Installing digest-20080510.tgz => Installing tnftp-20130505~ssl.tgz => Required robotpkg package digest>=20080510: digest-20080510 found => Required robotpkg package tnftp>=20091122: tnftp-20130505~ssl found => Required system package gzip: gzip-1.6 found => Required system package pax and tar archivers: pax found => Required system package pkg_install>=20110805.7: pkg_install-20110805.7 found => Dependency digest-20080510 already installed => Installing py27-rospkg-1.0.29r1.tgz => Installing ros-actionlib-1.11.9.tgz => Dependency ros-catkin-0.6.9r2 already installed => Installing ros-cmake-modules-0.3.1.tgz => Dependency ros-comm-1.11.20 already installed => Dependency ros-common-msgs-1.11.4 already installed => Installing ros-control-toolbox-1.13.2r1.tgz => Dependency ros-genmsg-0.5.3 already installed => Installing ros-geometry-1.11.3r1.tgz => Dependency ros-message-generation-0.2.10 already installed => Dependency ros-message-runtime-0.4.12 already installed => Installing ros-pluginlib-1.10.1.tgz => Dependency ros-ros-1.11.4 already installed => Dependency ros-std-msgs-0.5.9 already installed => Dependency tnftp-20130505~ssl already installed => Building with no option. => Use the GNU C++ compiler: c++-compiler provided by g++>=3 => Use the GNU C compiler: c-compiler provided by gcc>=3 => Use python-2.7: python>=2.5<3.7 provided by python27>=2.7<2.8 => Use ros indigo: ros>=groovy ros>=hydro provided by ros-indigo => Required system package cmake>=2.8.3: cmake-3.9.0 found => Required system package eigen3>=3.0.0: eigen3-3.2.10 found => Required system package g++>=3: g++-6.3.1 found => Required system package gcc>=3: gcc-6.3.1 found => Required system package googletest: googletest found => Required system package libstdc++: libstdc++ found => Required system package pkg-config>=0.22: pkg-config-0.29 found => Required system package py27-nose>=0.10: py27-nose-1.3.7 found => Required system package python27>=2.7<2.8: python27-2.7.13 found => Required robotpkg package py27-rospkg>=1.0.29: py27-rospkg-1.0.29r1 found => Required robotpkg package ros-actionlib>=1.11<1.12: ros-actionlib-1.11.9 found => Required robotpkg package ros-catkin>=0.6<0.7: ros-catkin-0.6.9r2 found => Required robotpkg package ros-cmake-modules>=0.3: ros-cmake-modules-0.3.1 found => Required robotpkg package ros-comm>=1.11<1.12: ros-comm-1.11.20 found => Required robotpkg package ros-common-msgs>=1.11<1.12: ros-common-msgs-1.11.4 found => Required robotpkg package ros-control-toolbox>=1.13<1.15: ros-control-toolbox-1.13.2r1 found => Required robotpkg package ros-genmsg>=0.5<0.6: ros-genmsg-0.5.3 found => Required robotpkg package ros-geometry>=1.11<1.12: ros-geometry-1.11.3r1 found => Required robotpkg package ros-message-generation>=0.2<0.3: ros-message-generation-0.2.10 found => Required robotpkg package ros-message-runtime>=0.4<0.5: ros-message-runtime-0.4.12 found => Required robotpkg package ros-pluginlib>=1.10<1.11: ros-pluginlib-1.10.1 found => Required robotpkg package ros-ros>=1.11<1.12: ros-ros-1.11.4 found => Required robotpkg package ros-std-msgs>=0.5: ros-std-msgs-0.5.9 found => SHA1 checksums OK => RMD160 checksums OK An unexpected error occured. The last 10 log lines are shown below. | set "humanoid_nav_msgs_DIR" to a directory containing one of the above | files. If "humanoid_nav_msgs" provides a separate development package or | SDK, be sure it has been installed. | Call Stack (most recent call first): | pal_walking_msgs/CMakeLists.txt:4 (find_package) | | | -- Configuring incomplete, errors occurred! | See also "/local/robotpkg/var/tmp/robotpkg/wip/pal-msgs/work/pal_msgs-0.11.3/build/CMakeFiles/CMakeOutput.log". | See also "/local/robotpkg/var/tmp/robotpkg/wip/pal-msgs/work/pal_msgs-0.11.3/build/CMakeFiles/CMakeError.log". For details or bug reports, check the complete log file in: /local/robotpkg/var/tmp/robotpkg/wip/pal-msgs/work/configure.log make[3]: *** [do-configure-cmake] Error 1 make[2]: *** [pkg-check-installed] Error 2 => Marking pal-msgs-0.11.3 as broken ERROR: make: *** [package] Error 2 ===> Logging bulk summary for pal-msgs-0.11.3 => Checking leftover files => Creating bulk log files => Logging bulk metadata ===> Cleaning temporary files for pal-msgs-0.11.3 ===> Done bulk for pal-msgs-0.11.3 [27%] Processing wip/openhrp3-simulator-wo-rtm:openhrp3-simulator-wo-rtm-1.1.3r3 ===> Cleaning temporary files for openhrp3-simulator-wo-rtm-1.1.3r3 ===> Bulk building for openhrp3-simulator-wo-rtm-1.1.3r3 => Checking for clear installation => Installing digest-20080510.tgz => Installing tnftp-20130505~ssl.tgz => Required robotpkg package digest>=20080510: digest-20080510 found => Required robotpkg package tnftp>=20091122: tnftp-20130505~ssl found => Required system package gzip: gzip-1.6 found => Required system package pax and tar archivers: pax found => Required system package pkg_install>=20110805.7: pkg_install-20110805.7 found => Dependency digest-20080510 already installed => Installing gepetto-viewer-1.2.1.tgz => Installing ros-catkin-0.6.9r2.tgz => Installing ros-common-msgs-1.11.4.tgz => Dependency ros-genmsg-0.5.3 already installed => Dependency ros-message-generation-0.2.10 already installed => Dependency ros-roscpp-core-0.5.4r1 already installed => Dependency ros-std-msgs-0.5.9 already installed => Dependency tnftp-20130505~ssl already installed => Building with no option. => Use the GNU C++ compiler: c++-compiler provided by g++>=3 => Use the GNU C compiler: c-compiler provided by gcc>=3 => Use python-2.7: python>=2.5<3.7 provided by python27>=2.7<2.8 => Use ros indigo: ros>=groovy provided by ros-indigo => Required system package cmake>=2.8.3: cmake-3.9.0 found => Required system package g++>=3: g++-6.3.1 found => Required system package gcc>=3: gcc-6.3.1 found => Required system package googletest: googletest found => Required system package libstdc++: libstdc++ found => Required system package pkg-config>=0.22: pkg-config-0.29 found => Required system package py27-nose>=0.10: py27-nose-1.3.7 found => Required system package python27>=2.7<2.8: python27-2.7.13 found => Required robotpkg package gepetto-viewer>=1.2.0: gepetto-viewer-1.2.1 found => Required robotpkg package ros-catkin>=0.6<0.7: ros-catkin-0.6.9r2 found => Required robotpkg package ros-common-msgs>=1.11<1.12: ros-common-msgs-1.11.4 found => Required robotpkg package ros-genmsg>=0.5<0.6: ros-genmsg-0.5.3 found => Required robotpkg package ros-message-generation>=0.2<0.3: ros-message-generation-0.2.10 found => Required robotpkg package ros-roscpp-core>=0.5<0.6: ros-roscpp-core-0.5.4r1 found => Required robotpkg package ros-std-msgs>=0.5: ros-std-msgs-0.5.9 found => SHA1 checksums OK => RMD160 checksums OK An unexpected error occured. The last 10 log lines are shown below. | "roscpp_DIR" to a directory containing one of the above files. If "roscpp" | provides a separate development package or SDK, be sure it has been | installed. | Call Stack (most recent call first): | CMakeLists.txt:10 (find_package) | | | -- Configuring incomplete, errors occurred! | See also "/local/robotpkg/var/tmp/robotpkg/wip/openhrp3-simulator-wo-rtm/work/openhrp3_simulator_wo_rtm-1.1.3/CMakeFiles/CMakeOutput.log". | See also "/local/robotpkg/var/tmp/robotpkg/wip/openhrp3-simulator-wo-rtm/work/openhrp3_simulator_wo_rtm-1.1.3/CMakeFiles/CMakeError.log". For details or bug reports, check the complete log file in: /local/robotpkg/var/tmp/robotpkg/wip/openhrp3-simulator-wo-rtm/work/configure.log make[3]: *** [do-configure-cmake] Error 1 make[2]: *** [pkg-check-installed] Error 2 => Marking openhrp3-simulator-wo-rtm-1.1.3r3 as broken ERROR: make: *** [package] Error 2 ===> Logging bulk summary for openhrp3-simulator-wo-rtm-1.1.3r3 => Checking leftover files => Creating bulk log files => Logging bulk metadata ===> Cleaning temporary files for openhrp3-simulator-wo-rtm-1.1.3r3 ===> Done bulk for openhrp3-simulator-wo-rtm-1.1.3r3 [27%] Processing wip/hrp2-14-description:hrp2-14-description-1.0.4 ===> Bulk building for hrp2-14-description-1.0.4 Binary package for hrp2-14-description-1.0.4 is up-to-date. [28%] Processing wip/eigen-quadprog:eigen-quadprog-1.0.0 ===> Bulk building for eigen-quadprog-1.0.0 Binary package for eigen-quadprog-1.0.0 is up-to-date. [28%] Processing wip/jafar-qdisplay:jafar-qdisplay-0.2r1 ===> Bulk building for jafar-qdisplay-0.2r1 Binary package for jafar-qdisplay-0.2r1 is up-to-date. [29%] Processing wip/octovis:octoviz-1.6.1 ===> Cleaning temporary files for octoviz-1.6.1 ===> Bulk building for octoviz-1.6.1 => Checking for clear installation => Installing digest-20080510.tgz => Installing tnftp-20130505~ssl.tgz => Required robotpkg package digest>=20080510: digest-20080510 found => Required robotpkg package tnftp>=20130505~ssl: tnftp-20130505~ssl found => Required system package gzip: gzip-1.6 found => Required system package pax and tar archivers: pax found => Required system package pkg_install>=20110805.7: pkg_install-20110805.7 found => Dependency digest-20080510 already installed => Required system package libqglviewer>=2.3: MISSING => Installing octomap-1.6.1.tgz => Dependency tnftp-20130505~ssl already installed ERROR: ====================================================================== ERROR: Missing system packages required for octoviz-1.6.1: ERROR: ERROR: libqglviewer>=2.3 (Fedora package libQGLViewer-devel) ERROR: ERROR: Please use the system package management tool to install these ERROR: dependencies. If a robotpkg version of a dependency is available, ERROR: you can configure robotpkg.conf to use this version instead. ERROR: ERROR: See /local/robotpkg/var/tmp/robotpkg/wip/octovis/work/sysdep.log for details. ERROR: ====================================================================== make[2]: *** [sys-depends] Error 2 ===> Logging bulk summary for octoviz-1.6.1 => Checking leftover files => Creating bulk log files => Logging bulk metadata ===> Cleaning temporary files for octoviz-1.6.1 ===> Done bulk for octoviz-1.6.1 [29%] Processing wip/talos-gazebo-ros-control:talos-gazebo-ros-control-2.6.6 ===> Bulk building for talos-gazebo-ros-control-2.6.6 Binary package for talos-gazebo-ros-control-2.6.6 is up-to-date. [30%] Processing wip/hyper:hyper-0.13r1 ===> Cleaning temporary files for hyper-0.13r1 ===> Bulk building for hyper-0.13r1 => Checking for clear installation => Installing digest-20080510.tgz => Installing tnftp-20130505~ssl.tgz => Required robotpkg package digest>=20080510: digest-20080510 found => Required robotpkg package tnftp>=20091122: tnftp-20130505~ssl found => Required system package gzip: gzip-1.6 found => Required system package patch>=2.0: patch-2.7.5 found => Required system package pax and tar archivers: pax found => Required system package pkg_install>=20110805.7: pkg_install-20110805.7 found => Dependency digest-20080510 already installed => Dependency tnftp-20130505~ssl already installed => Building with no option. => Use the GNU C++ compiler: c++-compiler provided by g++>=3 => Use the GNU C compiler: c-compiler provided by gcc>=3 => Required system package boost-headers>=1.46.1: boost-headers-1.60 found => Required system package boostlib-filesystem>=1.46.1: boost-libs-1.60.0 found => Required system package boostlib-iostreams>=1.46.1: boost-libs-1.60.0 found => Required system package boostlib-math>=1.46.1: boost-libs-1.60.0 found => Required system package boostlib-thread>=1.46.1: boost-libs-1.60.0 found => Required system package cmake>=2.6: cmake-3.9.0 found => Required system package g++>=3: g++-6.3.1 found => Required system package gcc>=3: gcc-6.3.1 found => Required system package libstdc++: libstdc++ found => SHA1 checksums OK => RMD160 checksums OK => Applying robotpkg patches for hyper-0.13r1 An unexpected error occured. The last 10 log lines are shown below. | ^ | compilation terminated. | make[2]: *** [CMakeFiles/hyper_logic.dir/src/logic/backward_chaining.cc.o] Error 1 | CMakeFiles/hyper_logic.dir/build.make:65: recipe for target 'CMakeFiles/hyper_logic.dir/src/logic/backward_chaining.cc.o' failed | make[2]: Leaving directory '/local/robotpkg/var/tmp/robotpkg/wip/hyper/work/hyper-0.13' | CMakeFiles/Makefile2:295: recipe for target 'CMakeFiles/hyper_logic.dir/all' failed | make[1]: Leaving directory '/local/robotpkg/var/tmp/robotpkg/wip/hyper/work/hyper-0.13' | Makefile:143: recipe for target 'all' failed | make[1]: *** [CMakeFiles/hyper_logic.dir/all] Error 2 | make: *** [all] Error 2 For details or bug reports, check the complete log file in: /local/robotpkg/var/tmp/robotpkg/wip/hyper/work/build.log make[3]: *** [do-build] Error 1 make[2]: *** [pkg-check-installed] Error 2 => Marking hyper-0.13r1 as broken ERROR: make: *** [package] Error 2 ===> Logging bulk summary for hyper-0.13r1 => Checking leftover files => Creating bulk log files => Logging bulk metadata ===> Cleaning temporary files for hyper-0.13r1 ===> Done bulk for hyper-0.13r1 [30%] Processing wip/libfreenect:libfreenect-20110118.2ea3ebr1 ===> Cleaning temporary files for libfreenect-20110118.2ea3ebr1 ===> Bulk building for libfreenect-20110118.2ea3ebr1 => Checking for clear installation => Installing digest-20080510.tgz => Installing tnftp-20130505~ssl.tgz => Required robotpkg package digest>=20080510: digest-20080510 found => Required robotpkg package tnftp>=20091122: tnftp-20130505~ssl found => Required system package git>=1.6: git-2.7.5 found => Required system package gzip: gzip-1.6 found => Required system package patch>=2.0: patch-2.7.5 found => Required system package pax and tar archivers: pax found => Required system package pkg_install>=20110805.7: pkg_install-20110805.7 found => Dependency digest-20080510 already installed => Dependency tnftp-20130505~ssl already installed => Building with no option. => Use the GNU C++ compiler: c++-compiler provided by g++>=3 => Use the GNU C compiler: c-compiler provided by gcc>=3 => Required system package cmake>=2.6: cmake-3.9.0 found => Required system package g++>=3: g++-6.3.1 found => Required system package gcc>=3: gcc-6.3.1 found => Required system package A BSD-compatible install program: install-sh found => Required system package libXmu>=1: libXmu-1.1.2 found => Required system package libstdc++: libstdc++ found => SHA1 checksums OK => RMD160 checksums OK => Applying robotpkg patches for libfreenect-20110118.2ea3ebr1 An unexpected error occured. The last 10 log lines are shown below. | m_devices.insert(std::make_pair(_index, device)); | ~~~~~~~~~~~~~~~~~~~~~~~~~~~~~~~~~~~~^~~~~~~~~~~~~~~~ | make[2]: *** [wrappers/cpp/CMakeFiles/cppview.dir/cppview.cpp.o] Error 1 | wrappers/cpp/CMakeFiles/cppview.dir/build.make:65: recipe for target 'wrappers/cpp/CMakeFiles/cppview.dir/cppview.cpp.o' failed | make[2]: Leaving directory '/local/robotpkg/var/tmp/robotpkg/wip/libfreenect/work/libfreenect-20110118.2ea3eb' | CMakeFiles/Makefile2:537: recipe for target 'wrappers/cpp/CMakeFiles/cppview.dir/all' failed | make[1]: Leaving directory '/local/robotpkg/var/tmp/robotpkg/wip/libfreenect/work/libfreenect-20110118.2ea3eb' | Makefile:132: recipe for target 'all' failed | make[1]: *** [wrappers/cpp/CMakeFiles/cppview.dir/all] Error 2 | make: *** [all] Error 2 For details or bug reports, check the complete log file in: /local/robotpkg/var/tmp/robotpkg/wip/libfreenect/work/build.log make[3]: *** [do-build] Error 1 make[2]: *** [pkg-check-installed] Error 2 => Marking libfreenect-20110118.2ea3ebr1 as broken ERROR: make: *** [package] Error 2 ===> Logging bulk summary for libfreenect-20110118.2ea3ebr1 => Checking leftover files => Creating bulk log files => Logging bulk metadata ===> Cleaning temporary files for libfreenect-20110118.2ea3ebr1 ===> Done bulk for libfreenect-20110118.2ea3ebr1 [30%] Processing wip/jsbsim:jsbsim-20150424 ===> Bulk building for jsbsim-20150424 Binary package for jsbsim-20150424 is up-to-date. [31%] Processing wip/track-target-genom:track-target-genom-0.2r1 ===> Bulk building for track-target-genom-0.2r1~openprs+tcl+tclserv_client Binary package for track-target-genom-0.2r1~openprs+tcl+tclserv_client is up-to-date. [31%] Processing wip/talos-pal-gazebo-plugins:talos-pal-gazebo-plugins-1.1.5r2 ===> Cleaning temporary files for talos-pal-gazebo-plugins-1.1.5r2 ===> Bulk building for talos-pal-gazebo-plugins-1.1.5r2 => Checking for clear installation => Installing digest-20080510.tgz => Installing tnftp-20130505~ssl.tgz => Required robotpkg package digest>=20080510: digest-20080510 found => Required robotpkg package tnftp>=20091122: tnftp-20130505~ssl found => Required system package gzip: gzip-1.6 found => Required system package patch>=2.0: patch-2.7.5 found => Required system package pax and tar archivers: pax found => Required system package pkg_install>=20110805.7: pkg_install-20110805.7 found => Dependency digest-20080510 already installed ERROR: Required robotpkg package pal-msgs>=0.11.3: BROKEN => Installing ros-actionlib-1.11.9.tgz => Dependency ros-catkin-0.6.9r2 already installed => Dependency ros-comm-1.11.20 already installed => Dependency ros-common-msgs-1.11.4 already installed => Installing ros-control-toolbox-1.13.2r1.tgz => Dependency ros-genmsg-0.5.3 already installed => Installing ros-geometry-1.11.3r1.tgz => Dependency ros-message-generation-0.2.10 already installed => Dependency ros-message-runtime-0.4.12 already installed => Installing ros-pluginlib-1.10.1.tgz => Installing ros-robot-model-1.11.5.tgz => Dependency ros-ros-1.11.4 already installed => Dependency ros-std-msgs-0.5.9 already installed => Dependency tnftp-20130505~ssl already installed ===> Logging bulk summary for talos-pal-gazebo-plugins-1.1.5r2 => Checking leftover files => Creating bulk log files => Logging bulk metadata ===> Cleaning temporary files for talos-pal-gazebo-plugins-1.1.5r2 ===> Done bulk for talos-pal-gazebo-plugins-1.1.5r2 [32%] Processing wip/MPC_planner-genom:MPC_planner-genom-0.2r1 ===> Cleaning temporary files for MPC_planner-genom-0.2r1~openprs+tcl+tclserv_client ===> Bulk building for MPC_planner-genom-0.2r1~openprs+tcl+tclserv_client => Checking for clear installation Warning: the LICENSE of wip/MPC_planner-genom is undefined. => Installing digest-20080510.tgz => Installing tnftp-20130505~ssl.tgz Warning: the LICENSE of wip/MPC_planner-genom is undefined. => Required robotpkg package digest>=20080510: digest-20080510 found => Required robotpkg package tnftp>=20091122: tnftp-20130505~ssl found => Required system package gzip: gzip-1.6 found => Required system package patch>=2.0: patch-2.7.5 found => Required system package pax and tar archivers: pax found => Required system package pkg_install>=20110805.7: pkg_install-20110805.7 found Warning: the LICENSE of wip/MPC_planner-genom is undefined. Warning: the LICENSE of wip/MPC_planner-genom is undefined. ERROR: Required robotpkg package MPC>=1.0: BROKEN => Dependency digest-20080510 already installed => Installing dtm-genom-1.5~openprs+tcl+tclserv_client.tgz => Dependency genBasic-genom-0.4r1~openprs+tcl+tclserv_client already installed => Dependency genPos-genom-0.3r1~openprs+tcl+tclserv_client already installed => Dependency genom-2.12~doc already installed => Dependency libt3d-2.6~doc already installed => Dependency libtclserv_client-0.5r1 already installed => Installing mkdep-2.7r1.tgz => Dependency pocolibs-2.16 already installed => Dependency pom-genom-0.7~openprs+tcl+tclserv_client already installed => Dependency stereopixel-genom-1.3~openprs+tcl+tclserv_client already installed => Dependency tclserv-2.8.1 already installed => Dependency tnftp-20130505~ssl already installed => Dependency transgen-1.1b1 already installed => Dependency velodyne-genom-1.6~openprs+tcl+tclserv_client already installed Warning: the LICENSE of wip/MPC_planner-genom is undefined. Warning: the LICENSE of wip/MPC_planner-genom is undefined. ===> Logging bulk summary for MPC_planner-genom-0.2r1~openprs+tcl+tclserv_client => Checking leftover files => Creating bulk log files => Logging bulk metadata ===> Cleaning temporary files for MPC_planner-genom-0.2r1~openprs+tcl+tclserv_client ===> Done bulk for MPC_planner-genom-0.2r1~openprs+tcl+tclserv_client [32%] Processing wip/gladys:gladys-0.2.8 ===> Cleaning temporary files for gladys-0.2.8~python ===> Bulk building for gladys-0.2.8~python => Checking for clear installation => Installing digest-20080510.tgz => Installing tnftp-20130505~ssl.tgz => Required robotpkg package digest>=20080510: digest-20080510 found => Required robotpkg package tnftp>=20091122: tnftp-20130505~ssl found => Required system package gzip: gzip-1.6 found => Required system package pax and tar archivers: pax found => Required system package pkg_install>=20110805.7: pkg_install-20110805.7 found => Dependency digest-20080510 already installed => Installing gdalwrap-0.1.10.tgz => Dependency tnftp-20130505~ssl already installed => Building with the following options: => Use the GNU C++ compiler: c++-compiler provided by g++>=4.6 => Use the GNU C compiler: c-compiler provided by gcc>=3 => Use python-2.7: python>=2.5<3.7 provided by python27>=2.7<2.8 => Required system package boost-headers>=1.46.1: boost-headers-1.60 found => Required system package boostlib-filesystem>=1.46.1: boost-libs-1.60.0 found => Required system package boostlib-iostreams>=1.46.1: boost-libs-1.60.0 found => Required system package boostlib-math>=1.46.1: boost-libs-1.60.0 found => Required system package boostlib-thread>=1.46.1: boost-libs-1.60.0 found => Required system package cmake>=2.6: cmake-3.9.0 found => Required system package g++>=4.6: g++-6.3.1 found => Required system package gcc>=3: gcc-6.3.1 found => Required system package libstdc++: libstdc++ found => Required system package pkg-config>=0.22: pkg-config-0.29 found => Required system package python27>=2.7<2.8: python27-2.7.13 found => Required robotpkg package gdalwrap>=0.1: gdalwrap-0.1.10 found => SHA1 checksums OK => RMD160 checksums OK An unexpected error occured. The last 10 log lines are shown below. | | No Boost libraries were found. You may need to set BOOST_LIBRARYDIR to the | directory containing Boost libraries or BOOST_ROOT to the location of | Boost. | Call Stack (most recent call first): | CMakeLists.txt:56 (find_package) | | | -- Configuring incomplete, errors occurred! | See also "/local/robotpkg/var/tmp/robotpkg/wip/gladys/work/gladys-0.2.8/CMakeFiles/CMakeOutput.log". For details or bug reports, check the complete log file in: /local/robotpkg/var/tmp/robotpkg/wip/gladys/work/configure.log make[3]: *** [do-configure-cmake] Error 1 make[2]: *** [pkg-check-installed] Error 2 => Marking gladys-0.2.8~python as broken ERROR: make: *** [package] Error 2 ===> Logging bulk summary for gladys-0.2.8~python => Checking leftover files => Creating bulk log files => Logging bulk metadata ===> Cleaning temporary files for gladys-0.2.8~python ===> Done bulk for gladys-0.2.8~python [33%] Processing wip/can-utils:can-utils-20160229 ===> Bulk building for can-utils-20160229 Binary package for can-utils-20160229 is up-to-date. [33%] Processing wip/sot-dyninv-v3:sot-dyninv-v3-3.0.0 ===> Cleaning temporary files for sot-dyninv-v3-3.0.0 ===> Bulk building for sot-dyninv-v3-3.0.0 => Checking for clear installation => Installing digest-20080510.tgz => Installing tnftp-20130505~ssl.tgz => Required robotpkg package digest>=20080510: digest-20080510 found => Required robotpkg package tnftp>=20091122: tnftp-20130505~ssl found => Required system package gzip: gzip-1.6 found => Required system package pax and tar archivers: pax found => Required system package pkg_install>=20110805.7: pkg_install-20110805.7 found => Dependency digest-20080510 already installed => Installing py27-dynamic-graph-v3-3.0.2.tgz => Installing sot-core-v3-3.1.0.tgz ERROR: Required robotpkg package soth>=2.0.0: BROKEN => Dependency tnftp-20130505~ssl already installed ===> Logging bulk summary for sot-dyninv-v3-3.0.0 => Checking leftover files => Creating bulk log files => Logging bulk metadata ===> Cleaning temporary files for sot-dyninv-v3-3.0.0 ===> Done bulk for sot-dyninv-v3-3.0.0 [34%] Processing wip/orocos-yarp_transport:orocos-yarp_transport-20150316 ===> Cleaning temporary files for orocos-yarp_transport-20150316~doc ===> Bulk building for orocos-yarp_transport-20150316~doc => Checking for clear installation => Installing digest-20080510.tgz => Installing tnftp-20130505~ssl.tgz => Required robotpkg package digest>=20080510: digest-20080510 found => Required robotpkg package tnftp>=20091122: tnftp-20130505~ssl found => Required system package git>=1.6: git-2.7.5 found => Required system package gzip: gzip-1.6 found => Required system package pax and tar archivers: pax found => Required system package pkg_install>=20110805.7: pkg_install-20110805.7 found => Installing ace-6.0.4r2.tgz => Dependency digest-20080510 already installed => Required system package docbook>=0.6: MISSING => Required robotpkg package orocos-rtt>=2.5: NOT found ERROR: Required robotpkg package orocos-rtt>=2.5: NOT found => Dependency tnftp-20130505~ssl already installed => Installing yarp-2.3.64r3~gui.tgz ERROR: ====================================================================== ERROR: Missing system packages required for orocos-yarp_transport-20150316~doc: ERROR: ERROR: docbook>=0.6 (Fedora package docbook-utils) ERROR: ERROR: Please use the system package management tool to install these ERROR: dependencies. If a robotpkg version of a dependency is available, ERROR: you can configure robotpkg.conf to use this version instead. ERROR: ERROR: See /local/robotpkg/var/tmp/robotpkg/wip/orocos-yarp_transport/work/sysdep.log for details. ERROR: ====================================================================== make[2]: *** [sys-depends] Error 2 ===> Logging bulk summary for orocos-yarp_transport-20150316~doc => Checking leftover files => Creating bulk log files => Logging bulk metadata ===> Cleaning temporary files for orocos-yarp_transport-20150316~doc ===> Done bulk for orocos-yarp_transport-20150316~doc [34%] Processing wip/tsid:tsid-1.0.0 ===> Cleaning temporary files for tsid-1.0.0 ===> Bulk building for tsid-1.0.0 => Checking for clear installation => Installing digest-20080510.tgz => Installing tnftp-20130505~ssl.tgz => Required robotpkg package digest>=20080510: digest-20080510 found => Required robotpkg package tnftp>=20091122: tnftp-20130505~ssl found => Required system package gzip: gzip-1.6 found => Required system package pax and tar archivers: pax found => Required system package pkg_install>=20110805.7: pkg_install-20110805.7 found => Dependency digest-20080510 already installed ERROR: Required robotpkg package pinocchio>=1.2.4: BROKEN => Dependency tnftp-20130505~ssl already installed ===> Logging bulk summary for tsid-1.0.0 => Checking leftover files => Creating bulk log files => Logging bulk metadata ===> Cleaning temporary files for tsid-1.0.0 ===> Done bulk for tsid-1.0.0 [35%] Processing wip/libhatp:libhatp-1.3.0 ===> Bulk building for libhatp-1.3.0 Binary package for libhatp-1.3.0 is up-to-date. [35%] Processing wip/metapod:metapod-1.0.10 ===> Cleaning temporary files for metapod-1.0.10 ===> Bulk building for metapod-1.0.10 => Checking for clear installation Warning: DOXYGEN_PLIST_DIR in wip/metapod is deprecated. Warning: use DYNAMIC_PLIST_DIRS instead. => Installing digest-20080510.tgz => Installing tnftp-20130505~ssl.tgz Warning: DOXYGEN_PLIST_DIR in wip/metapod is deprecated. Warning: use DYNAMIC_PLIST_DIRS instead. => Required robotpkg package digest>=20080510: digest-20080510 found => Required robotpkg package tnftp>=20091122: tnftp-20130505~ssl found => Required system package gzip: gzip-1.6 found => Required system package pax and tar archivers: pax found => Required system package pkg_install>=20110805.7: pkg_install-20110805.7 found Warning: DOXYGEN_PLIST_DIR in wip/metapod is deprecated. Warning: use DYNAMIC_PLIST_DIRS instead. Warning: DOXYGEN_PLIST_DIR in wip/metapod is deprecated. Warning: use DYNAMIC_PLIST_DIRS instead. => Dependency digest-20080510 already installed => Dependency tnftp-20130505~ssl already installed Warning: DOXYGEN_PLIST_DIR in wip/metapod is deprecated. Warning: use DYNAMIC_PLIST_DIRS instead. => Building with no option. => Use the GNU C++ compiler: c++-compiler provided by g++>=3 => Use the GNU C compiler: c-compiler provided by gcc>=3 => Required system package boost-headers>=1.34.1: boost-headers-1.60 found => Required system package boostlib-filesystem>=1.34.1: boost-libs-1.60.0 found => Required system package boostlib-iostreams>=1.34.1: boost-libs-1.60.0 found => Required system package boostlib-math>=1.34.1: boost-libs-1.60.0 found => Required system package boostlib-thread>=1.34.1: boost-libs-1.60.0 found => Required system package cmake>=2.6: cmake-3.9.0 found => Required system package doxygen>=1.5: doxygen-1.8.11 found => Required system package eigen3>=3.0.0: eigen3-3.2.10 found => Required system package g++>=3: g++-6.3.1 found => Required system package gcc>=3: gcc-6.3.1 found => Required system package graphviz>=2: graphviz-2.38.0 found => Required system package libstdc++: libstdc++ found => Required system package pdflatex: pdflatex found => Required system package pkg-config>=0.22: pkg-config-0.29 found Warning: DOXYGEN_PLIST_DIR in wip/metapod is deprecated. Warning: use DYNAMIC_PLIST_DIRS instead. Warning: DOXYGEN_PLIST_DIR in wip/metapod is deprecated. Warning: use DYNAMIC_PLIST_DIRS instead. Warning: DOXYGEN_PLIST_DIR in wip/metapod is deprecated. Warning: use DYNAMIC_PLIST_DIRS instead. => SHA1 checksums OK => RMD160 checksums OK An unexpected error occured. The last 10 log lines are shown below. | -- PKG_CONFIG_STRING: eigen3 >= 3.0.0 | -- Pkg-config module eigen3 v3.2.10 has been detected with success. | CMake Error at /usr/share/urdfdom/cmake/urdfdom-config.cmake:15 (message): | Library 'urdfdom_sensor' in package urdfdom is not installed properly | Call Stack (most recent call first): | CMakeLists.txt:175 (FIND_PACKAGE) | | | -- Configuring incomplete, errors occurred! | See also "/local/robotpkg/var/tmp/robotpkg/wip/metapod/work/metapod-1.0.10/CMakeFiles/CMakeOutput.log". For details or bug reports, check the complete log file in: /local/robotpkg/var/tmp/robotpkg/wip/metapod/work/configure.log make[3]: *** [do-configure-cmake] Error 1 make[2]: *** [pkg-check-installed] Error 2 => Marking metapod-1.0.10 as broken ERROR: make: *** [package] Error 2 Warning: DOXYGEN_PLIST_DIR in wip/metapod is deprecated. Warning: use DYNAMIC_PLIST_DIRS instead. ===> Logging bulk summary for metapod-1.0.10 => Checking leftover files => Creating bulk log files => Logging bulk metadata ===> Cleaning temporary files for metapod-1.0.10 ===> Done bulk for metapod-1.0.10 [36%] Processing wip/roralink:roralink-0.1 ===> Bulk building for roralink-0.1 Binary package for roralink-0.1 is up-to-date. [36%] Processing wip/simple-humanoid-description:simple-humanoid-description-1.0.1 ===> Bulk building for simple-humanoid-description-1.0.1 Binary package for simple-humanoid-description-1.0.1 is up-to-date. [37%] Processing wip/hyper-genom-plugin:hyper-genom-plugin-0.12 ===> Cleaning temporary files for hyper-genom-plugin-0.12 ===> Bulk building for hyper-genom-plugin-0.12 => Checking for clear installation => Installing digest-20080510.tgz => Installing tnftp-20130505~ssl.tgz => Required robotpkg package digest>=20080510: digest-20080510 found => Required robotpkg package tnftp>=20091122: tnftp-20130505~ssl found => Required system package gzip: gzip-1.6 found => Required system package pax and tar archivers: pax found => Required system package pkg_install>=20110805.7: pkg_install-20110805.7 found => Dependency digest-20080510 already installed ERROR: Required robotpkg package hyper>=0.12: BROKEN => Dependency tnftp-20130505~ssl already installed ===> Logging bulk summary for hyper-genom-plugin-0.12 => Checking leftover files => Creating bulk log files => Logging bulk metadata ===> Cleaning temporary files for hyper-genom-plugin-0.12 ===> Done bulk for hyper-genom-plugin-0.12 [37%] Processing wip/orocos-dot_service:orocos-dot_service-20120308 ===> Cleaning temporary files for orocos-dot_service-20120308 ===> Bulk building for orocos-dot_service-20120308 => Checking for clear installation => Installing digest-20080510.tgz => Installing tnftp-20130505~ssl.tgz => Required robotpkg package digest>=20080510: digest-20080510 found => Required robotpkg package tnftp>=20130505~ssl: tnftp-20130505~ssl found => Required system package gzip: gzip-1.6 found => Required system package pax and tar archivers: pax found => Required system package pkg_install>=20110805.7: pkg_install-20110805.7 found => Dependency digest-20080510 already installed => Required robotpkg package orocos-rtt>=2: NOT found ERROR: Required robotpkg package orocos-rtt>=2: NOT found => Dependency tnftp-20130505~ssl already installed ===> Logging bulk summary for orocos-dot_service-20120308 => Checking leftover files => Creating bulk log files => Logging bulk metadata ===> Cleaning temporary files for orocos-dot_service-20120308 ===> Done bulk for orocos-dot_service-20120308 [38%] Processing wip/py-sot-tools-v3:py27-sot-tools-v3-2.0.2 ===> Bulk building for py27-sot-tools-v3-2.0.2 Binary package for py27-sot-tools-v3-2.0.2 is up-to-date. [38%] Processing wip/hyper-viewer:hyper-viewer-0.1r1 ===> Cleaning temporary files for hyper-viewer-0.1r1 ===> Bulk building for hyper-viewer-0.1r1 => Checking for clear installation => Installing digest-20080510.tgz => Installing tnftp-20130505~ssl.tgz => Required robotpkg package digest>=20080510: digest-20080510 found => Required robotpkg package tnftp>=20091122: tnftp-20130505~ssl found => Required system package gzip: gzip-1.6 found => Required system package patch>=2.0: patch-2.7.5 found => Required system package pax and tar archivers: pax found => Required system package pkg_install>=20110805.7: pkg_install-20110805.7 found => Dependency digest-20080510 already installed ERROR: Required robotpkg package hyper>=0.12: BROKEN => Dependency tnftp-20130505~ssl already installed ===> Logging bulk summary for hyper-viewer-0.1r1 => Checking leftover files => Creating bulk log files => Logging bulk metadata ===> Cleaning temporary files for hyper-viewer-0.1r1 ===> Done bulk for hyper-viewer-0.1r1 [38%] Processing wip/laaswm-gui:laaswm-gui-1.4 ===> Bulk building for laaswm-gui-1.4 Binary package for laaswm-gui-1.4 is up-to-date. [39%] Processing wip/libmove3d-hri:libmove3d-hri-2.24 ===> Cleaning temporary files for libmove3d-hri-2.24 ===> Bulk building for libmove3d-hri-2.24 => Checking for clear installation => Installing digest-20080510.tgz => Installing tnftp-20130505~ssl.tgz => Required robotpkg package digest>=20080510: digest-20080510 found => Required robotpkg package tnftp>=20091122: tnftp-20130505~ssl found => Required system package gzip: gzip-1.6 found => Required system package pax and tar archivers: pax found => Required system package pkg_install>=20110805.7: pkg_install-20110805.7 found => Dependency digest-20080510 already installed ERROR: Required robotpkg package libmove3d>=3.22.0: BROKEN => Dependency tnftp-20130505~ssl already installed ===> Logging bulk summary for libmove3d-hri-2.24 => Checking leftover files => Creating bulk log files => Logging bulk metadata ===> Cleaning temporary files for libmove3d-hri-2.24 ===> Done bulk for libmove3d-hri-2.24 [39%] Processing wip/msgconnector:msgconnector-2.13.0 ===> Bulk building for msgconnector-2.13.0~bridge-print+liboro+openprs+yarp Binary package for msgconnector-2.13.0~bridge-print+liboro+openprs+yarp is up-to-date. [40%] Processing wip/libpointmatcher:libpointmatcher-1.1.0 ===> Cleaning temporary files for libpointmatcher-1.1.0 ===> Bulk building for libpointmatcher-1.1.0 => Checking for clear installation => Installing digest-20080510.tgz => Installing tnftp-20130505~ssl.tgz => Required robotpkg package digest>=20080510: digest-20080510 found => Required robotpkg package tnftp>=20130505~ssl: tnftp-20130505~ssl found => Required system package gzip: gzip-1.6 found => Required system package patch>=2.0: patch-2.7.5 found => Required system package pax and tar archivers: pax found => Required system package pkg_install>=20110805.7: pkg_install-20110805.7 found => Dependency digest-20080510 already installed => Installing libnabo-1.0.4.tgz => Dependency tnftp-20130505~ssl already installed => Building with no option. => Use the GNU C++ compiler: c++-compiler provided by g++>=3 => Use the GNU C compiler: c-compiler provided by gcc>=3 => Required system package boost-headers>=1.34.1: boost-headers-1.60 found => Required system package boostlib-filesystem>=1.34.1: boost-libs-1.60.0 found => Required system package boostlib-iostreams>=1.34.1: boost-libs-1.60.0 found => Required system package boostlib-math>=1.34.1: boost-libs-1.60.0 found => Required system package boostlib-thread>=1.34.1: boost-libs-1.60.0 found => Required system package cmake>=2.6: cmake-3.9.0 found => Required system package doxygen>=1.5: doxygen-1.8.11 found => Required system package eigen3>=3.0.0: eigen3-3.2.10 found => Required system package g++>=3: g++-6.3.1 found => Required system package gcc>=3: gcc-6.3.1 found => Required system package googletest: googletest found => Required system package latex>=3.14: latex-3.14159265 found => Required system package libstdc++: libstdc++ found => Required system package ncurses>=5: ncurses-6.0 found => Required system package pkg-config>=0.22: pkg-config-0.29 found => Required system package yaml-cpp>=0.2: yaml-cpp-0.5.1 found => Required robotpkg package libnabo>=1.0.4: libnabo-1.0.4 found => SHA1 checksums OK => RMD160 checksums OK => Applying robotpkg patches for libpointmatcher-1.1.0 An unexpected error occured. The last 10 log lines are shown below. | CMakeFiles/pointmatcher.dir/build.make:137: recipe for target 'CMakeFiles/pointmatcher.dir/pointmatcher/Matches.cpp.o' failed | make[2]: *** [CMakeFiles/pointmatcher.dir/pointmatcher/Matches.cpp.o] Error 1 | CMakeFiles/pointmatcher.dir/build.make:113: recipe for target 'CMakeFiles/pointmatcher.dir/pointmatcher/DataPoints.cpp.o' failed | make[2]: *** [CMakeFiles/pointmatcher.dir/pointmatcher/DataPoints.cpp.o] Error 1 | make[2]: Leaving directory '/local/robotpkg/var/tmp/robotpkg/wip/libpointmatcher/work/libpointmatcher-1.1.0' | make[1]: *** [CMakeFiles/pointmatcher.dir/all] Error 2 | make: *** [all] Error 2 | CMakeFiles/Makefile2:134: recipe for target 'CMakeFiles/pointmatcher.dir/all' failed | make[1]: Leaving directory '/local/robotpkg/var/tmp/robotpkg/wip/libpointmatcher/work/libpointmatcher-1.1.0' | Makefile:143: recipe for target 'all' failed For details or bug reports, check the complete log file in: /local/robotpkg/var/tmp/robotpkg/wip/libpointmatcher/work/build.log make[3]: *** [do-build] Error 1 make[2]: *** [pkg-check-installed] Error 2 => Marking libpointmatcher-1.1.0 as broken ERROR: make: *** [package] Error 2 ===> Logging bulk summary for libpointmatcher-1.1.0 => Checking leftover files => Creating bulk log files => Logging bulk metadata ===> Cleaning temporary files for libpointmatcher-1.1.0 ===> Done bulk for libpointmatcher-1.1.0 [40%] Processing wip/MPC_avoidObs-genom:MPC_avoidObs-genom-0.2r1 ===> Cleaning temporary files for MPC_avoidObs-genom-0.2r1~openprs+tcl+tclserv_client ===> Bulk building for MPC_avoidObs-genom-0.2r1~openprs+tcl+tclserv_client => Checking for clear installation Warning: the LICENSE of wip/MPC_avoidObs-genom is undefined. => Installing digest-20080510.tgz => Installing tnftp-20130505~ssl.tgz Warning: the LICENSE of wip/MPC_avoidObs-genom is undefined. => Required robotpkg package digest>=20080510: digest-20080510 found => Required robotpkg package tnftp>=20091122: tnftp-20130505~ssl found => Required system package gzip: gzip-1.6 found => Required system package patch>=2.0: patch-2.7.5 found => Required system package pax and tar archivers: pax found => Required system package pkg_install>=20110805.7: pkg_install-20110805.7 found Warning: the LICENSE of wip/MPC_avoidObs-genom is undefined. Warning: the LICENSE of wip/MPC_avoidObs-genom is undefined. => Installing GPS-genom-1.7~openprs+tcl+tclserv_client.tgz ERROR: Required robotpkg package MPC>=1.0: BROKEN ERROR: Required robotpkg package MPC_DEMTreatment-genom>=0.2: BROKEN ERROR: Required robotpkg package MPC_planner-genom>=0.2: BROKEN => Dependency digest-20080510 already installed => Installing dtm-genom-1.5~openprs+tcl+tclserv_client.tgz => Dependency genBasic-genom-0.4r1~openprs+tcl+tclserv_client already installed => Dependency genPos-genom-0.3r1~openprs+tcl+tclserv_client already installed => Dependency genom-2.12~doc already installed => Dependency libt3d-2.6~doc already installed => Dependency libtclserv_client-0.5r1 already installed => Installing mkdep-2.7r1.tgz => Dependency pocolibs-2.16 already installed => Dependency pom-genom-0.7~openprs+tcl+tclserv_client already installed => Dependency stereopixel-genom-1.3~openprs+tcl+tclserv_client already installed => Dependency tclserv-2.8.1 already installed => Dependency tnftp-20130505~ssl already installed => Dependency transgen-1.1b1 already installed => Dependency velodyne-genom-1.6~openprs+tcl+tclserv_client already installed Warning: the LICENSE of wip/MPC_avoidObs-genom is undefined. Warning: the LICENSE of wip/MPC_avoidObs-genom is undefined. ===> Logging bulk summary for MPC_avoidObs-genom-0.2r1~openprs+tcl+tclserv_client => Checking leftover files => Creating bulk log files => Logging bulk metadata ===> Cleaning temporary files for MPC_avoidObs-genom-0.2r1~openprs+tcl+tclserv_client ===> Done bulk for MPC_avoidObs-genom-0.2r1~openprs+tcl+tclserv_client [41%] Processing wip/talos-pal-transmissions:talos-pal-transmissions-0.2.3 Display something for talos-ros-controllers /local/robotpkg Display something for talos-ros-controllers /local/robotpkg ===> Cleaning temporary files for talos-pal-transmissions-0.2.3 ===> Bulk building for talos-pal-transmissions-0.2.3 => Checking for clear installation => Installing digest-20080510.tgz => Installing tnftp-20130505~ssl.tgz => Required robotpkg package digest>=20080510: digest-20080510 found => Required robotpkg package tnftp>=20091122: tnftp-20130505~ssl found => Required system package gzip: gzip-1.6 found => Required system package pax and tar archivers: pax found => Required system package pkg_install>=20110805.7: pkg_install-20110805.7 found => Dependency digest-20080510 already installed => Installing ros-catkin-0.6.9r2.tgz => Installing ros-comm-1.11.20.tgz => Installing ros-common-msgs-1.11.4.tgz => Dependency ros-genmsg-0.5.3 already installed => Dependency ros-message-generation-0.2.10 already installed => Dependency ros-message-runtime-0.4.12 already installed => Dependency ros-std-msgs-0.5.9 already installed => Installing talos-ros-control-0.2.10.tgz => Dependency tnftp-20130505~ssl already installed => Building with no option. => Use the GNU C++ compiler: c++-compiler provided by g++>=3 => Use the GNU C compiler: c-compiler provided by gcc>=3 => Use python-2.7: python>=2.5<3.7 provided by python27>=2.7<2.8 => Use ros indigo: ros>=groovy provided by ros-indigo => Required system package boost-headers>=1.34.1: boost-headers-1.60 found => Required system package boostlib-thread>=1.34.1: boost-libs-1.60.0 found => Required system package cmake>=2.8.3: cmake-3.9.0 found => Required system package g++>=3: g++-6.3.1 found => Required system package gcc>=3: gcc-6.3.1 found => Required system package googletest: googletest found => Required system package libstdc++: libstdc++ found => Required system package pkg-config>=0.22: pkg-config-0.29 found => Required system package py27-nose>=0.10: py27-nose-1.3.7 found => Required system package python27>=2.7<2.8: python27-2.7.13 found => Required robotpkg package ros-catkin>=0.6<0.7: ros-catkin-0.6.9r2 found => Required robotpkg package ros-comm>=1.11<1.12: ros-comm-1.11.20 found => Required robotpkg package ros-common-msgs>=1.11<1.12: ros-common-msgs-1.11.4 found => Required robotpkg package ros-genmsg>=0.5<0.6: ros-genmsg-0.5.3 found => Required robotpkg package ros-message-generation>=0.2<0.3: ros-message-generation-0.2.10 found => Required robotpkg package ros-message-runtime>=0.4<0.5: ros-message-runtime-0.4.12 found => Required robotpkg package ros-std-msgs>=0.5: ros-std-msgs-0.5.9 found => Required robotpkg package talos-ros-control>=0.2: talos-ros-control-0.2.10 found => SHA1 checksums OK => RMD160 checksums OK An unexpected error occured. The last 10 log lines are shown below. => Marking talos-pal-transmissions-0.2.3 as broken | "cmake_modules_DIR" to a directory containing one of the above files. If | "cmake_modules" provides a separate development package or SDK, be sure it | has been installed. | Call Stack (most recent call first): | CMakeLists.txt:5 (find_package) | | | -- Configuring incomplete, errors occurred! | See also "/local/robotpkg/var/tmp/robotpkg/wip/talos-pal-transmissions/work/talos_pal_transmissions-0.2.3/CMakeFiles/CMakeOutput.log". | See also "/local/robotpkg/var/tmp/robotpkg/wip/talos-pal-transmissions/work/talos_pal_transmissions-0.2.3/CMakeFiles/CMakeError.log". For details or bug reports, check the complete log file in: /local/robotpkg/var/tmp/robotpkg/wip/talos-pal-transmissions/work/configure.log make[3]: *** [do-configure-cmake] Error 1 make[2]: *** [pkg-check-installed] Error 2 ERROR: make: *** [package] Error 2 ===> Logging bulk summary for talos-pal-transmissions-0.2.3 => Checking leftover files => Creating bulk log files => Logging bulk metadata Display something for talos-ros-controllers /local/robotpkg ===> Cleaning temporary files for talos-pal-transmissions-0.2.3 ===> Done bulk for talos-pal-transmissions-0.2.3 [41%] Processing wip/py-jsbsim:py27-jsbsim-20150424r1 ===> Cleaning temporary files for py27-jsbsim-20150424r1 ===> Bulk building for py27-jsbsim-20150424r1 => Checking for clear installation => Installing digest-20080510.tgz => Installing tnftp-20130505~ssl.tgz => Required robotpkg package digest>=20080510: digest-20080510 found => Required robotpkg package tnftp>=20091122: tnftp-20130505~ssl found => Required system package cvs>=1: cvs-1.11.23 found => Required system package gzip: gzip-1.6 found => Required system package pax and tar archivers: pax found => Required system package pkg_install>=20110805.7: pkg_install-20110805.7 found => Dependency digest-20080510 already installed => Installing jsbsim-20150424.tgz => Dependency tnftp-20130505~ssl already installed => Building with no option. => Use the GNU C++ compiler: c++-compiler provided by g++>=3 => Use the GNU C compiler: c-compiler provided by gcc>=3 => Use python-2.7: python>=2.5<3.7 provided by python27>=2.7<2.8 => Required system package cmake>=2.6: cmake-3.9.0 found => Required system package g++>=3: g++-6.3.1 found => Required system package gcc>=3: gcc-6.3.1 found => Required system package libstdc++: libstdc++ found => Required system package python27>=2.7<2.8: python27-2.7.13 found => Required robotpkg package jsbsim>=1.0: jsbsim-20150424 found => SHA1 checksums OK => RMD160 checksums OK An unexpected error occured. The last 10 log lines are shown below. | -- Configuring incomplete, errors occurred! | See also "/local/robotpkg/var/tmp/robotpkg/wip/py-jsbsim/work/jsbsim-20150424/tests/CMakeFiles/CMakeOutput.log". | Could NOT find Cython (missing: CYTHON_EXECUTABLE) | Call Stack (most recent call first): | /usr/share/cmake/Modules/FindPackageHandleStandardArgs.cmake:377 (_FPHSA_FAILURE_MESSAGE) | CMakeModules/FindCython.cmake:42 (FIND_PACKAGE_HANDLE_STANDARD_ARGS) | CMakeModules/UseCython.cmake:74 (find_package) | CMakeLists.txt:6 (include) | | For details or bug reports, check the complete log file in: /local/robotpkg/var/tmp/robotpkg/wip/py-jsbsim/work/configure.log make[3]: *** [do-configure-cmake] Error 1 => Marking py27-jsbsim-20150424r1 as broken make[2]: *** [pkg-check-installed] Error 2 ERROR: make: *** [package] Error 2 ===> Logging bulk summary for py27-jsbsim-20150424r1 => Checking leftover files => Creating bulk log files => Logging bulk metadata ===> Cleaning temporary files for py27-jsbsim-20150424r1 ===> Done bulk for py27-jsbsim-20150424r1 [42%] Processing wip/py-jsbsim:py35-jsbsim-20150424r1 ===> Cleaning temporary files for py35-jsbsim-20150424r1 ===> Bulk building for py35-jsbsim-20150424r1 => Checking for clear installation => Installing digest-20080510.tgz => Installing tnftp-20130505~ssl.tgz => Required robotpkg package digest>=20080510: digest-20080510 found => Required robotpkg package tnftp>=20091122: tnftp-20130505~ssl found => Required system package cvs>=1: cvs-1.11.23 found => Required system package gzip: gzip-1.6 found => Required system package pax and tar archivers: pax found => Required system package pkg_install>=20110805.7: pkg_install-20110805.7 found => Dependency digest-20080510 already installed => Installing jsbsim-20150424.tgz => Dependency tnftp-20130505~ssl already installed => Building with no option. => Use the GNU C++ compiler: c++-compiler provided by g++>=3 => Use the GNU C compiler: c-compiler provided by gcc>=3 => Use python-3.5: python>=2.5<3.7 provided by python35>=3.5<3.6 => Required system package cmake>=2.6: cmake-3.9.0 found => Required system package g++>=3: g++-6.3.1 found => Required system package gcc>=3: gcc-6.3.1 found => Required system package libstdc++: libstdc++ found => Required system package python35>=3.5<3.6: python35-3.5.3 found => Required robotpkg package jsbsim>=1.0: jsbsim-20150424 found => SHA1 checksums OK => RMD160 checksums OK An unexpected error occured. The last 10 log lines are shown below. | Could NOT find Cython (missing: CYTHON_EXECUTABLE) | Call Stack (most recent call first): | /usr/share/cmake/Modules/FindPackageHandleStandardArgs.cmake:377 (_FPHSA_FAILURE_MESSAGE) | CMakeModules/FindCython.cmake:42 (FIND_PACKAGE_HANDLE_STANDARD_ARGS) | CMakeModules/UseCython.cmake:74 (find_package) | CMakeLists.txt:6 (include) | | | -- Configuring incomplete, errors occurred! | See also "/local/robotpkg/var/tmp/robotpkg/wip/py-jsbsim/work/jsbsim-20150424/tests/CMakeFiles/CMakeOutput.log". For details or bug reports, check the complete log file in: /local/robotpkg/var/tmp/robotpkg/wip/py-jsbsim/work/configure.log make[3]: *** [do-configure-cmake] Error 1 => Marking py35-jsbsim-20150424r1 as broken make[2]: *** [pkg-check-installed] Error 2 ERROR: make: *** [package] Error 2 ===> Logging bulk summary for py35-jsbsim-20150424r1 => Checking leftover files => Creating bulk log files => Logging bulk metadata ===> Cleaning temporary files for py35-jsbsim-20150424r1 ===> Done bulk for py35-jsbsim-20150424r1 [42%] Processing wip/morse-mavlink:morse-mavlink-1.4 ===> Cleaning temporary files for morse-mavlink-1.4 ===> Bulk building for morse-mavlink-1.4 => Checking for clear installation => Installing digest-20080510.tgz => Installing tnftp-20130505~ssl.tgz => Required robotpkg package digest>=20080510: digest-20080510 found => Required robotpkg package tnftp>=20091122: tnftp-20130505~ssl found => Required system package gzip: gzip-1.6 found => Required system package patch>=2.0: patch-2.7.5 found => Required system package pax and tar archivers: pax found => Required system package pkg_install>=20110805.7: pkg_install-20110805.7 found => Dependency digest-20080510 already installed => Installing mavlink-20150929.tgz => Installing morse-1.4~doc.tgz ERROR: Required robotpkg package py35-mavlink>=1.1.62: BROKEN => Dependency tnftp-20130505~ssl already installed ===> Logging bulk summary for morse-mavlink-1.4 => Checking leftover files => Creating bulk log files => Logging bulk metadata ===> Cleaning temporary files for morse-mavlink-1.4 ===> Done bulk for morse-mavlink-1.4 [43%] Processing wip/libmove3d-planners:libmove3d-planners-1.4.0 ===> Cleaning temporary files for libmove3d-planners-1.4.0 ===> Bulk building for libmove3d-planners-1.4.0 => Checking for clear installation => Installing digest-20080510.tgz => Installing tnftp-20130505~ssl.tgz => Required robotpkg package digest>=20080510: digest-20080510 found => Required robotpkg package tnftp>=20091122: tnftp-20130505~ssl found => Required system package gzip: gzip-1.6 found => Required system package pax and tar archivers: pax found => Required system package pkg_install>=20110805.7: pkg_install-20110805.7 found WARNING: Cannot check installed version of boost-lib-filesystem WARNING: Cannot check installed version of boost-lib-iostreams WARNING: Cannot check installed version of boost-lib-math WARNING: Cannot check installed version of boost-lib-thread => Dependency digest-20080510 already installed WARNING: Cannot check installed version of libXpm ERROR: Required robotpkg package libmove3d>=3.22.0: BROKEN ERROR: Required robotpkg package libmove3d-hri>=2.24: BROKEN => Dependency tnftp-20130505~ssl already installed WARNING: Cannot check installed version of boost-lib-filesystem WARNING: Cannot check installed version of boost-lib-iostreams WARNING: Cannot check installed version of boost-lib-math WARNING: Cannot check installed version of boost-lib-thread WARNING: Cannot check installed version of libXpm ===> Logging bulk summary for libmove3d-planners-1.4.0 => Checking leftover files => Creating bulk log files => Logging bulk metadata ===> Cleaning temporary files for libmove3d-planners-1.4.0 ===> Done bulk for libmove3d-planners-1.4.0 [43%] Processing wip/atlaas-genom:atlaas-genom-0.1.6 ===> Bulk building for atlaas-genom-0.1.6~openprs+tcl+tclserv_client Binary package for atlaas-genom-0.1.6~openprs+tcl+tclserv_client is up-to-date. [44%] Processing wip/hatpconsole:hatpconsole-2.0.0 ===> Bulk building for hatpconsole-2.0.0 Binary package for hatpconsole-2.0.0 is up-to-date. [44%] Processing wip/hrp2-bringup:hrp2-bringup-1.0.6 ===> Bulk building for hrp2-bringup-1.0.6 Binary package for hrp2-bringup-1.0.6 is up-to-date. [45%] Processing wip/spark-genom:spark-genom-3.9 ===> Cleaning temporary files for spark-genom-3.9~mightability+openprs+tcl+tclserv_client ===> Bulk building for spark-genom-3.9~mightability+openprs+tcl+tclserv_client => Checking for clear installation => Installing digest-20080510.tgz => Installing tnftp-20130505~ssl.tgz => Required robotpkg package digest>=20080510: digest-20080510 found => Required robotpkg package tnftp>=20091122: tnftp-20130505~ssl found => Required system package gzip: gzip-1.6 found => Required system package patch>=2.0: patch-2.7.5 found => Required system package pax and tar archivers: pax found => Required system package pkg_install>=20110805.7: pkg_install-20110805.7 found => Dependency digest-20080510 already installed => Installing genBasic-genom-0.4r1~openprs+tcl+tclserv_client.tgz => Installing genHum-genom-1.1r1~openprs+tcl+tclserv_client.tgz => Installing genManip-genom-0.9~openprs+tcl+tclserv_client.tgz => Dependency genom-2.12~doc already installed ERROR: Required robotpkg package libmove3d>=3.22.0: BROKEN ERROR: Required robotpkg package libmove3d-hri>=2.24: BROKEN => Installing libt3d-2.6~doc.tgz => Dependency libtclserv_client-0.5r1 already installed => Installing mkdep-2.7r1.tgz => Installing mocap-genom-1.3~openprs+tcl+tclserv_client.tgz => Installing niut-genom-0.6~openprs+tcl+tclserv_client.tgz => Dependency pocolibs-2.16 already installed => Installing pom-genom-0.7~openprs+tcl+tclserv_client.tgz => Dependency tclserv-2.8.1 already installed => Dependency tnftp-20130505~ssl already installed => Dependency transgen-1.1b1 already installed => Installing viman-genom-1.6~openprs+tcl+tclserv_client.tgz ===> Logging bulk summary for spark-genom-3.9~mightability+openprs+tcl+tclserv_client => Checking leftover files => Creating bulk log files => Logging bulk metadata ===> Cleaning temporary files for spark-genom-3.9~mightability+openprs+tcl+tclserv_client ===> Done bulk for spark-genom-3.9~mightability+openprs+tcl+tclserv_client [45%] Processing wip/MPC_controller-genom:MPC_controller-genom-0.2 ===> Cleaning temporary files for MPC_controller-genom-0.2~openprs+tcl+tclserv_client ===> Bulk building for MPC_controller-genom-0.2~openprs+tcl+tclserv_client => Checking for clear installation Warning: the LICENSE of wip/MPC_controller-genom is undefined. => Installing digest-20080510.tgz => Installing tnftp-20130505~ssl.tgz Warning: the LICENSE of wip/MPC_controller-genom is undefined. => Required robotpkg package digest>=20080510: digest-20080510 found => Required robotpkg package tnftp>=20091122: tnftp-20130505~ssl found => Required system package gzip: gzip-1.6 found => Required system package pax and tar archivers: pax found => Required system package pkg_install>=20110805.7: pkg_install-20110805.7 found Warning: the LICENSE of wip/MPC_controller-genom is undefined. Warning: the LICENSE of wip/MPC_controller-genom is undefined. ERROR: Required robotpkg package MPC>=1.0: BROKEN ERROR: Required robotpkg package MPC_avoidObs-genom>=0.2: BROKEN ERROR: Required robotpkg package MPC_planner-genom>=0.2: BROKEN => Dependency digest-20080510 already installed => Installing dtm-genom-1.5~openprs+tcl+tclserv_client.tgz => Dependency genBasic-genom-0.4r1~openprs+tcl+tclserv_client already installed => Dependency genPos-genom-0.3r1~openprs+tcl+tclserv_client already installed => Dependency genom-2.12~doc already installed => Dependency libt3d-2.6~doc already installed => Dependency libtclserv_client-0.5r1 already installed => Installing mkdep-2.7r1.tgz => Dependency pocolibs-2.16 already installed => Dependency pom-genom-0.7~openprs+tcl+tclserv_client already installed => Dependency stereopixel-genom-1.3~openprs+tcl+tclserv_client already installed => Dependency tclserv-2.8.1 already installed => Dependency tnftp-20130505~ssl already installed => Dependency transgen-1.1b1 already installed => Dependency velodyne-genom-1.6~openprs+tcl+tclserv_client already installed Warning: the LICENSE of wip/MPC_controller-genom is undefined. Warning: the LICENSE of wip/MPC_controller-genom is undefined. ===> Logging bulk summary for MPC_controller-genom-0.2~openprs+tcl+tclserv_client => Checking leftover files => Creating bulk log files => Logging bulk metadata ===> Cleaning temporary files for MPC_controller-genom-0.2~openprs+tcl+tclserv_client ===> Done bulk for MPC_controller-genom-0.2~openprs+tcl+tclserv_client [46%] Processing wip/sot-dynamic-pinocchio-v3:sot-dynamic-pinocchio-v3-3.1.5r1 ===> Cleaning temporary files for sot-dynamic-pinocchio-v3-3.1.5r1 ===> Bulk building for sot-dynamic-pinocchio-v3-3.1.5r1 => Checking for clear installation => Installing digest-20080510.tgz => Installing tnftp-20130505~ssl.tgz => Required robotpkg package digest>=20080510: digest-20080510 found => Required robotpkg package tnftp>=20091122: tnftp-20130505~ssl found => Required system package gzip: gzip-1.6 found => Required system package pax and tar archivers: pax found => Required system package pkg_install>=20110805.7: pkg_install-20110805.7 found => Dependency digest-20080510 already installed ERROR: Required robotpkg package pinocchio>=1.1.2: BROKEN => Installing py27-sot-tools-v3-2.0.2.tgz => Dependency sot-core-v3-3.1.0 already installed => Dependency tnftp-20130505~ssl already installed ===> Logging bulk summary for sot-dynamic-pinocchio-v3-3.1.5r1 => Checking leftover files => Creating bulk log files => Logging bulk metadata ===> Cleaning temporary files for sot-dynamic-pinocchio-v3-3.1.5r1 ===> Done bulk for sot-dynamic-pinocchio-v3-3.1.5r1 [46%] Processing wip/talos-pal-hardware-gazebo:talos-pal-hardware-gazebo-0.0.9r1 ===> Cleaning temporary files for talos-pal-hardware-gazebo-0.0.9r1 ===> Bulk building for talos-pal-hardware-gazebo-0.0.9r1 => Checking for clear installation => Installing digest-20080510.tgz => Installing tnftp-20130505~ssl.tgz => Required robotpkg package digest>=20080510: digest-20080510 found => Required robotpkg package tnftp>=20091122: tnftp-20130505~ssl found => Required system package gzip: gzip-1.6 found => Required system package patch>=2.0: patch-2.7.5 found => Required system package pax and tar archivers: pax found => Required system package pkg_install>=20110805.7: pkg_install-20110805.7 found => Dependency digest-20080510 already installed => Installing ros-catkin-0.6.9r2.tgz => Installing ros-comm-1.11.20.tgz => Installing ros-common-msgs-1.11.4.tgz => Installing ros-control-toolbox-1.13.2r1.tgz => Dependency ros-genmsg-0.5.3 already installed => Dependency ros-message-generation-0.2.10 already installed => Dependency ros-message-runtime-0.4.12 already installed => Dependency ros-std-msgs-0.5.9 already installed => Installing talos-gazebo-ros-control-2.6.6.tgz => Installing talos-pal-hardware-interfaces-0.0.3.tgz => Dependency talos-ros-control-0.2.10 already installed => Dependency tnftp-20130505~ssl already installed => Building with no option. => Use the GNU C++ compiler: c++-compiler provided by g++>=3 => Use the GNU C compiler: c-compiler provided by gcc>=3 => Use python-2.7: python>=2.5<3.7 provided by python27>=2.7<2.8 => Use ros indigo: ros>=groovy ros>=hydro provided by ros-indigo => Required system package boost-headers>=1.34.1: boost-headers-1.60 found => Required system package boostlib-thread>=1.34.1: boost-libs-1.60.0 found => Required system package cmake>=2.8.3: cmake-3.9.0 found => Required system package g++>=3: g++-6.3.1 found => Required system package gcc>=3: gcc-6.3.1 found => Required system package googletest: googletest found => Required system package libstdc++: libstdc++ found => Required system package pkg-config>=0.22: pkg-config-0.29 found => Required system package py27-nose>=0.10: py27-nose-1.3.7 found => Required system package python27>=2.7<2.8: python27-2.7.13 found => Required robotpkg package ros-catkin>=0.6<0.7: ros-catkin-0.6.9r2 found => Required robotpkg package ros-comm>=1.11<1.12: ros-comm-1.11.20 found => Required robotpkg package ros-common-msgs>=1.11<1.12: ros-common-msgs-1.11.4 found => Required robotpkg package ros-control-toolbox>=1.13<1.15: ros-control-toolbox-1.13.2r1 found => Required robotpkg package ros-genmsg>=0.5<0.6: ros-genmsg-0.5.3 found => Required robotpkg package ros-message-generation>=0.2<0.3: ros-message-generation-0.2.10 found => Required robotpkg package ros-message-runtime>=0.4<0.5: ros-message-runtime-0.4.12 found => Required robotpkg package ros-std-msgs>=0.5: ros-std-msgs-0.5.9 found => Required robotpkg package talos-gazebo-ros-control>=2.6.5: talos-gazebo-ros-control-2.6.6 found => Required robotpkg package talos-pal-hardware-interfaces>=0.0.2: talos-pal-hardware-interfaces-0.0.3 found => Required robotpkg package talos-ros-control>=0.2: talos-ros-control-0.2.10 found => SHA1 checksums OK => RMD160 checksums OK => Applying robotpkg patches for talos-pal-hardware-gazebo-0.0.9r1 An unexpected error occured. The last 10 log lines are shown below. | cmake_modules-config.cmake | | Add the installation prefix of "cmake_modules" to CMAKE_PREFIX_PATH or set | "cmake_modules_DIR" to a directory containing one of the above files. If | "cmake_modules" provides a separate development package or SDK, be sure it | has been installed. | | | -- Configuring incomplete, errors occurred! | See also "/local/robotpkg/var/tmp/robotpkg/wip/talos-pal-hardware-gazebo/work/talos_pal_hardware_gazebo-0.0.9/CMakeFiles/CMakeOutput.log". For details or bug reports, check the complete log file in: /local/robotpkg/var/tmp/robotpkg/wip/talos-pal-hardware-gazebo/work/configure.log make[3]: *** [do-configure-cmake] Error 1 make[2]: *** [pkg-check-installed] Error 2 => Marking talos-pal-hardware-gazebo-0.0.9r1 as broken ERROR: make: *** [package] Error 2 ===> Logging bulk summary for talos-pal-hardware-gazebo-0.0.9r1 => Checking leftover files => Creating bulk log files => Logging bulk metadata ===> Cleaning temporary files for talos-pal-hardware-gazebo-0.0.9r1 ===> Done bulk for talos-pal-hardware-gazebo-0.0.9r1 [46%] Processing wip/hatponboard-lib:hatponboard-lib-3.4.0 ===> Bulk building for hatponboard-lib-3.4.0~enable-goal Binary package for hatponboard-lib-3.4.0~enable-goal is up-to-date. [47%] Processing wip/jrl-walkgen-v3:jrl-walkgen-v3-4.0.1 ===> Cleaning temporary files for jrl-walkgen-v3-4.0.1 ===> Bulk building for jrl-walkgen-v3-4.0.1 => Checking for clear installation => Installing digest-20080510.tgz => Installing tnftp-20130505~ssl.tgz => Required robotpkg package digest>=20080510: digest-20080510 found => Required robotpkg package tnftp>=20091122: tnftp-20130505~ssl found => Required system package gzip: gzip-1.6 found => Required system package patch>=2.0: patch-2.7.5 found => Required system package pax and tar archivers: pax found => Required system package pkg_install>=20110805.7: pkg_install-20110805.7 found => Dependency digest-20080510 already installed => Installing jrl-mal-1.19.6r1~jrl-mathtools.tgz ERROR: Required robotpkg package pinocchio>=1.1.2: BROKEN => Installing qpOASES-3.2.0.tgz => Installing simple-humanoid-description-1.0.1.tgz => Dependency tnftp-20130505~ssl already installed ===> Logging bulk summary for jrl-walkgen-v3-4.0.1 => Checking leftover files => Creating bulk log files => Logging bulk metadata ===> Cleaning temporary files for jrl-walkgen-v3-4.0.1 ===> Done bulk for jrl-walkgen-v3-4.0.1 [47%] Processing wip/sot-hrprtc-hrp2:sot-hrprtc-hrp2-1.2.2 ===> Cleaning temporary files for sot-hrprtc-hrp2-1.2.2 ===> Bulk building for sot-hrprtc-hrp2-1.2.2 => Checking for clear installation => Installing digest-20080510.tgz => Installing tnftp-20130505~ssl.tgz => Required robotpkg package digest>=20080510: digest-20080510 found => Required robotpkg package tnftp>=20091122: tnftp-20130505~ssl found => Required system package gzip: gzip-1.6 found => Required system package pax and tar archivers: pax found => Required system package pkg_install>=20110805.7: pkg_install-20110805.7 found => Dependency digest-20080510 already installed => Installing dynamic-graph-2.5.7.tgz => Installing dynamic-graph-bridge-2.0.9.tgz => Dependency dynamic-graph-bridge-msgs-0.2.0 already installed => Installing hrp2-14-1.9.3.tgz => Installing hrp2-14-description-1.0.4.tgz => Installing hrp2-bringup-1.0.6.tgz => Dependency hrp2-computer-monitor-1.0.2 already installed => Installing hrp2-dynamics-1.5.3.tgz => Dependency hrp2-machine-1.0.2 already installed => Installing openrtm-aist-1.1.1r1.tgz => Dependency py27-dynamic-graph-2.5.6r1 already installed => Dependency py27-sot-tools-1.0.1 already installed => Dependency ros-comm-1.11.20 already installed => Dependency ros-message-runtime-0.4.12 already installed => Dependency ros-std-msgs-0.5.9 already installed => Installing sot-application-1.0.0r1.tgz => Dependency sot-core-2.9.10 already installed => Dependency sot-dynamic-2.9.2 already installed ERROR: Required robotpkg package sot-dyninv>=2.0.0: BROKEN => Installing sot-pattern-generator-2.9.1.tgz => Dependency tnftp-20130505~ssl already installed ===> Logging bulk summary for sot-hrprtc-hrp2-1.2.2 => Checking leftover files => Creating bulk log files => Logging bulk metadata ===> Cleaning temporary files for sot-hrprtc-hrp2-1.2.2 ===> Done bulk for sot-hrprtc-hrp2-1.2.2 [48%] Processing wip/hatptester:hatptester-1.5.3 ===> Bulk building for hatptester-1.5.3 Binary package for hatptester-1.5.3 is up-to-date. [48%] Processing wip/move3d-studio:move3d-studio-1.4r3 ===> Cleaning temporary files for move3d-studio-1.4r3~qtstudio ===> Bulk building for move3d-studio-1.4r3~qtstudio => Checking for clear installation => Installing digest-20080510.tgz => Installing tnftp-20130505~ssl.tgz => Required robotpkg package digest>=20080510: digest-20080510 found => Required robotpkg package tnftp>=20091122: tnftp-20130505~ssl found => Required system package gzip: gzip-1.6 found => Required system package pax and tar archivers: pax found => Required system package pkg_install>=20110805.7: pkg_install-20110805.7 found => Dependency digest-20080510 already installed => Installing gbM-0.11~tcl.tgz WARNING: Cannot check installed version of glpk WARNING: Cannot check installed version of libXpm ERROR: Required robotpkg package libmove3d>=3.22.0: BROKEN ERROR: Required robotpkg package libmove3d-hri>=2.24: BROKEN ERROR: Required robotpkg package libmove3d-planners>=1.4.0: BROKEN => Installing softMotion-libs-3.12~tcl.tgz => Dependency tnftp-20130505~ssl already installed WARNING: Cannot check installed version of glpk WARNING: Cannot check installed version of libXpm ===> Logging bulk summary for move3d-studio-1.4r3~qtstudio => Checking leftover files => Creating bulk log files => Logging bulk metadata ===> Cleaning temporary files for move3d-studio-1.4r3~qtstudio ===> Done bulk for move3d-studio-1.4r3~qtstudio [49%] Processing wip/sot-hrp2:sot-hrp2-1.1.2 ===> Cleaning temporary files for sot-hrp2-1.1.2 ===> Bulk building for sot-hrp2-1.1.2 => Checking for clear installation => Installing digest-20080510.tgz => Installing tnftp-20130505~ssl.tgz => Required robotpkg package digest>=20080510: digest-20080510 found => Required robotpkg package tnftp>=20091122: tnftp-20130505~ssl found => Required system package gzip: gzip-1.6 found => Required system package pax and tar archivers: pax found => Required system package pkg_install>=20110805.7: pkg_install-20110805.7 found => Dependency digest-20080510 already installed => Installing dynamic-graph-2.5.7.tgz => Installing dynamic-graph-bridge-2.0.9.tgz => Dependency dynamic-graph-bridge-msgs-0.2.0 already installed => Installing hrp2-14-1.9.3.tgz => Installing hrp2-14-description-1.0.4.tgz => Installing hrp2-bringup-1.0.6.tgz => Dependency hrp2-computer-monitor-1.0.2 already installed => Installing hrp2-dynamics-1.5.3.tgz => Dependency hrp2-machine-1.0.2 already installed => Dependency py27-dynamic-graph-2.5.6r1 already installed => Dependency py27-sot-tools-1.0.1 already installed => Dependency ros-comm-1.11.20 already installed => Dependency ros-message-runtime-0.4.12 already installed => Dependency ros-std-msgs-0.5.9 already installed => Installing sot-application-1.0.0r1.tgz => Dependency sot-core-2.9.10 already installed => Dependency sot-dynamic-2.9.2 already installed ERROR: Required robotpkg package sot-dyninv>=2.0.0: BROKEN => Installing sot-pattern-generator-2.9.1.tgz => Dependency tnftp-20130505~ssl already installed ===> Logging bulk summary for sot-hrp2-1.1.2 => Checking leftover files => Creating bulk log files => Logging bulk metadata ===> Cleaning temporary files for sot-hrp2-1.1.2 ===> Done bulk for sot-hrp2-1.1.2 [49%] Processing wip/talos-simulation:talos-simulation-0.0.14r2 ===> Cleaning temporary files for talos-simulation-0.0.14r2 ===> Bulk building for talos-simulation-0.0.14r2 => Checking for clear installation => Installing digest-20080510.tgz => Installing tnftp-20130505~ssl.tgz => Required robotpkg package digest>=20080510: digest-20080510 found => Required robotpkg package tnftp>=20091122: tnftp-20130505~ssl found => Required system package gzip: gzip-1.6 found => Required system package patch>=2.0: patch-2.7.5 found => Required system package pax and tar archivers: pax found => Required system package pkg_install>=20110805.7: pkg_install-20110805.7 found => Dependency digest-20080510 already installed => Installing ros-actionlib-1.11.9.tgz => Dependency ros-catkin-0.6.9r2 already installed => Dependency ros-comm-1.11.20 already installed => Dependency ros-common-msgs-1.11.4 already installed => Installing ros-control-toolbox-1.13.2r1.tgz => Dependency ros-genmsg-0.5.3 already installed => Installing ros-geometry-1.11.3r1.tgz => Dependency ros-message-generation-0.2.10 already installed => Dependency ros-message-runtime-0.4.12 already installed => Installing ros-pluginlib-1.10.1.tgz => Installing ros-robot-model-1.11.5.tgz => Dependency ros-ros-1.11.4 already installed => Dependency ros-std-msgs-0.5.9 already installed => Installing talos-moveit-config-0.2.3.tgz ERROR: Required robotpkg package talos-pal-gazebo-plugins>=1.1.5: BROKEN ERROR: Required robotpkg package talos-pal-hardware-gazebo>=0.0.9: BROKEN => Installing talos-robot-0.0.14r1.tgz => Installing talos-roboticsgroup-gazebo-plugins-0.0.3.tgz => Dependency tnftp-20130505~ssl already installed ===> Logging bulk summary for talos-simulation-0.0.14r2 => Checking leftover files => Creating bulk log files => Logging bulk metadata ===> Cleaning temporary files for talos-simulation-0.0.14r2 ===> Done bulk for talos-simulation-0.0.14r2 [50%] Processing wip/sot-application-v3:sot-application-v3-1.1.3 ===> Cleaning temporary files for sot-application-v3-1.1.3 ===> Bulk building for sot-application-v3-1.1.3 => Checking for clear installation => Installing digest-20080510.tgz => Installing tnftp-20130505~ssl.tgz => Required robotpkg package digest>=20080510: digest-20080510 found => Required robotpkg package tnftp>=20091122: tnftp-20130505~ssl found => Required system package gzip: gzip-1.6 found => Required system package pax and tar archivers: pax found => Required system package pkg_install>=20110805.7: pkg_install-20110805.7 found => Dependency digest-20080510 already installed ERROR: Required robotpkg package sot-dynamic-pinocchio-v3>=3.1.1: BROKEN => Dependency tnftp-20130505~ssl already installed ===> Logging bulk summary for sot-application-v3-1.1.3 => Checking leftover files => Creating bulk log files => Logging bulk metadata ===> Cleaning temporary files for sot-application-v3-1.1.3 ===> Done bulk for sot-application-v3-1.1.3 [50%] Processing wip/dynamic-graph-bridge-v3:dynamic-graph-bridge-v3-3.0.7 ===> Cleaning temporary files for dynamic-graph-bridge-v3-3.0.7 ===> Bulk building for dynamic-graph-bridge-v3-3.0.7 => Checking for clear installation => Installing digest-20080510.tgz => Installing tnftp-20130505~ssl.tgz => Required robotpkg package digest>=20080510: digest-20080510 found => Required robotpkg package tnftp>=20091122: tnftp-20130505~ssl found => Required system package gzip: gzip-1.6 found => Required system package pax and tar archivers: pax found => Required system package pkg_install>=20110805.7: pkg_install-20110805.7 found => Dependency digest-20080510 already installed => Installing dynamic-graph-bridge-msgs-0.2.0.tgz => Installing dynamic-graph-v3-3.0.1.tgz => Installing py27-dynamic-graph-v3-3.0.2.tgz => Dependency ros-catkin-0.6.9r2 already installed => Dependency ros-comm-1.11.20 already installed => Installing ros-common-msgs-1.11.4.tgz => Installing ros-geometry-1.11.3r1.tgz => Dependency ros-geometry2-0.5.15 already installed => Dependency ros-message-runtime-0.4.12 already installed => Installing ros-realtime-tools-1.9.2.tgz => Dependency ros-roscpp-core-0.5.4r1 already installed => Dependency ros-rospack-2.2.4 already installed => Dependency ros-std-msgs-0.5.9 already installed => Installing sot-core-v3-3.1.0.tgz ERROR: Required robotpkg package sot-dynamic-pinocchio-v3>=3.1.1: BROKEN => Dependency tnftp-20130505~ssl already installed ===> Logging bulk summary for dynamic-graph-bridge-v3-3.0.7 => Checking leftover files => Creating bulk log files => Logging bulk metadata ===> Cleaning temporary files for dynamic-graph-bridge-v3-3.0.7 ===> Done bulk for dynamic-graph-bridge-v3-3.0.7 [51%] Processing wip/mhp-genom:mhp-genom-3.15 ===> Cleaning temporary files for mhp-genom-3.15~openprs+pr2+spark+tcl+tclserv_client ===> Bulk building for mhp-genom-3.15~openprs+pr2+spark+tcl+tclserv_client => Checking for clear installation => Installing digest-20080510.tgz => Installing tnftp-20130505~ssl.tgz => Required robotpkg package digest>=20080510: digest-20080510 found => Required robotpkg package tnftp>=20091122: tnftp-20130505~ssl found => Required system package gzip: gzip-1.6 found => Required system package pax and tar archivers: pax found => Required system package pkg_install>=20110805.7: pkg_install-20110805.7 found => Dependency digest-20080510 already installed => Installing gbM-0.11~tcl.tgz => Installing genManip-genom-0.9~openprs+tcl+tclserv_client.tgz => Dependency genom-2.12~doc already installed ERROR: Required robotpkg package libmove3d>=3.22.0: BROKEN ERROR: Required robotpkg package libmove3d-hri>=2.24: BROKEN => Installing libt3d-2.6~doc.tgz => Dependency libtclserv_client-0.5r1 already installed => Installing mkdep-2.7r1.tgz => Dependency pocolibs-2.16 already installed => Installing pom-genom-0.7~openprs+tcl+tclserv_client.tgz ERROR: Required robotpkg package spark-genom>=3.9: BROKEN => Dependency tclserv-2.8.1 already installed => Dependency tnftp-20130505~ssl already installed => Dependency transgen-1.1b1 already installed ===> Logging bulk summary for mhp-genom-3.15~openprs+pr2+spark+tcl+tclserv_client => Checking leftover files => Creating bulk log files => Logging bulk metadata ===> Cleaning temporary files for mhp-genom-3.15~openprs+pr2+spark+tcl+tclserv_client ===> Done bulk for mhp-genom-3.15~openprs+pr2+spark+tcl+tclserv_client [51%] Processing wip/sot-romeo-v3:sot-romeo-v3-2.0.1 ===> Cleaning temporary files for sot-romeo-v3-2.0.1 ===> Bulk building for sot-romeo-v3-2.0.1 => Checking for clear installation => Installing digest-20080510.tgz => Installing tnftp-20130505~ssl.tgz => Required robotpkg package digest>=20080510: digest-20080510 found => Required robotpkg package tnftp>=20091122: tnftp-20130505~ssl found => Required system package gzip: gzip-1.6 found => Required system package pax and tar archivers: pax found => Required system package pkg_install>=20110805.7: pkg_install-20110805.7 found => Installing console-bridge-0.2.7.tgz => Dependency digest-20080510 already installed => Installing dynamic-graph-bridge-msgs-0.2.0.tgz ERROR: Required robotpkg package dynamic-graph-bridge-v3>=3.0.0 : BROKEN => Installing dynamic-graph-v3-3.0.1.tgz => Installing py27-dynamic-graph-v3-3.0.2.tgz => Installing py27-sot-tools-v3-2.0.2.tgz => Dependency ros-comm-1.11.20 already installed => Dependency ros-message-runtime-0.4.12 already installed => Dependency ros-rospack-2.2.4 already installed => Dependency ros-std-msgs-0.5.9 already installed => Dependency sot-core-v3-3.1.0 already installed ERROR: Required robotpkg package sot-dynamic-pinocchio-v3>=3.1.1: BROKEN => Dependency tnftp-20130505~ssl already installed ===> Logging bulk summary for sot-romeo-v3-2.0.1 => Checking leftover files => Creating bulk log files => Logging bulk metadata ===> Cleaning temporary files for sot-romeo-v3-2.0.1 ===> Done bulk for sot-romeo-v3-2.0.1 [52%] Processing wip/sot-pattern-generator-v3:sot-pattern-generator-v3-3.0.0 ===> Cleaning temporary files for sot-pattern-generator-v3-3.0.0 ===> Bulk building for sot-pattern-generator-v3-3.0.0 => Checking for clear installation => Installing digest-20080510.tgz => Installing tnftp-20130505~ssl.tgz => Required robotpkg package digest>=20080510: digest-20080510 found => Required robotpkg package tnftp>=20091122: tnftp-20130505~ssl found => Required system package gzip: gzip-1.6 found => Required system package patch>=2.0: patch-2.7.5 found => Required system package pax and tar archivers: pax found => Required system package pkg_install>=20110805.7: pkg_install-20110805.7 found => Dependency digest-20080510 already installed ERROR: Required robotpkg package jrl-walkgen-v3>=4.0.0: BROKEN ERROR: Required robotpkg package pinocchio>=1.1.2: BROKEN ERROR: Required robotpkg package sot-application-v3>=1.1.0: BROKEN => Installing sot-core-v3-3.1.0.tgz => Dependency tnftp-20130505~ssl already installed ===> Logging bulk summary for sot-pattern-generator-v3-3.0.0 => Checking leftover files => Creating bulk log files => Logging bulk metadata ===> Cleaning temporary files for sot-pattern-generator-v3-3.0.0 ===> Done bulk for sot-pattern-generator-v3-3.0.0 [52%] Processing wip/hri-simulation:hri-simulationr1 ===> Cleaning temporary files for hri-simulationr1 ===> Bulk building for hri-simulationr1 => Checking for clear installation => Installing digest-20080510.tgz => Installing tnftp-20130505~ssl.tgz => Required robotpkg package digest>=20080510: digest-20080510 found => Required robotpkg package tnftp>=20091122: tnftp-20130505~ssl found => Required system package gzip: gzip-1.6 found => Required system package pax and tar archivers: pax found => Required system package pkg_install>=20110805.7: pkg_install-20110805.7 found => Installing alog-0.5.tgz => Dependency digest-20080510 already installed => Installing genPos-genom-0.3r1~openprs+tcl+tclserv_client.tgz => Dependency genom-2.12~doc already installed => Installing libt3d-2.6~doc.tgz ERROR: Required robotpkg package mhp-genom>=3.15: BROKEN => Installing morse-pocolibs-1.4.tgz => Installing move3d-assets-20120125.tgz => Installing platine-genom-0.5~openprs+tcl+tclserv_client.tgz => Dependency pom-genom-0.7~openprs+tcl+tclserv_client already installed => Installing py27-poco-1.5.tgz ERROR: Required robotpkg package spark-genom>=3.9: BROKEN => Dependency tnftp-20130505~ssl already installed => Installing viman-genom-1.6~openprs+tcl+tclserv_client.tgz ===> Logging bulk summary for hri-simulationr1 => Checking leftover files => Creating bulk log files => Logging bulk metadata ===> Cleaning temporary files for hri-simulationr1 ===> Done bulk for hri-simulationr1 [53%] Processing wip/sot-hrp2-v3:sot-hrp2-v3-2.1.0 ===> Cleaning temporary files for sot-hrp2-v3-2.1.0 ===> Bulk building for sot-hrp2-v3-2.1.0 => Checking for clear installation => Installing digest-20080510.tgz => Installing tnftp-20130505~ssl.tgz => Required robotpkg package digest>=20080510: digest-20080510 found => Required robotpkg package tnftp>=20091122: tnftp-20130505~ssl found => Required system package gzip: gzip-1.6 found => Required system package pax and tar archivers: pax found => Required system package pkg_install>=20110805.7: pkg_install-20110805.7 found => Dependency digest-20080510 already installed => Installing dynamic-graph-bridge-msgs-0.2.0.tgz ERROR: Required robotpkg package dynamic-graph-bridge-v3>=3.0.0 : BROKEN => Installing dynamic-graph-v3-3.0.1.tgz => Installing py27-dynamic-graph-v3-3.0.2.tgz => Installing py27-sot-tools-v3-2.0.2.tgz => Dependency ros-comm-1.11.20 already installed => Dependency ros-message-runtime-0.4.12 already installed => Dependency ros-std-msgs-0.5.9 already installed => Dependency sot-core-v3-3.1.0 already installed ERROR: Required robotpkg package sot-dynamic-pinocchio-v3>=3.1.1: BROKEN => Dependency tnftp-20130505~ssl already installed ===> Logging bulk summary for sot-hrp2-v3-2.1.0 => Checking leftover files => Creating bulk log files => Logging bulk metadata ===> Cleaning temporary files for sot-hrp2-v3-2.1.0 ===> Done bulk for sot-hrp2-v3-2.1.0 [53%] Processing wip/sot-talos:sot-talos-0.0.2r4 ===> Cleaning temporary files for sot-talos-0.0.2r4 ===> Bulk building for sot-talos-0.0.2r4 => Checking for clear installation => Installing digest-20080510.tgz => Installing tnftp-20130505~ssl.tgz => Required robotpkg package digest>=20080510: digest-20080510 found => Required robotpkg package tnftp>=20091122: tnftp-20130505~ssl found => Required system package gzip: gzip-1.6 found => Required system package patch>=2.0: patch-2.7.5 found => Required system package pax and tar archivers: pax found => Required system package pkg_install>=20110805.7: pkg_install-20110805.7 found => Dependency digest-20080510 already installed => Installing dynamic-graph-bridge-msgs-0.2.0.tgz ERROR: Required robotpkg package dynamic-graph-bridge-v3>=3.0.0 : BROKEN => Installing dynamic-graph-v3-3.0.1.tgz => Installing py27-dynamic-graph-v3-3.0.2.tgz => Installing py27-sot-tools-v3-2.0.2.tgz => Dependency ros-comm-1.11.20 already installed => Dependency ros-message-runtime-0.4.12 already installed => Dependency ros-std-msgs-0.5.9 already installed ERROR: Required robotpkg package sot-application-v3>=1.1.0: BROKEN => Dependency sot-core-v3-3.1.0 already installed ERROR: Required robotpkg package sot-dynamic-pinocchio-v3>=3.1.1: BROKEN ERROR: Required robotpkg package talos-data>=0.0.14: BROKEN ERROR: Required robotpkg package talos-ros-controllers>=0.2.8: BROKEN => Dependency tnftp-20130505~ssl already installed ===> Logging bulk summary for sot-talos-0.0.2r4 => Checking leftover files => Creating bulk log files => Logging bulk metadata ===> Cleaning temporary files for sot-talos-0.0.2r4 ===> Done bulk for sot-talos-0.0.2r4 [53%] Processing wip/pr2-pick-object:laas-pr2-pick-object ===> Bulk building for laas-pr2-pick-object Binary package for laas-pr2-pick-object is up-to-date. [54%] Processing wip/talos-ros-control-sot:metapkg-talos-roscontrol-sot-0.0.2r1 ===> Cleaning temporary files for metapkg-talos-roscontrol-sot-0.0.2r1 ===> Bulk building for metapkg-talos-roscontrol-sot-0.0.2r1 => Checking for clear installation => Installing digest-20080510.tgz => Installing tnftp-20130505~ssl.tgz => Required robotpkg package digest>=20080510: digest-20080510 found => Required robotpkg package tnftp>=20091122: tnftp-20130505~ssl found => Required system package gzip: gzip-1.6 found => Required system package pax and tar archivers: pax found => Required system package pkg_install>=20110805.7: pkg_install-20110805.7 found => Dependency digest-20080510 already installed ERROR: Required robotpkg package dynamic-graph-bridge-v3>=3.0.0 : BROKEN => Installing ros-actionlib-1.11.9.tgz => Dependency ros-catkin-0.6.9r2 already installed => Dependency ros-comm-1.11.20 already installed => Dependency ros-common-msgs-1.11.4 already installed => Installing ros-control-toolbox-1.13.2r1.tgz => Dependency ros-genmsg-0.5.3 already installed => Installing ros-geometry-1.11.3r1.tgz => Dependency ros-message-generation-0.2.10 already installed => Dependency ros-message-runtime-0.4.12 already installed => Installing ros-pluginlib-1.10.1.tgz => Installing ros-robot-model-1.11.5.tgz => Dependency ros-ros-1.11.4 already installed => Dependency ros-std-msgs-0.5.9 already installed ERROR: Required robotpkg package talos-simulation>=0.0.13: BROKEN => Dependency tnftp-20130505~ssl already installed ===> Logging bulk summary for metapkg-talos-roscontrol-sot-0.0.2r1 => Checking leftover files => Creating bulk log files => Logging bulk metadata ===> Cleaning temporary files for metapkg-talos-roscontrol-sot-0.0.2r1 ===> Done bulk for metapkg-talos-roscontrol-sot-0.0.2r1 [54%] Processing wip/openhrp3-hrp2:openhrp3-hrp2-1.1.0r9 ===> Cleaning temporary files for openhrp3-hrp2-1.1.0r9 ===> Bulk building for openhrp3-hrp2-1.1.0r9 => Checking for clear installation => Installing digest-20080510.tgz => Installing tnftp-20130505~ssl.tgz => Required robotpkg package digest>=20080510: digest-20080510 found => Required robotpkg package tnftp>=20091122: tnftp-20130505~ssl found => Required system package gzip: gzip-1.6 found => Required system package patch>=2.0: patch-2.7.5 found => Required system package pax and tar archivers: pax found => Required system package pkg_install>=20110805.7: pkg_install-20110805.7 found => Dependency digest-20080510 already installed ERROR: Required robotpkg package dynamic-graph-bridge-v3>=3.0.0 : BROKEN => Installing hrp2-14-1.9.3.tgz ERROR: Required robotpkg package openhrp3-simulator-wo-rtm>=1.0.0: BROKEN => Installing ros-catkin-0.6.9r2.tgz => Installing ros-comm-1.11.20.tgz => Installing ros-common-msgs-1.11.4.tgz => Dependency ros-std-msgs-0.5.9 already installed => Installing ros-xacro-1.9.2.tgz ERROR: Required robotpkg package sot-hrp2-v3>=2.0.0: BROKEN => Dependency tnftp-20130505~ssl already installed => Installing urdfdom-0.3.0r2.tgz ===> Logging bulk summary for openhrp3-hrp2-1.1.0r9 => Checking leftover files => Creating bulk log files => Logging bulk metadata ===> Cleaning temporary files for openhrp3-hrp2-1.1.0r9 ===> Done bulk for openhrp3-hrp2-1.1.0r9 ===> Done bulk for rbulk wip set --- Bulk started Wed Sep 20 13:51:52 CEST 2017 --- Bulk stopped Wed Sep 20 14:27:28 CEST 2017