robotpkg/wip bulk build results

Log for Debian-8.2-x86_64 (Back)

--- Updating robotpkg ------------------------------------------------ Pulling /local/robotpkg/var/lib/robotpkg/wip Updating d2fd107..ea03c89 Fast-forward talos-ros-controllers/Makefile | 2 +- talos-ros-controllers/PLIST | 1 - talos-ros-controllers/distinfo | 6 +++--- 3 files changed, 4 insertions(+), 5 deletions(-) Updating pkgtools/pkg_install ===> Updating for pkg_install-20110805.7 pkg_install-20110805.7 is already installed and up-to-date. Updating pkgtools/rbulkit ===> Updating for rbulkit-20170123 rbulkit-20170123 is already installed and up-to-date. --- Running build for bulk-rbulk-wip ----------------------------------- ===> Sorting packages for rbulk wip set Scanning wip/libmove3d-hri:* Scanning wip/talos-roboticsgroup-gazebo-plugins:* Scanning wip/orocos-dot_service:* Scanning pkgtools/tnftp:tnftp>=20130505~ssl Scanning wip/certi:* Scanning wip/qpOASES:* Scanning wip/gdalwrap:* Scanning wip/mumps:* Scanning wip/jointStateMapper:* Scanning wip/metapod:* [wip/metapod:*] Warning: DOXYGEN_PLIST_DIR in wip/metapod is deprecated. [wip/metapod:*] Warning: use DYNAMIC_PLIST_DIRS instead. Scanning wip/sot-pattern-generator-v3:* Scanning wip/py-laaswm:* Scanning wip/talos-ros-control:* Scanning wip/jsbsim:* Scanning wip/dptu-genom3:* Scanning wip/can-utils:* Scanning wip/chilitags:* Scanning wip/hrp2-14-description:* Scanning wip/hrp2-computer-monitor:* Scanning wip/FRILibrary:* Scanning wip/py-sot-tools-v3:* Scanning wip/sot-talos:* Scanning wip/sot-dyninv:* Scanning wip/mhp-genom:* Scanning wip/pinocchio:* Scanning wip/libpointmatcher:* Scanning wip/hatpconsole:* Scanning wip/jrl-walkgen-v3:* Scanning wip/py-hla:* Scanning wip/jafar-lgl:* Scanning wip/ompl:* Scanning wip/move3d-studio:* Scanning wip/talos-data:* Scanning wip/sot-hrp2-v3:* Scanning wip/move3d-assets:* Scanning wip/talos-pal-transmissions:* [wip/talos-pal-transmissions:*] Display something for talos-ros-controllers /local/robotpkg Scanning wip/hyper-genom-plugin:* Scanning wip/robot-capsule-urdf:* Scanning wip/morse-hla:* Scanning wip/hyper-viewer:* Scanning wip/track-target-genom:* Scanning wip/hrp2-bringup:* Scanning wip/hyper:* Scanning wip/gerard-bauzil:* Scanning wip/pr2-pick-object:* Scanning wip/urg:* Scanning wip/hatptester:* Scanning wip/jafar-qdisplay:* Scanning wip/dynamic-graph-v3:* Scanning wip/spark-genom:* Scanning wip/histodet:* Scanning wip/talos-pal-hardware-interfaces:* Scanning wip/octovis:* Scanning wip/openhrp3-hrp2:* Scanning wip/sot-application:* Scanning wip/MPC_DEMTreatment-genom:* [wip/MPC_DEMTreatment-genom:*] Warning: the LICENSE of wip/MPC_DEMTreatment-genom is undefined. Scanning wip/mrpt:* Scanning wip/py-eigen:* Scanning wip/vnet-yarp:* Scanning wip/talos-simulation:* Scanning wip/MPC_controller-genom:* [wip/MPC_controller-genom:*] Warning: the LICENSE of wip/MPC_controller-genom is undefined. Scanning wip/py-morse:* Scanning wip/simple-humanoid-description:* Scanning wip/MPC_avoidObs-genom:* [wip/MPC_avoidObs-genom:*] Warning: the LICENSE of wip/MPC_avoidObs-genom is undefined. Scanning wip/MPC_planner-genom:* [wip/MPC_planner-genom:*] Warning: the LICENSE of wip/MPC_planner-genom is undefined. Scanning wip/soth:* Scanning wip/atlaas-genom:* Scanning wip/talos-ros-control-sot:* Scanning wip/libmove3d-planners:* Scanning wip/kukaFri-libs:* Scanning wip/sot-hrprtc-hrp2:* Scanning wip/talos-ros-controllers:* Scanning wip/orocos-bfl:* Scanning wip/sot-dynamic-pinocchio-v3:* Scanning wip/laaswm-gui:* Scanning wip/osg-dae:* Scanning wip/sot-dyninv-v3:* Scanning wip/morse-pocolibs:* Scanning wip/py-jsbsim:* Scanning wip/gladys:* Scanning wip/msgconnector:* Scanning wip/lua-rfsm:* Scanning wip/roralink:* Scanning wip/morse-mavlink:* Scanning wip/sot-application-v3:* Scanning wip/sot-hrp2:* Scanning wip/antlr2:* Scanning wip/libfreenect:* Scanning wip/robotModelParser-libs:* Scanning wip/py-flann:* Scanning wip/sot-romeo-v3:* Scanning wip/atlaas:* Scanning wip/orocos-yarp_transport:* Scanning middleware/orocos-rtt:orocos-rtt>=2.5 Scanning wip/oro-view:* Scanning wip/talos-robot:* Scanning wip/libmove3d:* Scanning wip/mavlink:* Scanning wip/dynamic-graph-bridge-v3:* Scanning wip/morse-ros:* Scanning wip/hrp2-machine:* Scanning wip/MPC:* Scanning wip/gest-genom:* Scanning wip/openhrp3-simulator-wo-rtm:* Scanning wip/sot-core-v3:* Scanning wip/eigen-quadprog:* Scanning wip/py-mavlink:* Scanning wip/libnabo:* Scanning wip/py-dynamic-graph-v3:* Scanning wip/joystick-genom:* Scanning wip/hatponboard-lib:* Scanning wip/jafar-rtslam:* Scanning wip/hri-simulation:* Scanning wip/talos-gazebo-ros-control:* Scanning wip/laas-rackham:* Scanning wip/libhatp:* Scanning wip/jafar-rtslam:~MTI Scanning wip/py-mavlink:py34-mavlink-1.1.62 Scanning wip/py-flann:py34-flann-1.7.1 Scanning wip/py-jsbsim:py34-jsbsim-20150424r1 Scanning wip/py-hla:py34-hla-1.1.1r1 Scanning wip/dptu-genom3:dptu-genom3-0.2~codels+openprs+ros-client-c+ros-client-ros+ros-server+!* Scanning wip/dptu-genom3:dptu-genom3-0.2~pocolibs-client-c+codels+openprs+pocolibs-server+!* Scanned 253 packages (221 unique) [0%] Processing wip/mavlink:mavlink-20150929 ===> Bulk building for mavlink-20150929 Binary package for mavlink-20150929 is up-to-date. [0%] Processing wip/libmove3d:libmove3d-3.22.0r1 ===> Bulk building for libmove3d-3.22.0r1 Binary package for libmove3d-3.22.0r1 is up-to-date. [0%] Processing wip/morse-ros:morse-ros-1.4 ===> Cleaning temporary files for morse-ros-1.4 ===> Bulk building for morse-ros-1.4 => Checking for clear installation => Installing digest-20080510.tgz => Installing tnftp-20130505~ssl.tgz => Required robotpkg package digest>=20080510: digest-20080510 found => Required robotpkg package tnftp>=20091122: tnftp-20130505~ssl found => Required system package gzip: gzip-1.6 found => Required system package patch>=2.0: patch-2.7.5 found => Required system package pax and tar archivers: pax found => Required system package pkg_install>=20110805.7: pkg_install-20110805.7 found => Dependency digest-20080510 already installed => Installing morse-1.4~doc.tgz => Installing py34-catkin-pkg-0.2.4.tgz => Required system package py34-yaml>=3: MISSING => Dependency tnftp-20130505~ssl already installed ERROR: ====================================================================== ERROR: Missing system packages required for morse-ros-1.4: ERROR: ERROR: py34-yaml>=3 ERROR: ERROR: Please use the system package management tool to install these ERROR: dependencies. If a robotpkg version of a dependency is available, ERROR: you can configure robotpkg.conf to use this version instead. ERROR: ERROR: See /local/robotpkg/var/tmp/robotpkg/wip/morse-ros/work/sysdep.log for details. ERROR: ====================================================================== make[2]: *** [sys-depends] Error 2 ===> Logging bulk summary for morse-ros-1.4 => Checking leftover files => Creating bulk log files => Logging bulk metadata ===> Cleaning temporary files for morse-ros-1.4 ===> Done bulk for morse-ros-1.4 [1%] Processing wip/openhrp3-simulator-wo-rtm:openhrp3-simulator-wo-rtm-1.1.1 ===> Bulk building for openhrp3-simulator-wo-rtm-1.1.1 Binary package for openhrp3-simulator-wo-rtm-1.1.1 is up-to-date. [1%] Processing wip/MPC:MPC-1.0r2 ===> Bulk building for MPC-1.0r2 Binary package for MPC-1.0r2 is up-to-date. [2%] Processing wip/hrp2-machine:hrp2-machine-1.0.2 ===> Bulk building for hrp2-machine-1.0.2 Binary package for hrp2-machine-1.0.2 is up-to-date. [2%] Processing wip/eigen-quadprog:eigen-quadprog-1.0.0 ===> Bulk building for eigen-quadprog-1.0.0 Binary package for eigen-quadprog-1.0.0 is up-to-date. [3%] Processing wip/py-mavlink:py34-mavlink-1.1.62 ===> Cleaning temporary files for py34-mavlink-1.1.62 ===> Bulk building for py34-mavlink-1.1.62 => Checking for clear installation => Installing digest-20080510.tgz => Installing tnftp-20130505~ssl.tgz => Required robotpkg package digest>=20080510: digest-20080510 found => Required robotpkg package tnftp>=20091122: tnftp-20130505~ssl found => Required system package git>=1.6: git-2.1.4 found => Required system package gzip: gzip-1.6 found => Required system package pax and tar archivers: pax found => Required system package pkg_install>=20110805.7: pkg_install-20110805.7 found => Dependency digest-20080510 already installed => Dependency tnftp-20130505~ssl already installed => Building with no option. => Use the GNU C compiler: c-compiler provided by gcc>=3 => Use python-3.4: python>=2.5<3.6 provided by python34>=3.4<3.5 => Required system package gcc>=3: gcc-4.9.2 found => Required system package python34>=3.4<3.5: python34-3.4.2 found => SHA1 checksums OK => RMD160 checksums OK => Compiling python files File "/opt/openrobots/lib/python3.4/site-packages/pymavlink/generator/lib/genxmlif/__init__.py", line 81 raise AttributeError, "Unknown XML interface: %s" %(xmlIf) ^ SyntaxError: invalid syntax File "/opt/openrobots/lib/python3.4/site-packages/pymavlink/generator/lib/genxmlif/xmlif4Dom.py", line 58 print "Using 4Dom interface module..." ^ SyntaxError: Missing parentheses in call to 'print' File "/opt/openrobots/lib/python3.4/site-packages/pymavlink/generator/lib/genxmlif/xmlifApi.py", line 370 raise AttributeError, "Attribute %s not found!" %(repr(tupleOrAttrName)) ^ SyntaxError: invalid syntax File "/opt/openrobots/lib/python3.4/site-packages/pymavlink/generator/lib/genxmlif/xmlifDom.py", line 69 print "Xinclude: %s" %href ^ SyntaxError: Missing parentheses in call to 'print' File "/opt/openrobots/lib/python3.4/site-packages/pymavlink/generator/lib/genxmlif/xmlifElementTree.py", line 72 print "Using elementtree interface module..." ^ SyntaxError: Missing parentheses in call to 'print' File "/opt/openrobots/lib/python3.4/site-packages/pymavlink/generator/lib/genxmlif/xmlifMinidom.py", line 63 print "Using minidom interface module..." ^ SyntaxError: Missing parentheses in call to 'print' File "/opt/openrobots/lib/python3.4/site-packages/pymavlink/generator/lib/genxmlif/xmlifUtils.py", line 193 raise LookupError, "Prefix for namespaceURI '%s' not found!" % (ns) ^ SyntaxError: invalid syntax File "/opt/openrobots/lib/python3.4/site-packages/pymavlink/generator/lib/genxmlif/xmliftest.py", line 12 print xmlTree.printTree(prettyPrint=1) ^ SyntaxError: invalid syntax File "/opt/openrobots/lib/python3.4/site-packages/pymavlink/generator/lib/minixsv/minixsvWrapper.py", line 36 print validSyntaxText ^ SyntaxError: Missing parentheses in call to 'print' File "/opt/openrobots/lib/python3.4/site-packages/pymavlink/generator/lib/minixsv/pyxsval.py", line 93 raise KeyError, "xmlIfKey %s already implemented!" %(xmlIfKey) ^ SyntaxError: invalid syntax File "/opt/openrobots/lib/python3.4/site-packages/pymavlink/generator/lib/minixsv/xsvalBase.py", line 135 except TagException, errInst: ^ SyntaxError: invalid syntax File "/opt/openrobots/lib/python3.4/site-packages/pymavlink/generator/lib/minixsv/xsvalErrorHandler.py", line 122 print string.join (self.infoDict.keys(), "n") ^ SyntaxError: invalid syntax File "/opt/openrobots/lib/python3.4/site-packages/pymavlink/generator/lib/minixsv/xsvalSchema.py", line 431 except TagException, errInst: ^ SyntaxError: invalid syntax File "/opt/openrobots/lib/python3.4/site-packages/pymavlink/generator/lib/minixsv/xsvalSimpleTypes.py", line 78 except BaseTypeError, errstr: ^ SyntaxError: invalid syntax File "/opt/openrobots/lib/python3.4/site-packages/pymavlink/generator/lib/minixsv/xsvalUtils.py", line 48 r"Cc" : ur"x00-x1fx7f-x9f", ^ SyntaxError: invalid syntax File "/opt/openrobots/lib/python3.4/site-packages/pymavlink/generator/lib/genxmlif/__init__.py", line 81 raise AttributeError, "Unknown XML interface: %s" %(xmlIf) ^ SyntaxError: invalid syntax File "/opt/openrobots/lib/python3.4/site-packages/pymavlink/generator/lib/genxmlif/xmlif4Dom.py", line 58 print "Using 4Dom interface module..." ^ SyntaxError: Missing parentheses in call to 'print' File "/opt/openrobots/lib/python3.4/site-packages/pymavlink/generator/lib/genxmlif/xmlifApi.py", line 370 raise AttributeError, "Attribute %s not found!" %(repr(tupleOrAttrName)) ^ SyntaxError: invalid syntax File "/opt/openrobots/lib/python3.4/site-packages/pymavlink/generator/lib/genxmlif/xmlifDom.py", line 69 print "Xinclude: %s" %href ^ SyntaxError: Missing parentheses in call to 'print' File "/opt/openrobots/lib/python3.4/site-packages/pymavlink/generator/lib/genxmlif/xmlifElementTree.py", line 72 print "Using elementtree interface module..." ^ SyntaxError: Missing parentheses in call to 'print' File "/opt/openrobots/lib/python3.4/site-packages/pymavlink/generator/lib/genxmlif/xmlifMinidom.py", line 63 print "Using minidom interface module..." ^ SyntaxError: Missing parentheses in call to 'print' File "/opt/openrobots/lib/python3.4/site-packages/pymavlink/generator/lib/genxmlif/xmlifUtils.py", line 193 raise LookupError, "Prefix for namespaceURI '%s' not found!" % (ns) ^ SyntaxError: invalid syntax File "/opt/openrobots/lib/python3.4/site-packages/pymavlink/generator/lib/genxmlif/xmliftest.py", line 12 print xmlTree.printTree(prettyPrint=1) ^ SyntaxError: invalid syntax File "/opt/openrobots/lib/python3.4/site-packages/pymavlink/generator/lib/minixsv/minixsvWrapper.py", line 36 print validSyntaxText ^ SyntaxError: Missing parentheses in call to 'print' File "/opt/openrobots/lib/python3.4/site-packages/pymavlink/generator/lib/minixsv/pyxsval.py", line 93 raise KeyError, "xmlIfKey %s already implemented!" %(xmlIfKey) ^ SyntaxError: invalid syntax File "/opt/openrobots/lib/python3.4/site-packages/pymavlink/generator/lib/minixsv/xsvalBase.py", line 135 except TagException, errInst: ^ SyntaxError: invalid syntax File "/opt/openrobots/lib/python3.4/site-packages/pymavlink/generator/lib/minixsv/xsvalErrorHandler.py", line 122 print string.join (self.infoDict.keys(), "n") ^ SyntaxError: invalid syntax File "/opt/openrobots/lib/python3.4/site-packages/pymavlink/generator/lib/minixsv/xsvalSchema.py", line 431 except TagException, errInst: ^ SyntaxError: invalid syntax File "/opt/openrobots/lib/python3.4/site-packages/pymavlink/generator/lib/minixsv/xsvalSimpleTypes.py", line 78 except BaseTypeError, errstr: ^ SyntaxError: invalid syntax File "/opt/openrobots/lib/python3.4/site-packages/pymavlink/generator/lib/minixsv/xsvalUtils.py", line 48 r"Cc" : ur"x00-x1fx7f-x9f", ^ SyntaxError: invalid syntax robotpkg_create: can't stat `/opt/openrobots/lib/python3.4/site-packages/mavnative.so' robotpkg_create: can't stat `/opt/openrobots/lib/python3.4/site-packages/pymavlink/generator/lib/genxmlif/__pycache__/__init__.cpython-34.pyc' robotpkg_create: can't stat `/opt/openrobots/lib/python3.4/site-packages/pymavlink/generator/lib/genxmlif/__pycache__/__init__.cpython-34.pyo' robotpkg_create: can't stat `/opt/openrobots/lib/python3.4/site-packages/pymavlink/generator/lib/genxmlif/__pycache__/xmlif4Dom.cpython-34.pyc' robotpkg_create: can't stat `/opt/openrobots/lib/python3.4/site-packages/pymavlink/generator/lib/genxmlif/__pycache__/xmlif4Dom.cpython-34.pyo' robotpkg_create: can't stat `/opt/openrobots/lib/python3.4/site-packages/pymavlink/generator/lib/genxmlif/__pycache__/xmlifApi.cpython-34.pyc' robotpkg_create: can't stat `/opt/openrobots/lib/python3.4/site-packages/pymavlink/generator/lib/genxmlif/__pycache__/xmlifApi.cpython-34.pyo' robotpkg_create: can't stat `/opt/openrobots/lib/python3.4/site-packages/pymavlink/generator/lib/genxmlif/__pycache__/xmlifDom.cpython-34.pyc' robotpkg_create: can't stat `/opt/openrobots/lib/python3.4/site-packages/pymavlink/generator/lib/genxmlif/__pycache__/xmlifDom.cpython-34.pyo' robotpkg_create: can't stat `/opt/openrobots/lib/python3.4/site-packages/pymavlink/generator/lib/genxmlif/__pycache__/xmlifElementTree.cpython-34.pyc' robotpkg_create: can't stat `/opt/openrobots/lib/python3.4/site-packages/pymavlink/generator/lib/genxmlif/__pycache__/xmlifElementTree.cpython-34.pyo' robotpkg_create: can't stat `/opt/openrobots/lib/python3.4/site-packages/pymavlink/generator/lib/genxmlif/__pycache__/xmlifMinidom.cpython-34.pyc' robotpkg_create: can't stat `/opt/openrobots/lib/python3.4/site-packages/pymavlink/generator/lib/genxmlif/__pycache__/xmlifMinidom.cpython-34.pyo' robotpkg_create: can't stat `/opt/openrobots/lib/python3.4/site-packages/pymavlink/generator/lib/genxmlif/__pycache__/xmlifUtils.cpython-34.pyc' robotpkg_create: can't stat `/opt/openrobots/lib/python3.4/site-packages/pymavlink/generator/lib/genxmlif/__pycache__/xmlifUtils.cpython-34.pyo' robotpkg_create: can't stat `/opt/openrobots/lib/python3.4/site-packages/pymavlink/generator/lib/genxmlif/__pycache__/xmliftest.cpython-34.pyc' robotpkg_create: can't stat `/opt/openrobots/lib/python3.4/site-packages/pymavlink/generator/lib/genxmlif/__pycache__/xmliftest.cpython-34.pyo' robotpkg_create: can't stat `/opt/openrobots/lib/python3.4/site-packages/pymavlink/generator/lib/minixsv/__pycache__/minixsvWrapper.cpython-34.pyc' robotpkg_create: can't stat `/opt/openrobots/lib/python3.4/site-packages/pymavlink/generator/lib/minixsv/__pycache__/minixsvWrapper.cpython-34.pyo' robotpkg_create: can't stat `/opt/openrobots/lib/python3.4/site-packages/pymavlink/generator/lib/minixsv/__pycache__/pyxsval.cpython-34.pyc' robotpkg_create: can't stat `/opt/openrobots/lib/python3.4/site-packages/pymavlink/generator/lib/minixsv/__pycache__/pyxsval.cpython-34.pyo' robotpkg_create: can't stat `/opt/openrobots/lib/python3.4/site-packages/pymavlink/generator/lib/minixsv/__pycache__/xsvalBase.cpython-34.pyc' robotpkg_create: can't stat `/opt/openrobots/lib/python3.4/site-packages/pymavlink/generator/lib/minixsv/__pycache__/xsvalBase.cpython-34.pyo' robotpkg_create: can't stat `/opt/openrobots/lib/python3.4/site-packages/pymavlink/generator/lib/minixsv/__pycache__/xsvalErrorHandler.cpython-34.pyc' robotpkg_create: can't stat `/opt/openrobots/lib/python3.4/site-packages/pymavlink/generator/lib/minixsv/__pycache__/xsvalErrorHandler.cpython-34.pyo' robotpkg_create: can't stat `/opt/openrobots/lib/python3.4/site-packages/pymavlink/generator/lib/minixsv/__pycache__/xsvalSchema.cpython-34.pyc' robotpkg_create: can't stat `/opt/openrobots/lib/python3.4/site-packages/pymavlink/generator/lib/minixsv/__pycache__/xsvalSchema.cpython-34.pyo' robotpkg_create: can't stat `/opt/openrobots/lib/python3.4/site-packages/pymavlink/generator/lib/minixsv/__pycache__/xsvalSimpleTypes.cpython-34.pyc' robotpkg_create: can't stat `/opt/openrobots/lib/python3.4/site-packages/pymavlink/generator/lib/minixsv/__pycache__/xsvalSimpleTypes.cpython-34.pyo' robotpkg_create: can't stat `/opt/openrobots/lib/python3.4/site-packages/pymavlink/generator/lib/minixsv/__pycache__/xsvalUtils.cpython-34.pyc' robotpkg_create: can't stat `/opt/openrobots/lib/python3.4/site-packages/pymavlink/generator/lib/minixsv/__pycache__/xsvalUtils.cpython-34.pyo' => Registering installation for py34-mavlink-1.1.62 robotpkg_admin: py34-mavlink-1.1.62: File `/opt/openrobots/lib/python3.4/site-packages/mavnative.so' is in +CONTENTS but not on filesystem! robotpkg_admin: py34-mavlink-1.1.62: File `/opt/openrobots/lib/python3.4/site-packages/pymavlink/generator/lib/genxmlif/__pycache__/__init__.cpython-34.pyc' is in +CONTENTS but not on filesystem! robotpkg_admin: py34-mavlink-1.1.62: File `/opt/openrobots/lib/python3.4/site-packages/pymavlink/generator/lib/genxmlif/__pycache__/__init__.cpython-34.pyo' is in +CONTENTS but not on filesystem! robotpkg_admin: py34-mavlink-1.1.62: File `/opt/openrobots/lib/python3.4/site-packages/pymavlink/generator/lib/genxmlif/__pycache__/xmlif4Dom.cpython-34.pyc' is in +CONTENTS but not on filesystem! robotpkg_admin: py34-mavlink-1.1.62: File `/opt/openrobots/lib/python3.4/site-packages/pymavlink/generator/lib/genxmlif/__pycache__/xmlif4Dom.cpython-34.pyo' is in +CONTENTS but not on filesystem! robotpkg_admin: py34-mavlink-1.1.62: File `/opt/openrobots/lib/python3.4/site-packages/pymavlink/generator/lib/genxmlif/__pycache__/xmlifApi.cpython-34.pyc' is in +CONTENTS but not on filesystem! robotpkg_admin: py34-mavlink-1.1.62: File `/opt/openrobots/lib/python3.4/site-packages/pymavlink/generator/lib/genxmlif/__pycache__/xmlifApi.cpython-34.pyo' is in +CONTENTS but not on filesystem! robotpkg_admin: py34-mavlink-1.1.62: File `/opt/openrobots/lib/python3.4/site-packages/pymavlink/generator/lib/genxmlif/__pycache__/xmlifDom.cpython-34.pyc' is in +CONTENTS but not on filesystem! robotpkg_admin: py34-mavlink-1.1.62: File `/opt/openrobots/lib/python3.4/site-packages/pymavlink/generator/lib/genxmlif/__pycache__/xmlifDom.cpython-34.pyo' is in +CONTENTS but not on filesystem! robotpkg_admin: py34-mavlink-1.1.62: File `/opt/openrobots/lib/python3.4/site-packages/pymavlink/generator/lib/genxmlif/__pycache__/xmlifElementTree.cpython-34.pyc' is in +CONTENTS but not on filesystem! robotpkg_admin: py34-mavlink-1.1.62: File `/opt/openrobots/lib/python3.4/site-packages/pymavlink/generator/lib/genxmlif/__pycache__/xmlifElementTree.cpython-34.pyo' is in +CONTENTS but not on filesystem! robotpkg_admin: py34-mavlink-1.1.62: File `/opt/openrobots/lib/python3.4/site-packages/pymavlink/generator/lib/genxmlif/__pycache__/xmlifMinidom.cpython-34.pyc' is in +CONTENTS but not on filesystem! robotpkg_admin: py34-mavlink-1.1.62: File `/opt/openrobots/lib/python3.4/site-packages/pymavlink/generator/lib/genxmlif/__pycache__/xmlifMinidom.cpython-34.pyo' is in +CONTENTS but not on filesystem! robotpkg_admin: py34-mavlink-1.1.62: File `/opt/openrobots/lib/python3.4/site-packages/pymavlink/generator/lib/genxmlif/__pycache__/xmlifUtils.cpython-34.pyc' is in +CONTENTS but not on filesystem! robotpkg_admin: py34-mavlink-1.1.62: File `/opt/openrobots/lib/python3.4/site-packages/pymavlink/generator/lib/genxmlif/__pycache__/xmlifUtils.cpython-34.pyo' is in +CONTENTS but not on filesystem! robotpkg_admin: py34-mavlink-1.1.62: File `/opt/openrobots/lib/python3.4/site-packages/pymavlink/generator/lib/genxmlif/__pycache__/xmliftest.cpython-34.pyc' is in +CONTENTS but not on filesystem! robotpkg_admin: py34-mavlink-1.1.62: File `/opt/openrobots/lib/python3.4/site-packages/pymavlink/generator/lib/genxmlif/__pycache__/xmliftest.cpython-34.pyo' is in +CONTENTS but not on filesystem! robotpkg_admin: py34-mavlink-1.1.62: File `/opt/openrobots/lib/python3.4/site-packages/pymavlink/generator/lib/minixsv/__pycache__/minixsvWrapper.cpython-34.pyc' is in +CONTENTS but not on filesystem! robotpkg_admin: py34-mavlink-1.1.62: File `/opt/openrobots/lib/python3.4/site-packages/pymavlink/generator/lib/minixsv/__pycache__/minixsvWrapper.cpython-34.pyo' is in +CONTENTS but not on filesystem! robotpkg_admin: py34-mavlink-1.1.62: File `/opt/openrobots/lib/python3.4/site-packages/pymavlink/generator/lib/minixsv/__pycache__/pyxsval.cpython-34.pyc' is in +CONTENTS but not on filesystem! robotpkg_admin: py34-mavlink-1.1.62: File `/opt/openrobots/lib/python3.4/site-packages/pymavlink/generator/lib/minixsv/__pycache__/pyxsval.cpython-34.pyo' is in +CONTENTS but not on filesystem! robotpkg_admin: py34-mavlink-1.1.62: File `/opt/openrobots/lib/python3.4/site-packages/pymavlink/generator/lib/minixsv/__pycache__/xsvalBase.cpython-34.pyc' is in +CONTENTS but not on filesystem! robotpkg_admin: py34-mavlink-1.1.62: File `/opt/openrobots/lib/python3.4/site-packages/pymavlink/generator/lib/minixsv/__pycache__/xsvalBase.cpython-34.pyo' is in +CONTENTS but not on filesystem! robotpkg_admin: py34-mavlink-1.1.62: File `/opt/openrobots/lib/python3.4/site-packages/pymavlink/generator/lib/minixsv/__pycache__/xsvalErrorHandler.cpython-34.pyc' is in +CONTENTS but not on filesystem! robotpkg_admin: py34-mavlink-1.1.62: File `/opt/openrobots/lib/python3.4/site-packages/pymavlink/generator/lib/minixsv/__pycache__/xsvalErrorHandler.cpython-34.pyo' is in +CONTENTS but not on filesystem! robotpkg_admin: py34-mavlink-1.1.62: File `/opt/openrobots/lib/python3.4/site-packages/pymavlink/generator/lib/minixsv/__pycache__/xsvalSchema.cpython-34.pyc' is in +CONTENTS but not on filesystem! robotpkg_admin: py34-mavlink-1.1.62: File `/opt/openrobots/lib/python3.4/site-packages/pymavlink/generator/lib/minixsv/__pycache__/xsvalSchema.cpython-34.pyo' is in +CONTENTS but not on filesystem! robotpkg_admin: py34-mavlink-1.1.62: File `/opt/openrobots/lib/python3.4/site-packages/pymavlink/generator/lib/minixsv/__pycache__/xsvalSimpleTypes.cpython-34.pyc' is in +CONTENTS but not on filesystem! robotpkg_admin: py34-mavlink-1.1.62: File `/opt/openrobots/lib/python3.4/site-packages/pymavlink/generator/lib/minixsv/__pycache__/xsvalSimpleTypes.cpython-34.pyo' is in +CONTENTS but not on filesystem! robotpkg_admin: py34-mavlink-1.1.62: File `/opt/openrobots/lib/python3.4/site-packages/pymavlink/generator/lib/minixsv/__pycache__/xsvalUtils.cpython-34.pyc' is in +CONTENTS but not on filesystem! robotpkg_admin: py34-mavlink-1.1.62: File `/opt/openrobots/lib/python3.4/site-packages/pymavlink/generator/lib/minixsv/__pycache__/xsvalUtils.cpython-34.pyo' is in +CONTENTS but not on filesystem! robotpkg_create: can't stat `/opt/openrobots/lib/python3.4/site-packages/mavnative.so' robotpkg_create: can't stat `/opt/openrobots/lib/python3.4/site-packages/pymavlink/generator/lib/genxmlif/__pycache__/__init__.cpython-34.pyc' robotpkg_create: can't stat `/opt/openrobots/lib/python3.4/site-packages/pymavlink/generator/lib/genxmlif/__pycache__/__init__.cpython-34.pyo' robotpkg_create: can't stat `/opt/openrobots/lib/python3.4/site-packages/pymavlink/generator/lib/genxmlif/__pycache__/xmlif4Dom.cpython-34.pyc' robotpkg_create: can't stat `/opt/openrobots/lib/python3.4/site-packages/pymavlink/generator/lib/genxmlif/__pycache__/xmlif4Dom.cpython-34.pyo' robotpkg_create: can't stat `/opt/openrobots/lib/python3.4/site-packages/pymavlink/generator/lib/genxmlif/__pycache__/xmlifApi.cpython-34.pyc' robotpkg_create: can't stat `/opt/openrobots/lib/python3.4/site-packages/pymavlink/generator/lib/genxmlif/__pycache__/xmlifApi.cpython-34.pyo' robotpkg_create: can't stat `/opt/openrobots/lib/python3.4/site-packages/pymavlink/generator/lib/genxmlif/__pycache__/xmlifDom.cpython-34.pyc' robotpkg_create: can't stat `/opt/openrobots/lib/python3.4/site-packages/pymavlink/generator/lib/genxmlif/__pycache__/xmlifDom.cpython-34.pyo' robotpkg_create: can't stat `/opt/openrobots/lib/python3.4/site-packages/pymavlink/generator/lib/genxmlif/__pycache__/xmlifElementTree.cpython-34.pyc' robotpkg_create: can't stat `/opt/openrobots/lib/python3.4/site-packages/pymavlink/generator/lib/genxmlif/__pycache__/xmlifElementTree.cpython-34.pyo' robotpkg_create: can't stat `/opt/openrobots/lib/python3.4/site-packages/pymavlink/generator/lib/genxmlif/__pycache__/xmlifMinidom.cpython-34.pyc' robotpkg_create: can't stat `/opt/openrobots/lib/python3.4/site-packages/pymavlink/generator/lib/genxmlif/__pycache__/xmlifMinidom.cpython-34.pyo' robotpkg_create: can't stat `/opt/openrobots/lib/python3.4/site-packages/pymavlink/generator/lib/genxmlif/__pycache__/xmlifUtils.cpython-34.pyc' robotpkg_create: can't stat `/opt/openrobots/lib/python3.4/site-packages/pymavlink/generator/lib/genxmlif/__pycache__/xmlifUtils.cpython-34.pyo' robotpkg_create: can't stat `/opt/openrobots/lib/python3.4/site-packages/pymavlink/generator/lib/genxmlif/__pycache__/xmliftest.cpython-34.pyc' robotpkg_create: can't stat `/opt/openrobots/lib/python3.4/site-packages/pymavlink/generator/lib/genxmlif/__pycache__/xmliftest.cpython-34.pyo' robotpkg_create: can't stat `/opt/openrobots/lib/python3.4/site-packages/pymavlink/generator/lib/minixsv/__pycache__/minixsvWrapper.cpython-34.pyc' robotpkg_create: can't stat `/opt/openrobots/lib/python3.4/site-packages/pymavlink/generator/lib/minixsv/__pycache__/minixsvWrapper.cpython-34.pyo' robotpkg_create: can't stat `/opt/openrobots/lib/python3.4/site-packages/pymavlink/generator/lib/minixsv/__pycache__/pyxsval.cpython-34.pyc' robotpkg_create: can't stat `/opt/openrobots/lib/python3.4/site-packages/pymavlink/generator/lib/minixsv/__pycache__/pyxsval.cpython-34.pyo' robotpkg_create: can't stat `/opt/openrobots/lib/python3.4/site-packages/pymavlink/generator/lib/minixsv/__pycache__/xsvalBase.cpython-34.pyc' robotpkg_create: can't stat `/opt/openrobots/lib/python3.4/site-packages/pymavlink/generator/lib/minixsv/__pycache__/xsvalBase.cpython-34.pyo' robotpkg_create: can't stat `/opt/openrobots/lib/python3.4/site-packages/pymavlink/generator/lib/minixsv/__pycache__/xsvalErrorHandler.cpython-34.pyc' robotpkg_create: can't stat `/opt/openrobots/lib/python3.4/site-packages/pymavlink/generator/lib/minixsv/__pycache__/xsvalErrorHandler.cpython-34.pyo' robotpkg_create: can't stat `/opt/openrobots/lib/python3.4/site-packages/pymavlink/generator/lib/minixsv/__pycache__/xsvalSchema.cpython-34.pyc' robotpkg_create: can't stat `/opt/openrobots/lib/python3.4/site-packages/pymavlink/generator/lib/minixsv/__pycache__/xsvalSchema.cpython-34.pyo' robotpkg_create: can't stat `/opt/openrobots/lib/python3.4/site-packages/pymavlink/generator/lib/minixsv/__pycache__/xsvalSimpleTypes.cpython-34.pyc' robotpkg_create: can't stat `/opt/openrobots/lib/python3.4/site-packages/pymavlink/generator/lib/minixsv/__pycache__/xsvalSimpleTypes.cpython-34.pyo' robotpkg_create: can't stat `/opt/openrobots/lib/python3.4/site-packages/pymavlink/generator/lib/minixsv/__pycache__/xsvalUtils.cpython-34.pyc' robotpkg_create: can't stat `/opt/openrobots/lib/python3.4/site-packages/pymavlink/generator/lib/minixsv/__pycache__/xsvalUtils.cpython-34.pyo' => Marking py34-mavlink-1.1.62 as broken robotpkg_create: lstat failed for file lib/python3.4/site-packages/mavnative.so: No such file or directory make[2]: *** [pkg-tarup] Error 2 ERROR: make: *** [package] Error 2 robotpkg_delete: Couldn't remove /opt/openrobots/lib/python3.4/site-packages/mavnative.so robotpkg_delete: Couldn't remove /opt/openrobots/lib/python3.4/site-packages/pymavlink/generator/lib/genxmlif/__pycache__/__init__.cpython-34.pyc robotpkg_delete: Couldn't remove /opt/openrobots/lib/python3.4/site-packages/pymavlink/generator/lib/genxmlif/__pycache__/__init__.cpython-34.pyo robotpkg_delete: Couldn't remove /opt/openrobots/lib/python3.4/site-packages/pymavlink/generator/lib/genxmlif/__pycache__/xmlif4Dom.cpython-34.pyc robotpkg_delete: Couldn't remove /opt/openrobots/lib/python3.4/site-packages/pymavlink/generator/lib/genxmlif/__pycache__/xmlif4Dom.cpython-34.pyo robotpkg_delete: Couldn't remove /opt/openrobots/lib/python3.4/site-packages/pymavlink/generator/lib/genxmlif/__pycache__/xmlifApi.cpython-34.pyc robotpkg_delete: Couldn't remove /opt/openrobots/lib/python3.4/site-packages/pymavlink/generator/lib/genxmlif/__pycache__/xmlifApi.cpython-34.pyo robotpkg_delete: Couldn't remove /opt/openrobots/lib/python3.4/site-packages/pymavlink/generator/lib/genxmlif/__pycache__/xmlifDom.cpython-34.pyc robotpkg_delete: Couldn't remove /opt/openrobots/lib/python3.4/site-packages/pymavlink/generator/lib/genxmlif/__pycache__/xmlifDom.cpython-34.pyo robotpkg_delete: Couldn't remove /opt/openrobots/lib/python3.4/site-packages/pymavlink/generator/lib/genxmlif/__pycache__/xmlifElementTree.cpython-34.pyc robotpkg_delete: Couldn't remove /opt/openrobots/lib/python3.4/site-packages/pymavlink/generator/lib/genxmlif/__pycache__/xmlifElementTree.cpython-34.pyo robotpkg_delete: Couldn't remove /opt/openrobots/lib/python3.4/site-packages/pymavlink/generator/lib/genxmlif/__pycache__/xmlifMinidom.cpython-34.pyc robotpkg_delete: Couldn't remove /opt/openrobots/lib/python3.4/site-packages/pymavlink/generator/lib/genxmlif/__pycache__/xmlifMinidom.cpython-34.pyo robotpkg_delete: Couldn't remove /opt/openrobots/lib/python3.4/site-packages/pymavlink/generator/lib/genxmlif/__pycache__/xmlifUtils.cpython-34.pyc robotpkg_delete: Couldn't remove /opt/openrobots/lib/python3.4/site-packages/pymavlink/generator/lib/genxmlif/__pycache__/xmlifUtils.cpython-34.pyo robotpkg_delete: Couldn't remove /opt/openrobots/lib/python3.4/site-packages/pymavlink/generator/lib/genxmlif/__pycache__/xmliftest.cpython-34.pyc robotpkg_delete: Couldn't remove /opt/openrobots/lib/python3.4/site-packages/pymavlink/generator/lib/genxmlif/__pycache__/xmliftest.cpython-34.pyo robotpkg_delete: Couldn't remove /opt/openrobots/lib/python3.4/site-packages/pymavlink/generator/lib/minixsv/__pycache__/minixsvWrapper.cpython-34.pyc robotpkg_delete: Couldn't remove /opt/openrobots/lib/python3.4/site-packages/pymavlink/generator/lib/minixsv/__pycache__/minixsvWrapper.cpython-34.pyo robotpkg_delete: Couldn't remove /opt/openrobots/lib/python3.4/site-packages/pymavlink/generator/lib/minixsv/__pycache__/pyxsval.cpython-34.pyc robotpkg_delete: Couldn't remove /opt/openrobots/lib/python3.4/site-packages/pymavlink/generator/lib/minixsv/__pycache__/pyxsval.cpython-34.pyo robotpkg_delete: Couldn't remove /opt/openrobots/lib/python3.4/site-packages/pymavlink/generator/lib/minixsv/__pycache__/xsvalBase.cpython-34.pyc robotpkg_delete: Couldn't remove /opt/openrobots/lib/python3.4/site-packages/pymavlink/generator/lib/minixsv/__pycache__/xsvalBase.cpython-34.pyo robotpkg_delete: Couldn't remove /opt/openrobots/lib/python3.4/site-packages/pymavlink/generator/lib/minixsv/__pycache__/xsvalErrorHandler.cpython-34.pyc robotpkg_delete: Couldn't remove /opt/openrobots/lib/python3.4/site-packages/pymavlink/generator/lib/minixsv/__pycache__/xsvalErrorHandler.cpython-34.pyo robotpkg_delete: Couldn't remove /opt/openrobots/lib/python3.4/site-packages/pymavlink/generator/lib/minixsv/__pycache__/xsvalSchema.cpython-34.pyc robotpkg_delete: Couldn't remove /opt/openrobots/lib/python3.4/site-packages/pymavlink/generator/lib/minixsv/__pycache__/xsvalSchema.cpython-34.pyo robotpkg_delete: Couldn't remove /opt/openrobots/lib/python3.4/site-packages/pymavlink/generator/lib/minixsv/__pycache__/xsvalSimpleTypes.cpython-34.pyc robotpkg_delete: Couldn't remove /opt/openrobots/lib/python3.4/site-packages/pymavlink/generator/lib/minixsv/__pycache__/xsvalSimpleTypes.cpython-34.pyo robotpkg_delete: Couldn't remove /opt/openrobots/lib/python3.4/site-packages/pymavlink/generator/lib/minixsv/__pycache__/xsvalUtils.cpython-34.pyc robotpkg_delete: Couldn't remove /opt/openrobots/lib/python3.4/site-packages/pymavlink/generator/lib/minixsv/__pycache__/xsvalUtils.cpython-34.pyo robotpkg_delete: Directory `/opt/openrobots/share/mavlink' disappeared, skipping ===> Logging bulk summary for py34-mavlink-1.1.62 => Checking leftover files => Creating bulk log files => Logging bulk metadata ===> Cleaning temporary files for py34-mavlink-1.1.62 ===> Done bulk for py34-mavlink-1.1.62 [3%] Processing wip/py-mavlink:py27-mavlink-1.1.62 ===> Bulk building for py27-mavlink-1.1.62 Binary package for py27-mavlink-1.1.62 is up-to-date. [4%] Processing wip/joystick-genom:joystick-genom-1.0 ===> Cleaning temporary files for joystick-genom-1.0~openprs+tcl+tclserv_client ===> Bulk building for joystick-genom-1.0~openprs+tcl+tclserv_client => Checking for clear installation => Installing digest-20080510.tgz => Installing tnftp-20130505~ssl.tgz => Required robotpkg package digest>=20080510: digest-20080510 found => Required robotpkg package tnftp>=20091122: tnftp-20130505~ssl found => Required system package gzip: gzip-1.6 found => Required system package pax and tar archivers: pax found => Required system package pkg_install>=20110805.7: pkg_install-20110805.7 found => Dependency digest-20080510 already installed => Installing genom-2.12~doc.tgz => Installing libtclserv_client-0.5r1.tgz => Installing mkdep-2.7r1.tgz => Dependency pocolibs-2.15 already installed => Installing tclserv-2.8.1.tgz => Dependency tnftp-20130505~ssl already installed => Installing transgen-1.1b1.tgz => Building with the following options: => Use the GNU C compiler: c-compiler provided by gcc>=3 => Use tcl-8.6: tcl>=8.4 provided by tcl86>=8.6<8.7 => Required system package autoconf>=2.59: autoconf-2.69 found => Required system package gcc>=3: gcc-4.9.2 found => Required system package libtool>=1.5.22: libtool-2.4.2 found => Required system package perl>=5: perl-5 found => Required system package pkg-config>=0.22: pkg-config-0.28 found => Required system package tcl86>=8.6<8.7: tcl86-8.6 found => Required robotpkg package genom>=2.9: genom-2.12~doc found => Required robotpkg package libtclserv_client>=0.3: libtclserv_client-0.5r1 found => Required robotpkg package mkdep>=2.6: mkdep-2.7r1 found => Required robotpkg package pocolibs>=2.11: pocolibs-2.15 found => Required robotpkg package tclserv>=2.7: tclserv-2.8.1 found => Required robotpkg package transgen>=1.1b0: transgen-1.1b1 found => SHA1 checksums OK => RMD160 checksums OK => Generating joystick module => Modifying GNU configure scripts to avoid --recheck => Disabling fatal errors with C++ preprocessor in GNU configure scripts => Adding run-time search paths to pkg-config files => Registering installation for joystick-genom-1.0~openprs+tcl+tclserv_client => Linking package in /opt/robotpkg/var/lib/robotpkg/packages/bsd/Debian-8.2-x86_64/pub ===> Logging bulk summary for joystick-genom-1.0~openprs+tcl+tclserv_client => Checking leftover files => Creating bulk log files => Logging bulk metadata ===> Cleaning temporary files for joystick-genom-1.0~openprs+tcl+tclserv_client ===> Done bulk for joystick-genom-1.0~openprs+tcl+tclserv_client [4%] Processing wip/jafar-rtslam:jafar-rtslam-0.3~!* ===> Bulk building for jafar-rtslam-0.3 Binary package for jafar-rtslam-0.3 is up-to-date. [4%] Processing wip/jafar-rtslam:~MTI ===> Bulk building for jafar-rtslam-0.3~MTI Binary package for jafar-rtslam-0.3~MTI is up-to-date. [5%] Processing wip/libhatp:libhatp-1.3.0 ===> Bulk building for libhatp-1.3.0 Binary package for libhatp-1.3.0 is up-to-date. [5%] Processing wip/libmove3d-hri:libmove3d-hri-2.24 ===> Bulk building for libmove3d-hri-2.24 Binary package for libmove3d-hri-2.24 is up-to-date. [6%] Processing wip/certi:certi-3.5.1 ===> Bulk building for certi-3.5.1 Binary package for certi-3.5.1 is up-to-date. [6%] Processing wip/qpOASES:qpOASES-3.2.0 ===> Bulk building for qpOASES-3.2.0 Binary package for qpOASES-3.2.0 is up-to-date. [7%] Processing wip/gdalwrap:gdalwrap-0.1.10 ===> Cleaning temporary files for gdalwrap-0.1.10 ===> Bulk building for gdalwrap-0.1.10 => Checking for clear installation => Installing digest-20080510.tgz => Installing tnftp-20130505~ssl.tgz => Required robotpkg package digest>=20080510: digest-20080510 found => Required robotpkg package tnftp>=20091122: tnftp-20130505~ssl found => Required system package gzip: gzip-1.6 found => Required system package pax and tar archivers: pax found => Required system package pkg_install>=20110805.7: pkg_install-20110805.7 found => Dependency digest-20080510 already installed => Required system package gdal>=1.6: MISSING => Dependency tnftp-20130505~ssl already installed ERROR: ====================================================================== ERROR: Missing system packages required for gdalwrap-0.1.10: ERROR: ERROR: gdal>=1.6 (Debian package libgdal1-dev) ERROR: ERROR: Please use the system package management tool to install these ERROR: dependencies. If a robotpkg version of a dependency is available, ERROR: you can configure robotpkg.conf to use this version instead. ERROR: ERROR: See /local/robotpkg/var/tmp/robotpkg/wip/gdalwrap/work/sysdep.log for details. ERROR: ====================================================================== make[2]: *** [sys-depends] Error 2 ===> Logging bulk summary for gdalwrap-0.1.10 => Checking leftover files => Creating bulk log files => Logging bulk metadata ===> Cleaning temporary files for gdalwrap-0.1.10 ===> Done bulk for gdalwrap-0.1.10 [7%] Processing wip/mumps:mumps-4.10.0 ===> Bulk building for mumps-4.10.0 Binary package for mumps-4.10.0 is up-to-date. [8%] Processing wip/talos-ros-control:talos-ros-control-0.2.9r2 ===> Bulk building for talos-ros-control-0.2.9r2 Binary package for talos-ros-control-0.2.9r2 is up-to-date. [8%] Processing wip/jointStateMapper:jointStateMapper-1.2.1r1 ===> Cleaning temporary files for jointStateMapper-1.2.1r1 ===> Bulk building for jointStateMapper-1.2.1r1 => Checking for clear installation => Installing digest-20080510.tgz => Installing tnftp-20130505~ssl.tgz => Required robotpkg package digest>=20080510: digest-20080510 found => Required robotpkg package tnftp>=20091122: tnftp-20130505~ssl found => Required system package gzip: gzip-1.6 found => Required system package pax and tar archivers: pax found => Required system package pkg_install>=20110805.7: pkg_install-20110805.7 found => Dependency digest-20080510 already installed => Required robotpkg package openrobots-pose>=1.2: NOT found ERROR: Required robotpkg package openrobots-pose>=1.2: NOT found => Dependency tnftp-20130505~ssl already installed ===> Logging bulk summary for jointStateMapper-1.2.1r1 => Checking leftover files => Creating bulk log files => Logging bulk metadata ===> Cleaning temporary files for jointStateMapper-1.2.1r1 ===> Done bulk for jointStateMapper-1.2.1r1 [9%] Processing wip/metapod:metapod-1.0.10 ===> Cleaning temporary files for metapod-1.0.10 ===> Bulk building for metapod-1.0.10 => Checking for clear installation Warning: DOXYGEN_PLIST_DIR in wip/metapod is deprecated. Warning: use DYNAMIC_PLIST_DIRS instead. => Installing digest-20080510.tgz => Installing tnftp-20130505~ssl.tgz Warning: DOXYGEN_PLIST_DIR in wip/metapod is deprecated. Warning: use DYNAMIC_PLIST_DIRS instead. => Required robotpkg package digest>=20080510: digest-20080510 found => Required robotpkg package tnftp>=20091122: tnftp-20130505~ssl found => Required system package gzip: gzip-1.6 found => Required system package pax and tar archivers: pax found => Required system package pkg_install>=20110805.7: pkg_install-20110805.7 found Warning: DOXYGEN_PLIST_DIR in wip/metapod is deprecated. Warning: use DYNAMIC_PLIST_DIRS instead. Warning: DOXYGEN_PLIST_DIR in wip/metapod is deprecated. Warning: use DYNAMIC_PLIST_DIRS instead. => Dependency digest-20080510 already installed => Dependency tnftp-20130505~ssl already installed Warning: DOXYGEN_PLIST_DIR in wip/metapod is deprecated. Warning: use DYNAMIC_PLIST_DIRS instead. => Building with no option. => Use the GNU C++ compiler: c++-compiler provided by g++>=3 => Use the GNU C compiler: c-compiler provided by gcc>=3 => Required system package boost-headers>=1.34.1: boost-headers-1.55 found => Required system package boostlib-filesystem>=1.34.1: boost-libs-1.55.0 found => Required system package boostlib-iostreams>=1.34.1: boost-libs-1.55.0 found => Required system package boostlib-math>=1.34.1: boost-libs-1.55.0 found => Required system package boostlib-thread>=1.34.1: boost-libs-1.55.0 found => Required system package cmake>=2.6: cmake-3.0.2 found => Required system package doxygen>=1.5: doxygen-1.8.8 found => Required system package eigen3>=3.0.0: eigen3-3.2.2 found => Required system package g++>=3: g++-4.9.2 found => Required system package gcc>=3: gcc-4.9.2 found => Required system package graphviz>=2: graphviz-2.38.0 found => Required system package libstdc++: libstdc++ found => Required system package pdflatex: pdflatex found => Required system package pkg-config>=0.22: pkg-config-0.28 found Warning: DOXYGEN_PLIST_DIR in wip/metapod is deprecated. Warning: use DYNAMIC_PLIST_DIRS instead. Warning: DOXYGEN_PLIST_DIR in wip/metapod is deprecated. Warning: use DYNAMIC_PLIST_DIRS instead. Warning: DOXYGEN_PLIST_DIR in wip/metapod is deprecated. Warning: use DYNAMIC_PLIST_DIRS instead. => SHA1 checksums OK => RMD160 checksums OK Warning: DOXYGEN_PLIST_DIR in wip/metapod is deprecated. Warning: use DYNAMIC_PLIST_DIRS instead. => Adding run-time search paths to pkg-config files robotpkg_create: can't stat `/opt/openrobots/include/metapod/config.h' robotpkg_create: can't stat `/opt/openrobots/share/metapod/data/simple_humanoid/metapod_license_file.txt' robotpkg_create: can't stat `/opt/openrobots/share/metapod/data/simple_humanoid/simple_humanoid.config' robotpkg_create: can't stat `/opt/openrobots/share/metapod/data/simple_humanoid/simple_humanoid.urdf' robotpkg_create: can't stat `/opt/openrobots/share/metapod/data/simple_arm/metapod_license_file.txt' robotpkg_create: can't stat `/opt/openrobots/share/metapod/data/simple_arm/simple_arm.config' robotpkg_create: can't stat `/opt/openrobots/share/metapod/data/simple_arm/simple_arm.urdf' robotpkg_create: can't stat `/opt/openrobots/bin/metapodfromurdf' => Registering installation for metapod-1.0.10 robotpkg_admin: metapod-1.0.10: File `/opt/openrobots/include/metapod/config.h' is in +CONTENTS but not on filesystem! robotpkg_admin: metapod-1.0.10: File `/opt/openrobots/share/metapod/data/simple_humanoid/metapod_license_file.txt' is in +CONTENTS but not on filesystem! robotpkg_admin: metapod-1.0.10: File `/opt/openrobots/share/metapod/data/simple_humanoid/simple_humanoid.config' is in +CONTENTS but not on filesystem! robotpkg_admin: metapod-1.0.10: File `/opt/openrobots/share/metapod/data/simple_humanoid/simple_humanoid.urdf' is in +CONTENTS but not on filesystem! robotpkg_admin: metapod-1.0.10: File `/opt/openrobots/share/metapod/data/simple_arm/metapod_license_file.txt' is in +CONTENTS but not on filesystem! robotpkg_admin: metapod-1.0.10: File `/opt/openrobots/share/metapod/data/simple_arm/simple_arm.config' is in +CONTENTS but not on filesystem! robotpkg_admin: metapod-1.0.10: File `/opt/openrobots/share/metapod/data/simple_arm/simple_arm.urdf' is in +CONTENTS but not on filesystem! robotpkg_admin: metapod-1.0.10: File `/opt/openrobots/bin/metapodfromurdf' is in +CONTENTS but not on filesystem! robotpkg_create: can't stat `/opt/openrobots/include/metapod/config.h' robotpkg_create: can't stat `/opt/openrobots/share/metapod/data/simple_humanoid/metapod_license_file.txt' robotpkg_create: can't stat `/opt/openrobots/share/metapod/data/simple_humanoid/simple_humanoid.config' robotpkg_create: can't stat `/opt/openrobots/share/metapod/data/simple_humanoid/simple_humanoid.urdf' robotpkg_create: can't stat `/opt/openrobots/share/metapod/data/simple_arm/metapod_license_file.txt' robotpkg_create: can't stat `/opt/openrobots/share/metapod/data/simple_arm/simple_arm.config' robotpkg_create: can't stat `/opt/openrobots/share/metapod/data/simple_arm/simple_arm.urdf' robotpkg_create: can't stat `/opt/openrobots/bin/metapodfromurdf' robotpkg_create: lstat failed for file include/metapod/config.h: No such file or directory make[2]: *** [pkg-tarup] Error 2 => Marking metapod-1.0.10 as broken ERROR: make: *** [package] Error 2 Warning: DOXYGEN_PLIST_DIR in wip/metapod is deprecated. Warning: use DYNAMIC_PLIST_DIRS instead. robotpkg_delete: Couldn't remove /opt/openrobots/include/metapod/config.h robotpkg_delete: Couldn't remove /opt/openrobots/share/metapod/data/simple_humanoid/metapod_license_file.txt robotpkg_delete: Couldn't remove /opt/openrobots/share/metapod/data/simple_humanoid/simple_humanoid.config robotpkg_delete: Couldn't remove /opt/openrobots/share/metapod/data/simple_humanoid/simple_humanoid.urdf robotpkg_delete: Couldn't remove /opt/openrobots/share/metapod/data/simple_arm/metapod_license_file.txt robotpkg_delete: Couldn't remove /opt/openrobots/share/metapod/data/simple_arm/simple_arm.config robotpkg_delete: Couldn't remove /opt/openrobots/share/metapod/data/simple_arm/simple_arm.urdf robotpkg_delete: Couldn't remove /opt/openrobots/bin/metapodfromurdf ===> Logging bulk summary for metapod-1.0.10 => Checking leftover files => Creating bulk log files => Logging bulk metadata ===> Cleaning temporary files for metapod-1.0.10 ===> Done bulk for metapod-1.0.10 [9%] Processing wip/py-laaswm:py27-laaswm-1.3r1 ===> Bulk building for py27-laaswm-1.3r1 Binary package for py27-laaswm-1.3r1 is up-to-date. [9%] Processing wip/jsbsim:jsbsim-20150424 ===> Bulk building for jsbsim-20150424 Binary package for jsbsim-20150424 is up-to-date. [10%] Processing wip/dptu-genom3:dptu-genom3-0.2~pocolibs-client-c+codels+openprs+pocolibs-server+!* ===> Cleaning temporary files for dptu-genom3-0.2~codels+openprs+pocolibs-client-c+pocolibs-server ===> Bulk building for dptu-genom3-0.2~codels+openprs+pocolibs-client-c+pocolibs-server => Checking for clear installation => Installing digest-20080510.tgz => Installing tnftp-20130505~ssl.tgz => Required robotpkg package digest>=20080510: digest-20080510 found => Required robotpkg package tnftp>=20130505~ssl: tnftp-20130505~ssl found => Required system package gzip: gzip-1.6 found => Required system package pax and tar archivers: pax found => Required system package pkg_install>=20110805.7: pkg_install-20110805.7 found => Dependency digest-20080510 already installed => Installing genom3-2.99.29.tgz => Installing genom3-openprs-1.0.9r5.tgz => Installing genom3-pocolibs-1.10.tgz => Dependency openprs-1.1b10 already installed => Installing openrobots-idl-1.4.tgz => Dependency pocolibs-2.15 already installed => Dependency tnftp-20130505~ssl already installed => Dependency transgen3-1.0b5 already installed => Building with the following options: => Use the GNU C compiler: c-compiler provided by gcc>=3 => Required system package autoconf>=2.59: autoconf-2.69 found => Required system package automake>=1.8: automake-1.14.1 found => Required system package gcc>=3: gcc-4.9.2 found => Required system package libtool>=1.5.22: libtool-2.4.2 found => Required system package pkg-config>=0.22: pkg-config-0.28 found => Required robotpkg package genom3>=2.99.28: genom3-2.99.29 found => Required robotpkg package genom3-openprs>=1.0: genom3-openprs-1.0.9r5 found => Required robotpkg package genom3-pocolibs>=1.8: genom3-pocolibs-1.10 found => Required robotpkg package openprs>=1.1b7: openprs-1.1b10 found => Required robotpkg package openrobots-idl>=1.4: openrobots-idl-1.4 found => Required robotpkg package pocolibs>=2.11: pocolibs-2.15 found => Required robotpkg package transgen3>=1.0b2: transgen3-1.0b5 found => SHA1 checksums OK => RMD160 checksums OK => Generating openprs/client => Running autoreconf for openprs/client => Generating pocolibs/client/c => Running autoreconf for pocolibs/client/c => Generating pocolibs/server => Running autoreconf for pocolibs/server => Modifying GNU configure scripts to avoid --recheck => Disabling fatal errors with C++ preprocessor in GNU configure scripts => Adding run-time search paths to pkg-config files => Registering installation for dptu-genom3-0.2~codels+openprs+pocolibs-client-c+pocolibs-server => Linking package in /opt/robotpkg/var/lib/robotpkg/packages/bsd/Debian-8.2-x86_64/pub ===> Logging bulk summary for dptu-genom3-0.2~codels+openprs+pocolibs-client-c+pocolibs-server => Checking leftover files => Creating bulk log files => Logging bulk metadata ===> Cleaning temporary files for dptu-genom3-0.2~codels+openprs+pocolibs-client-c+pocolibs-server ===> Done bulk for dptu-genom3-0.2~codels+openprs+pocolibs-client-c+pocolibs-server [10%] Processing wip/dptu-genom3:dptu-genom3-0.2~codels+openprs+ros-client-c+ros-client-ros+ros-server+!* ===> Cleaning temporary files for dptu-genom3-0.2~codels+openprs+ros-client-c+ros-client-ros+ros-server ===> Bulk building for dptu-genom3-0.2~codels+openprs+ros-client-c+ros-client-ros+ros-server => Checking for clear installation => Installing digest-20080510.tgz => Installing tnftp-20130505~ssl.tgz => Required robotpkg package digest>=20080510: digest-20080510 found => Required robotpkg package tnftp>=20130505~ssl: tnftp-20130505~ssl found => Required system package gzip: gzip-1.6 found => Required system package pax and tar archivers: pax found => Required system package pkg_install>=20110805.7: pkg_install-20110805.7 found => Dependency digest-20080510 already installed => Installing genom3-2.99.29.tgz => Installing genom3-openprs-1.0.9r5.tgz => Installing genom3-ros-1.16.tgz => Dependency openprs-1.1b10 already installed => Installing openrobots-idl-1.4.tgz => Dependency ros-actionlib-1.11.2 already installed => Dependency ros-comm-1.11.20 already installed => Dependency ros-common-msgs-1.11.4 already installed => Dependency ros-ros-1.11.4 already installed => Dependency ros-rospack-2.2.4 already installed => Dependency tnftp-20130505~ssl already installed => Dependency transgen3-1.0b5 already installed => Building with the following options: => Use the GNU C++ compiler: c++-compiler provided by g++>=3 => Use the GNU C compiler: c-compiler provided by gcc>=3 => Use python-2.7: python>=2.5<3.6 provided by python27>=2.7<2.8 => Use ros indigo: ros>=groovy provided by ros-indigo => Required system package autoconf>=2.59: autoconf-2.69 found => Required system package automake>=1.8: automake-1.14.1 found => Required system package boost-headers>=1.34.1: boost-headers-1.55 found => Required system package boostlib-thread>=1.34.1: boost-libs-1.55.0 found => Required system package g++>=3: g++-4.9.2 found => Required system package gcc>=3: gcc-4.9.2 found => Required system package libstdc++: libstdc++ found => Required system package libtool>=1.5.22: libtool-2.4.2 found => Required system package pkg-config>=0.22: pkg-config-0.28 found => Required system package python27>=2.7<2.8: python27-2.7.9 found => Required robotpkg package genom3>=2.99.28: genom3-2.99.29 found => Required robotpkg package genom3-openprs>=1.0: genom3-openprs-1.0.9r5 found => Required robotpkg package genom3-ros>=1.15.1: genom3-ros-1.16 found => Required robotpkg package openprs>=1.1b7: openprs-1.1b10 found => Required robotpkg package openrobots-idl>=1.4: openrobots-idl-1.4 found => Required robotpkg package ros-actionlib>=1.11<1.12: ros-actionlib-1.11.2 found => Required robotpkg package ros-comm>=1.11<1.12: ros-comm-1.11.20 found => Required robotpkg package ros-common-msgs>=1.11<1.12: ros-common-msgs-1.11.4 found => Required robotpkg package ros-ros>=1.11<1.12: ros-ros-1.11.4 found => Required robotpkg package ros-rospack>=2.1: ros-rospack-2.2.4 found => Required robotpkg package transgen3>=1.0b2: transgen3-1.0b5 found => SHA1 checksums OK => RMD160 checksums OK => Generating openprs/client => Running autoreconf for openprs/client => Generating ros/client/c => Running autoreconf for ros/client/c => Generating ros/client/ros => Running autoreconf for ros/client/ros => Generating ros/server => Running autoreconf for ros/server => Modifying GNU configure scripts to avoid --recheck => Adding run-time search paths to pkg-config files => Compiling python files => Registering installation for dptu-genom3-0.2~codels+openprs+ros-client-c+ros-client-ros+ros-server => Linking package in /opt/robotpkg/var/lib/robotpkg/packages/bsd/Debian-8.2-x86_64/pub ===> Logging bulk summary for dptu-genom3-0.2~codels+openprs+ros-client-c+ros-client-ros+ros-server => Checking leftover files => Creating bulk log files => Logging bulk metadata ===> Cleaning temporary files for dptu-genom3-0.2~codels+openprs+ros-client-c+ros-client-ros+ros-server ===> Done bulk for dptu-genom3-0.2~codels+openprs+ros-client-c+ros-client-ros+ros-server [11%] Processing wip/can-utils:can-utils-20160229 ===> Bulk building for can-utils-20160229 Binary package for can-utils-20160229 is up-to-date. [11%] Processing wip/chilitags:chilitags-1.3.1 ===> Bulk building for chilitags-1.3.1 Binary package for chilitags-1.3.1 is up-to-date. [12%] Processing wip/hrp2-computer-monitor:hrp2-computer-monitor-1.0.2 ===> Bulk building for hrp2-computer-monitor-1.0.2 Binary package for hrp2-computer-monitor-1.0.2 is up-to-date. [12%] Processing wip/FRILibrary:FRILibrary-1.2 ===> Bulk building for FRILibrary-1.2 Binary package for FRILibrary-1.2 is up-to-date. [13%] Processing wip/py-hla:py27-hla-1.1.1r1 ===> Bulk building for py27-hla-1.1.1r1 Binary package for py27-hla-1.1.1r1 is up-to-date. [13%] Processing wip/py-hla:py34-hla-1.1.1r1 ===> Bulk building for py34-hla-1.1.1r1 Binary package for py34-hla-1.1.1r1 is up-to-date. [14%] Processing wip/jafar-lgl:jafar-lgl-1.7.1r2 ===> Cleaning temporary files for jafar-lgl-1.7.1r2 ===> Bulk building for jafar-lgl-1.7.1r2 => Checking for clear installation => Installing digest-20080510.tgz => Installing tnftp-20130505~ssl.tgz => Required robotpkg package digest>=20080510: digest-20080510 found => Required robotpkg package tnftp>=20091122: tnftp-20130505~ssl found => Required system package gzip: gzip-1.6 found => Required system package patch>=2.0: patch-2.7.5 found => Required system package pax and tar archivers: pax found => Required system package pkg_install>=20110805.7: pkg_install-20110805.7 found => Dependency digest-20080510 already installed => Required system package gdal>=1.6: MISSING => Installing jafar-kernel-0.6r1.tgz => Dependency tnftp-20130505~ssl already installed ERROR: ====================================================================== ERROR: Missing system packages required for jafar-lgl-1.7.1r2: ERROR: ERROR: gdal>=1.6 (Debian package libgdal1-dev) ERROR: ERROR: Please use the system package management tool to install these ERROR: dependencies. If a robotpkg version of a dependency is available, ERROR: you can configure robotpkg.conf to use this version instead. ERROR: ERROR: See /local/robotpkg/var/tmp/robotpkg/wip/jafar-lgl/work/sysdep.log for details. ERROR: ====================================================================== make[2]: *** [sys-depends] Error 2 ===> Logging bulk summary for jafar-lgl-1.7.1r2 => Checking leftover files => Creating bulk log files => Logging bulk metadata ===> Cleaning temporary files for jafar-lgl-1.7.1r2 ===> Done bulk for jafar-lgl-1.7.1r2 [14%] Processing wip/ompl:ompl-1.0.0 ===> Bulk building for ompl-1.0.0 Binary package for ompl-1.0.0 is up-to-date. [14%] Processing wip/talos-data:talos-data-0.0.14r1 ===> Cleaning temporary files for talos-data-0.0.14r1 ===> Bulk building for talos-data-0.0.14r1 => Checking for clear installation => Installing digest-20080510.tgz => Installing tnftp-20130505~ssl.tgz => Required robotpkg package digest>=20080510: digest-20080510 found => Required robotpkg package tnftp>=20091122: tnftp-20130505~ssl found => Required system package gzip: gzip-1.6 found => Required system package pax and tar archivers: pax found => Required system package pkg_install>=20110805.7: pkg_install-20110805.7 found => Dependency digest-20080510 already installed => Installing ros-catkin-0.6.9.tgz => Installing ros-comm-1.11.20.tgz => Installing ros-common-msgs-1.11.4.tgz => Dependency ros-genmsg-0.5.3 already installed => Dependency ros-message-generation-0.2.10 already installed => Dependency ros-message-runtime-0.4.12 already installed => Dependency ros-std-msgs-0.5.9 already installed => Dependency tnftp-20130505~ssl already installed => Building with no option. => Use the GNU C++ compiler: c++-compiler provided by g++>=3 => Use the GNU C compiler: c-compiler provided by gcc>=3 => Use python-2.7: python>=2.5<3.6 provided by python27>=2.7<2.8 => Use ros indigo: ros>=groovy provided by ros-indigo => Required system package cmake>=2.8.3: cmake-3.0.2 found => Required system package doxygen>=1.5: doxygen-1.8.8 found => Required system package g++>=3: g++-4.9.2 found => Required system package gcc>=3: gcc-4.9.2 found => Required system package googletest: googletest found => Required system package graphviz>=2: graphviz-2.38.0 found => Required system package libstdc++: libstdc++ found => Required system package pdflatex: pdflatex found => Required system package pkg-config>=0.22: pkg-config-0.28 found => Required system package py27-nose>=0.10: py27-nose-1.3.4 found => Required system package python27>=2.7<2.8: python27-2.7.9 found => Required robotpkg package ros-catkin>=0.6<0.7: ros-catkin-0.6.9 found => Required robotpkg package ros-comm>=1.11<1.12: ros-comm-1.11.20 found => Required robotpkg package ros-common-msgs>=1.11<1.12: ros-common-msgs-1.11.4 found => Required robotpkg package ros-genmsg>=0.5<0.6: ros-genmsg-0.5.3 found => Required robotpkg package ros-message-generation>=0.2<0.3: ros-message-generation-0.2.10 found => Required robotpkg package ros-message-runtime>=0.4<0.5: ros-message-runtime-0.4.12 found => Required robotpkg package ros-std-msgs>=0.5: ros-std-msgs-0.5.9 found => SHA1 checksums OK => RMD160 checksums OK An unexpected error occured. The last 10 log lines are shown below. | /usr/share/cmake-3.0/Modules/FindPkgConfig.cmake:395 (_pkg_check_modules_internal) | cmake/pkg-config.cmake:282 (PKG_CHECK_MODULES) | cmake/pkg-config.cmake:447 (ADD_DEPENDENCY) | CMakeLists.txt:22 (ADD_REQUIRED_DEPENDENCY) | | | -- Doxygen rendering: using LaTeX backend | -- Configuring incomplete, errors occurred! | See also "/local/robotpkg/var/tmp/robotpkg/wip/talos-data/work/talos_data-0.0.14/CMakeFiles/CMakeOutput.log". | See also "/local/robotpkg/var/tmp/robotpkg/wip/talos-data/work/talos_data-0.0.14/CMakeFiles/CMakeError.log". For details or bug reports, check the complete log file in: /local/robotpkg/var/tmp/robotpkg/wip/talos-data/work/configure.log make[3]: *** [do-configure-cmake] Error 1 => Marking talos-data-0.0.14r1 as broken make[2]: *** [pkg-check-installed] Error 2 ERROR: make: *** [package] Error 2 ===> Logging bulk summary for talos-data-0.0.14r1 => Checking leftover files => Creating bulk log files => Logging bulk metadata ===> Cleaning temporary files for talos-data-0.0.14r1 ===> Done bulk for talos-data-0.0.14r1 [15%] Processing wip/move3d-assets:move3d-assets-20120125 ===> Bulk building for move3d-assets-20120125 Binary package for move3d-assets-20120125 is up-to-date. [15%] Processing wip/talos-pal-transmissions:talos-pal-transmissions-0.2.3 Display something for talos-ros-controllers /local/robotpkg Display something for talos-ros-controllers /local/robotpkg ===> Cleaning temporary files for talos-pal-transmissions-0.2.3 ===> Bulk building for talos-pal-transmissions-0.2.3 => Checking for clear installation => Installing digest-20080510.tgz => Installing tnftp-20130505~ssl.tgz => Required robotpkg package digest>=20080510: digest-20080510 found => Required robotpkg package tnftp>=20091122: tnftp-20130505~ssl found => Required system package gzip: gzip-1.6 found => Required system package pax and tar archivers: pax found => Required system package pkg_install>=20110805.7: pkg_install-20110805.7 found => Dependency digest-20080510 already installed => Installing ros-catkin-0.6.9.tgz => Installing ros-comm-1.11.20.tgz => Installing ros-common-msgs-1.11.4.tgz => Dependency ros-genmsg-0.5.3 already installed => Dependency ros-message-generation-0.2.10 already installed => Dependency ros-message-runtime-0.4.12 already installed => Dependency ros-std-msgs-0.5.9 already installed => Installing talos-ros-control-0.2.9r2.tgz => Dependency tnftp-20130505~ssl already installed => Building with no option. => Use the GNU C++ compiler: c++-compiler provided by g++>=3 => Use the GNU C compiler: c-compiler provided by gcc>=3 => Use python-2.7: python>=2.5<3.6 provided by python27>=2.7<2.8 => Use ros indigo: ros>=groovy provided by ros-indigo => Required system package boost-headers>=1.34.1: boost-headers-1.55 found => Required system package boostlib-thread>=1.34.1: boost-libs-1.55.0 found => Required system package cmake>=2.8.3: cmake-3.0.2 found => Required system package g++>=3: g++-4.9.2 found => Required system package gcc>=3: gcc-4.9.2 found => Required system package googletest: googletest found => Required system package libstdc++: libstdc++ found => Required system package pkg-config>=0.22: pkg-config-0.28 found => Required system package py27-nose>=0.10: py27-nose-1.3.4 found => Required system package python27>=2.7<2.8: python27-2.7.9 found => Required robotpkg package ros-catkin>=0.6<0.7: ros-catkin-0.6.9 found => Required robotpkg package ros-comm>=1.11<1.12: ros-comm-1.11.20 found => Required robotpkg package ros-common-msgs>=1.11<1.12: ros-common-msgs-1.11.4 found => Required robotpkg package ros-genmsg>=0.5<0.6: ros-genmsg-0.5.3 found => Required robotpkg package ros-message-generation>=0.2<0.3: ros-message-generation-0.2.10 found => Required robotpkg package ros-message-runtime>=0.4<0.5: ros-message-runtime-0.4.12 found => Required robotpkg package ros-std-msgs>=0.5: ros-std-msgs-0.5.9 found => Required robotpkg package talos-ros-control>=0.2: talos-ros-control-0.2.9r2 found => SHA1 checksums OK => RMD160 checksums OK An unexpected error occured. The last 10 log lines are shown below. | "cmake_modules_DIR" to a directory containing one of the above files. If | "cmake_modules" provides a separate development package or SDK, be sure it | has been installed. | Call Stack (most recent call first): | CMakeLists.txt:5 (find_package) | | -- Configuring incomplete, errors occurred! | See also "/local/robotpkg/var/tmp/robotpkg/wip/talos-pal-transmissions/work/talos_pal_transmissions-0.2.3/CMakeFiles/CMakeOutput.log". | See also "/local/robotpkg/var/tmp/robotpkg/wip/talos-pal-transmissions/work/talos_pal_transmissions-0.2.3/CMakeFiles/CMakeError.log". | For details or bug reports, check the complete log file in: /local/robotpkg/var/tmp/robotpkg/wip/talos-pal-transmissions/work/configure.log make[3]: *** [do-configure-cmake] Error 1 make[2]: *** [pkg-check-installed] Error 2 => Marking talos-pal-transmissions-0.2.3 as broken ERROR: make: *** [package] Error 2 ===> Logging bulk summary for talos-pal-transmissions-0.2.3 => Checking leftover files => Creating bulk log files => Logging bulk metadata Display something for talos-ros-controllers /local/robotpkg ===> Cleaning temporary files for talos-pal-transmissions-0.2.3 ===> Done bulk for talos-pal-transmissions-0.2.3 [16%] Processing wip/robot-capsule-urdf:robot-capsule-urdf-1.0.1r1 ===> Bulk building for robot-capsule-urdf-1.0.1r1 Binary package for robot-capsule-urdf-1.0.1r1 is up-to-date. [16%] Processing wip/morse-hla:morse-hla-1.4 ===> Bulk building for morse-hla-1.4 Binary package for morse-hla-1.4 is up-to-date. [17%] Processing wip/track-target-genom:track-target-genom-0.2r1 ===> Cleaning temporary files for track-target-genom-0.2r1~openprs+tcl+tclserv_client ===> Bulk building for track-target-genom-0.2r1~openprs+tcl+tclserv_client => Checking for clear installation => Installing digest-20080510.tgz => Installing tnftp-20130505~ssl.tgz => Required robotpkg package digest>=20080510: digest-20080510 found => Required robotpkg package tnftp>=20091122: tnftp-20130505~ssl found => Required system package gzip: gzip-1.6 found => Required system package patch>=2.0: patch-2.7.5 found => Required system package pax and tar archivers: pax found => Required system package pkg_install>=20110805.7: pkg_install-20110805.7 found => Dependency digest-20080510 already installed => Installing genBasic-genom-0.4r1~openprs+tcl+tclserv_client.tgz => Installing genPos-genom-0.3r1~openprs+tcl+tclserv_client.tgz => Dependency genom-2.12~doc already installed => Installing libt3d-2.6~doc.tgz => Dependency libtclserv_client-0.5r1 already installed => Installing mkdep-2.7r1.tgz => Installing platine-genom-0.5~openprs+tcl+tclserv_client.tgz => Dependency pocolibs-2.15 already installed => Dependency pom-genom-0.7~openprs+tcl+tclserv_client already installed => Dependency tclserv-2.8.1 already installed => Dependency tnftp-20130505~ssl already installed => Dependency transgen-1.1b1 already installed => Building with the following options: => Use the GNU C compiler: c-compiler provided by gcc>=3 => Use tcl-8.6: tcl>=8.4 provided by tcl86>=8.6<8.7 => Required system package autoconf>=2.59: autoconf-2.69 found => Required system package gcc>=3: gcc-4.9.2 found => Required system package libtool>=1.5.22: libtool-2.4.2 found => Required system package perl>=5: perl-5 found => Required system package pkg-config>=0.22: pkg-config-0.28 found => Required system package tcl86>=8.6<8.7: tcl86-8.6 found => Required robotpkg package genBasic-genom>=0.1: genBasic-genom-0.4r1~openprs+tcl+tclserv_client found => Required robotpkg package genPos-genom>=0.1: genPos-genom-0.3r1~openprs+tcl+tclserv_client found => Required robotpkg package genom>=2.9: genom-2.12~doc found => Required robotpkg package libt3d>=2.6: libt3d-2.6~doc found => Required robotpkg package libtclserv_client>=0.3: libtclserv_client-0.5r1 found => Required robotpkg package mkdep>=2.6: mkdep-2.7r1 found => Required robotpkg package platine-genom>=0.4: platine-genom-0.5~openprs+tcl+tclserv_client found => Required robotpkg package pocolibs>=2.11: pocolibs-2.15 found => Required robotpkg package pom-genom>=0.5r1: pom-genom-0.7~openprs+tcl+tclserv_client found => Required robotpkg package tclserv>=2.7: tclserv-2.8.1 found => Required robotpkg package transgen>=1.1b0: transgen-1.1b1 found => SHA1 checksums OK => RMD160 checksums OK => Applying robotpkg patches for track-target-genom-0.2r1~openprs+tcl+tclserv_client => Generating track_target module => Modifying GNU configure scripts to avoid --recheck => Disabling fatal errors with C++ preprocessor in GNU configure scripts => Adding run-time search paths to pkg-config files => Registering installation for track-target-genom-0.2r1~openprs+tcl+tclserv_client => Linking package in /opt/robotpkg/var/lib/robotpkg/packages/bsd/Debian-8.2-x86_64/pub ===> Logging bulk summary for track-target-genom-0.2r1~openprs+tcl+tclserv_client => Checking leftover files => Creating bulk log files => Logging bulk metadata ===> Cleaning temporary files for track-target-genom-0.2r1~openprs+tcl+tclserv_client ===> Done bulk for track-target-genom-0.2r1~openprs+tcl+tclserv_client [17%] Processing wip/hyper:hyper-0.13r1 ===> Bulk building for hyper-0.13r1 Binary package for hyper-0.13r1 is up-to-date. [18%] Processing wip/gerard-bauzil:gerard-bauzil-1.0.1 ===> Bulk building for gerard-bauzil-1.0.1 Binary package for gerard-bauzil-1.0.1 is up-to-date. [18%] Processing wip/urg:urg-0.8.18 ===> Bulk building for urg-0.8.18 Binary package for urg-0.8.18 is up-to-date. [19%] Processing wip/jafar-qdisplay:jafar-qdisplay-0.2r1 ===> Bulk building for jafar-qdisplay-0.2r1 Binary package for jafar-qdisplay-0.2r1 is up-to-date. [19%] Processing wip/spark-genom:spark-genom-3.9 ===> Cleaning temporary files for spark-genom-3.9~mightability+openprs+tcl+tclserv_client ===> Bulk building for spark-genom-3.9~mightability+openprs+tcl+tclserv_client => Checking for clear installation => Installing digest-20080510.tgz => Installing tnftp-20130505~ssl.tgz => Required robotpkg package digest>=20080510: digest-20080510 found => Required robotpkg package tnftp>=20091122: tnftp-20130505~ssl found => Required system package gzip: gzip-1.6 found => Required system package patch>=2.0: patch-2.7.5 found => Required system package pax and tar archivers: pax found => Required system package pkg_install>=20110805.7: pkg_install-20110805.7 found => Dependency digest-20080510 already installed => Installing genBasic-genom-0.4r1~openprs+tcl+tclserv_client.tgz => Installing genHum-genom-1.1r1~openprs+tcl+tclserv_client.tgz => Installing genManip-genom-0.9~openprs+tcl+tclserv_client.tgz => Dependency genom-2.12~doc already installed => Installing libmove3d-3.22.0r1.tgz => Installing libmove3d-hri-2.24.tgz => Installing libt3d-2.6~doc.tgz => Dependency libtclserv_client-0.5r1 already installed => Installing mkdep-2.7r1.tgz => Installing mocap-genom-1.3~openprs+tcl+tclserv_client.tgz => Installing niut-genom-0.6~openprs+tcl+tclserv_client.tgz => Dependency pocolibs-2.15 already installed => Installing pom-genom-0.7~openprs+tcl+tclserv_client.tgz => Dependency tclserv-2.8.1 already installed => Dependency tnftp-20130505~ssl already installed => Dependency transgen-1.1b1 already installed => Installing viman-genom-1.6~openprs+tcl+tclserv_client.tgz => Building with the following options: => Use the GNU C++ compiler: c++-compiler provided by g++>=3 => Use the GNU C compiler: c-compiler provided by gcc>=3 => Use tcl-8.6: tcl>=8.4 provided by tcl86>=8.6<8.7 => Required system package autoconf>=2.59: autoconf-2.69 found => Required system package boost-headers>=1.34.1: boost-headers-1.55 found => Required system package g++>=3: g++-4.9.2 found => Required system package gcc>=3: gcc-4.9.2 found => Required system package libstdc++: libstdc++ found => Required system package libtool>=1.5.22: libtool-2.4.2 found => Required system package perl>=5: perl-5 found => Required system package pkg-config>=0.22: pkg-config-0.28 found => Required system package tcl86>=8.6<8.7: tcl86-8.6 found => Required robotpkg package genBasic-genom>=0.1: genBasic-genom-0.4r1~openprs+tcl+tclserv_client found => Required robotpkg package genHum-genom>=1.1: genHum-genom-1.1r1~openprs+tcl+tclserv_client found => Required robotpkg package genManip-genom>=0.9: genManip-genom-0.9~openprs+tcl+tclserv_client found => Required robotpkg package genom>=2.9: genom-2.12~doc found => Required robotpkg package libmove3d>=3.22.0: libmove3d-3.22.0r1 found => Required robotpkg package libmove3d-hri>=2.24: libmove3d-hri-2.24 found => Required robotpkg package libt3d>=2.6: libt3d-2.6~doc found => Required robotpkg package libtclserv_client>=0.3: libtclserv_client-0.5r1 found => Required robotpkg package mkdep>=2.6: mkdep-2.7r1 found => Required robotpkg package mocap-genom>=1.3: mocap-genom-1.3~openprs+tcl+tclserv_client found => Required robotpkg package niut-genom>=0.6: niut-genom-0.6~openprs+tcl+tclserv_client found => Required robotpkg package pocolibs>=2.11: pocolibs-2.15 found => Required robotpkg package pom-genom>=0.5r1: pom-genom-0.7~openprs+tcl+tclserv_client found => Required robotpkg package tclserv>=2.7: tclserv-2.8.1 found => Required robotpkg package transgen>=1.1b0: transgen-1.1b1 found => Required robotpkg package viman-genom>=1.4: viman-genom-1.6~openprs+tcl+tclserv_client found => SHA1 checksums OK => RMD160 checksums OK => Applying robotpkg patches for spark-genom-3.9~mightability+openprs+tcl+tclserv_client => Generating spark module An unexpected error occured. The last 10 log lines are shown below. | _override_vars_wip_libmove3d=PKGREQD PKGREQD PKGREQD | --- | Running set -e;cd /local/robotpkg/var/tmp/robotpkg/wip/spark-genom/work/spark-genom-3.9 && | /usr/bin/env CONFIG_SHELL=/bin/sh LIBS='' 'CPPFLAGS=' 'CFLAGS=-pipe -O3 -DNDEBUG' 'LDFLAGS=' 'CXXFLAGS=-pipe -O3 -DNDEBUG' PREFIX='/opt/openrobots' HOME=/local/robotpkg/var/tmp/robotpkg/wip/spark-genom/work PATH='/opt/openrobots/bin:/opt/openrobots/sbin:/usr/local/sbin:/usr/local/bin:/usr/sbin:/usr/bin:/sbin:/bin' LD_LIBRARY_PATH='' | /opt/openrobots/bin/genom -DUSE_MIGHTABILITY_MAPS -o -t -x spark | Package libmove3d-planners was not found in the pkg-config search path. | Perhaps you should add the directory containing `libmove3d-planners.pc' | to the PKG_CONFIG_PATH environment variable | No package 'libmove3d-planners' found | error running /usr/bin/pkg-config For details or bug reports, check the complete log file in: /local/robotpkg/var/tmp/robotpkg/wip/spark-genom/work/configure.log make[3]: *** [genom-generate] Error 1 make[2]: *** [pkg-check-installed] Error 2 => Marking spark-genom-3.9~mightability+openprs+tcl+tclserv_client as broken ERROR: make: *** [package] Error 2 ===> Logging bulk summary for spark-genom-3.9~mightability+openprs+tcl+tclserv_client => Checking leftover files => Creating bulk log files => Logging bulk metadata ===> Cleaning temporary files for spark-genom-3.9~mightability+openprs+tcl+tclserv_client ===> Done bulk for spark-genom-3.9~mightability+openprs+tcl+tclserv_client [19%] Processing wip/dynamic-graph-v3:dynamic-graph-v3-3.0.0r2 ===> Bulk building for dynamic-graph-v3-3.0.0r2 Binary package for dynamic-graph-v3-3.0.0r2 is up-to-date. [20%] Processing wip/histodet:histodet-1.0r2 ===> Bulk building for histodet-1.0r2 Binary package for histodet-1.0r2 is up-to-date. [20%] Processing wip/MPC_DEMTreatment-genom:MPC_DEMTreatment-genom-0.2 ===> Cleaning temporary files for MPC_DEMTreatment-genom-0.2~openprs+tcl+tclserv_client ===> Bulk building for MPC_DEMTreatment-genom-0.2~openprs+tcl+tclserv_client => Checking for clear installation Warning: the LICENSE of wip/MPC_DEMTreatment-genom is undefined. => Installing digest-20080510.tgz => Installing tnftp-20130505~ssl.tgz Warning: the LICENSE of wip/MPC_DEMTreatment-genom is undefined. => Required robotpkg package digest>=20080510: digest-20080510 found => Required robotpkg package tnftp>=20091122: tnftp-20130505~ssl found => Required system package gzip: gzip-1.6 found => Required system package pax and tar archivers: pax found => Required system package pkg_install>=20110805.7: pkg_install-20110805.7 found Warning: the LICENSE of wip/MPC_DEMTreatment-genom is undefined. Warning: the LICENSE of wip/MPC_DEMTreatment-genom is undefined. => Installing MPC-1.0r2.tgz => Dependency digest-20080510 already installed => Installing dtm-genom-1.5~openprs+tcl+tclserv_client.tgz => Dependency genBasic-genom-0.4r1~openprs+tcl+tclserv_client already installed => Dependency genPos-genom-0.3r1~openprs+tcl+tclserv_client already installed => Dependency genom-2.12~doc already installed => Dependency libt3d-2.6~doc already installed => Dependency libtclserv_client-0.5r1 already installed => Installing mkdep-2.7r1.tgz => Dependency pocolibs-2.15 already installed => Dependency pom-genom-0.7~openprs+tcl+tclserv_client already installed => Dependency stereopixel-genom-1.3~openprs+tcl+tclserv_client already installed => Dependency tclserv-2.8.1 already installed => Dependency tnftp-20130505~ssl already installed => Dependency transgen-1.1b1 already installed => Dependency velodyne-genom-1.6~openprs+tcl+tclserv_client already installed Warning: the LICENSE of wip/MPC_DEMTreatment-genom is undefined. => Building with the following options: => Use the GNU C++ compiler: c++-compiler provided by g++>=3 => Use the GNU C compiler: c-compiler provided by gcc>=3 => Use tcl-8.6: tcl>=8.4 provided by tcl86>=8.6<8.7 => Required system package autoconf>=2.59: autoconf-2.69 found => Required system package g++>=3: g++-4.9.2 found => Required system package gcc>=3: gcc-4.9.2 found => Required system package glu>=7: glu-9.0.0 found => Required system package libstdc++: libstdc++ found => Required system package libtool>=1.5.22: libtool-2.4.2 found => Required system package mesa>=6.5: mesa-10.3.2 found => Required system package perl>=5: perl-5 found => Required system package pkg-config>=0.22: pkg-config-0.28 found => Required system package tcl86>=8.6<8.7: tcl86-8.6 found => Required robotpkg package MPC>=1.0: MPC-1.0r2 found => Required robotpkg package dtm-genom>=1.3: dtm-genom-1.5~openprs+tcl+tclserv_client found => Required robotpkg package genBasic-genom>=0.1: genBasic-genom-0.4r1~openprs+tcl+tclserv_client found => Required robotpkg package genPos-genom>=0.1: genPos-genom-0.3r1~openprs+tcl+tclserv_client found => Required robotpkg package genom>=2.9: genom-2.12~doc found => Required robotpkg package libt3d>=2.6: libt3d-2.6~doc found => Required robotpkg package libtclserv_client>=0.3: libtclserv_client-0.5r1 found => Required robotpkg package mkdep>=2.6: mkdep-2.7r1 found => Required robotpkg package pocolibs>=2.11: pocolibs-2.15 found => Required robotpkg package pom-genom>=0.5r1: pom-genom-0.7~openprs+tcl+tclserv_client found => Required robotpkg package stereopixel-genom>=1.2: stereopixel-genom-1.3~openprs+tcl+tclserv_client found => Required robotpkg package tclserv>=2.7: tclserv-2.8.1 found => Required robotpkg package transgen>=1.1b0: transgen-1.1b1 found => Required robotpkg package velodyne-genom>=1.6: velodyne-genom-1.6~openprs+tcl+tclserv_client found Warning: the LICENSE of wip/MPC_DEMTreatment-genom is undefined. Warning: the LICENSE of wip/MPC_DEMTreatment-genom is undefined. Warning: the LICENSE of wip/MPC_DEMTreatment-genom is undefined. => SHA1 checksums OK => RMD160 checksums OK => Generating MPC_DEMTreatment module => Modifying GNU configure scripts to avoid --recheck Warning: the LICENSE of wip/MPC_DEMTreatment-genom is undefined. => Adding run-time search paths to pkg-config files => Registering installation for MPC_DEMTreatment-genom-0.2~openprs+tcl+tclserv_client => Linking package in /opt/robotpkg/var/lib/robotpkg/packages/bsd/Debian-8.2-x86_64/pub Warning: the LICENSE of wip/MPC_DEMTreatment-genom is undefined. ===> Logging bulk summary for MPC_DEMTreatment-genom-0.2~openprs+tcl+tclserv_client => Checking leftover files => Creating bulk log files => Logging bulk metadata ===> Cleaning temporary files for MPC_DEMTreatment-genom-0.2~openprs+tcl+tclserv_client ===> Done bulk for MPC_DEMTreatment-genom-0.2~openprs+tcl+tclserv_client [21%] Processing wip/talos-pal-hardware-interfaces:talos-pal-hardware-interfaces-0.0.3 ===> Bulk building for talos-pal-hardware-interfaces-0.0.3 Binary package for talos-pal-hardware-interfaces-0.0.3 is up-to-date. [21%] Processing wip/octovis:octoviz-1.6.1 ===> Cleaning temporary files for octoviz-1.6.1 ===> Bulk building for octoviz-1.6.1 => Checking for clear installation => Installing digest-20080510.tgz => Installing tnftp-20130505~ssl.tgz => Required robotpkg package digest>=20080510: digest-20080510 found => Required robotpkg package tnftp>=20130505~ssl: tnftp-20130505~ssl found => Required system package gzip: gzip-1.6 found => Required system package pax and tar archivers: pax found => Required system package pkg_install>=20110805.7: pkg_install-20110805.7 found => Dependency digest-20080510 already installed => Required system package libqglviewer>=2.3: MISSING => Installing octomap-1.6.1.tgz => Dependency tnftp-20130505~ssl already installed ERROR: ====================================================================== ERROR: Missing system packages required for octoviz-1.6.1: ERROR: ERROR: libqglviewer>=2.3 (Debian package libqglviewer-qt4-dev) ERROR: ERROR: Please use the system package management tool to install these ERROR: dependencies. If a robotpkg version of a dependency is available, ERROR: you can configure robotpkg.conf to use this version instead. ERROR: ERROR: See /local/robotpkg/var/tmp/robotpkg/wip/octovis/work/sysdep.log for details. ERROR: ====================================================================== make[2]: *** [sys-depends] Error 2 ===> Logging bulk summary for octoviz-1.6.1 => Checking leftover files => Creating bulk log files => Logging bulk metadata ===> Cleaning temporary files for octoviz-1.6.1 ===> Done bulk for octoviz-1.6.1 [22%] Processing wip/sot-application:sot-application-1.0.0r1 ===> Bulk building for sot-application-1.0.0r1 Binary package for sot-application-1.0.0r1 is up-to-date. [22%] Processing wip/mrpt:mrpt-1.2.2r2 ===> Bulk building for mrpt-1.2.2r2 Binary package for mrpt-1.2.2r2 is up-to-date. [23%] Processing wip/vnet-yarp:vnet-yarp-0.2r2 ===> Bulk building for vnet-yarp-0.2r2 Binary package for vnet-yarp-0.2r2 is up-to-date. [23%] Processing wip/py-eigen:eigenpy-1.3.2 ===> Bulk building for eigenpy-1.3.2 Binary package for eigenpy-1.3.2 is up-to-date. [23%] Processing wip/talos-simulation:talos-simulation-0.0.14 ===> Cleaning temporary files for talos-simulation-0.0.14 ===> Bulk building for talos-simulation-0.0.14 => Checking for clear installation => Installing digest-20080510.tgz => Installing tnftp-20130505~ssl.tgz => Required robotpkg package digest>=20080510: digest-20080510 found => Required robotpkg package tnftp>=20091122: tnftp-20130505~ssl found => Required system package gzip: gzip-1.6 found => Required system package pax and tar archivers: pax found => Required system package pkg_install>=20110805.7: pkg_install-20110805.7 found => Dependency digest-20080510 already installed => Installing ros-actionlib-1.11.2.tgz => Dependency ros-catkin-0.6.9 already installed => Dependency ros-comm-1.11.20 already installed => Dependency ros-common-msgs-1.11.4 already installed => Installing ros-control-toolbox-1.13.2r1.tgz => Dependency ros-genmsg-0.5.3 already installed => Installing ros-geometry-1.11.3r1.tgz => Dependency ros-message-generation-0.2.10 already installed => Dependency ros-message-runtime-0.4.12 already installed => Installing ros-pluginlib-1.10.1.tgz => Installing ros-robot-model-1.11.5.tgz => Dependency ros-ros-1.11.4 already installed => Dependency ros-std-msgs-0.5.9 already installed => Required robotpkg package talos-pal-hardware-gazebo>=0.0.9: NOT found ERROR: Required robotpkg package talos-pal-hardware-gazebo>=0.0.9: NOT found => Dependency tnftp-20130505~ssl already installed ===> Logging bulk summary for talos-simulation-0.0.14 => Checking leftover files => Creating bulk log files => Logging bulk metadata ===> Cleaning temporary files for talos-simulation-0.0.14 ===> Done bulk for talos-simulation-0.0.14 [24%] Processing wip/py-morse:py34-morse-1.4 ===> Bulk building for py34-morse-1.4 Binary package for py34-morse-1.4 is up-to-date. [24%] Processing wip/simple-humanoid-description:simple-humanoid-description-1.0.1 ===> Bulk building for simple-humanoid-description-1.0.1 Binary package for simple-humanoid-description-1.0.1 is up-to-date. [25%] Processing wip/MPC_planner-genom:MPC_planner-genom-0.2r1 ===> Cleaning temporary files for MPC_planner-genom-0.2r1~openprs+tcl+tclserv_client ===> Bulk building for MPC_planner-genom-0.2r1~openprs+tcl+tclserv_client => Checking for clear installation Warning: the LICENSE of wip/MPC_planner-genom is undefined. => Installing digest-20080510.tgz => Installing tnftp-20130505~ssl.tgz Warning: the LICENSE of wip/MPC_planner-genom is undefined. => Required robotpkg package digest>=20080510: digest-20080510 found => Required robotpkg package tnftp>=20091122: tnftp-20130505~ssl found => Required system package gzip: gzip-1.6 found => Required system package patch>=2.0: patch-2.7.5 found => Required system package pax and tar archivers: pax found => Required system package pkg_install>=20110805.7: pkg_install-20110805.7 found Warning: the LICENSE of wip/MPC_planner-genom is undefined. Warning: the LICENSE of wip/MPC_planner-genom is undefined. => Installing MPC-1.0r2.tgz => Dependency digest-20080510 already installed => Installing dtm-genom-1.5~openprs+tcl+tclserv_client.tgz => Dependency genBasic-genom-0.4r1~openprs+tcl+tclserv_client already installed => Dependency genPos-genom-0.3r1~openprs+tcl+tclserv_client already installed => Dependency genom-2.12~doc already installed => Dependency libt3d-2.6~doc already installed => Dependency libtclserv_client-0.5r1 already installed => Installing mkdep-2.7r1.tgz => Dependency pocolibs-2.15 already installed => Dependency pom-genom-0.7~openprs+tcl+tclserv_client already installed => Dependency stereopixel-genom-1.3~openprs+tcl+tclserv_client already installed => Dependency tclserv-2.8.1 already installed => Dependency tnftp-20130505~ssl already installed => Dependency transgen-1.1b1 already installed => Dependency velodyne-genom-1.6~openprs+tcl+tclserv_client already installed Warning: the LICENSE of wip/MPC_planner-genom is undefined. => Building with the following options: => Use the GNU C++ compiler: c++-compiler provided by g++>=3 => Use the GNU C compiler: c-compiler provided by gcc>=3 => Use tcl-8.6: tcl>=8.4 provided by tcl86>=8.6<8.7 => Required system package autoconf>=2.59: autoconf-2.69 found => Required system package g++>=3: g++-4.9.2 found => Required system package gcc>=3: gcc-4.9.2 found => Required system package glu>=7: glu-9.0.0 found => Required system package libstdc++: libstdc++ found => Required system package libtool>=1.5.22: libtool-2.4.2 found => Required system package mesa>=6.5: mesa-10.3.2 found => Required system package perl>=5: perl-5 found => Required system package pkg-config>=0.22: pkg-config-0.28 found => Required system package tcl86>=8.6<8.7: tcl86-8.6 found => Required robotpkg package MPC>=1.0: MPC-1.0r2 found => Required robotpkg package dtm-genom>=1.3: dtm-genom-1.5~openprs+tcl+tclserv_client found => Required robotpkg package genBasic-genom>=0.1: genBasic-genom-0.4r1~openprs+tcl+tclserv_client found => Required robotpkg package genPos-genom>=0.1: genPos-genom-0.3r1~openprs+tcl+tclserv_client found => Required robotpkg package genom>=2.9: genom-2.12~doc found => Required robotpkg package libt3d>=2.6: libt3d-2.6~doc found => Required robotpkg package libtclserv_client>=0.3: libtclserv_client-0.5r1 found => Required robotpkg package mkdep>=2.6: mkdep-2.7r1 found => Required robotpkg package pocolibs>=2.11: pocolibs-2.15 found => Required robotpkg package pom-genom>=0.5r1: pom-genom-0.7~openprs+tcl+tclserv_client found => Required robotpkg package stereopixel-genom>=1.2: stereopixel-genom-1.3~openprs+tcl+tclserv_client found => Required robotpkg package tclserv>=2.7: tclserv-2.8.1 found => Required robotpkg package transgen>=1.1b0: transgen-1.1b1 found => Required robotpkg package velodyne-genom>=1.6: velodyne-genom-1.6~openprs+tcl+tclserv_client found Warning: the LICENSE of wip/MPC_planner-genom is undefined. Warning: the LICENSE of wip/MPC_planner-genom is undefined. Warning: the LICENSE of wip/MPC_planner-genom is undefined. => SHA1 checksums OK => RMD160 checksums OK => Applying robotpkg patches for MPC_planner-genom-0.2r1~openprs+tcl+tclserv_client => Generating MPC_planner module => Modifying GNU configure scripts to avoid --recheck Warning: the LICENSE of wip/MPC_planner-genom is undefined. => Adding run-time search paths to pkg-config files => Registering installation for MPC_planner-genom-0.2r1~openprs+tcl+tclserv_client => Linking package in /opt/robotpkg/var/lib/robotpkg/packages/bsd/Debian-8.2-x86_64/pub Warning: the LICENSE of wip/MPC_planner-genom is undefined. ===> Logging bulk summary for MPC_planner-genom-0.2r1~openprs+tcl+tclserv_client => Checking leftover files => Creating bulk log files => Logging bulk metadata ===> Cleaning temporary files for MPC_planner-genom-0.2r1~openprs+tcl+tclserv_client ===> Done bulk for MPC_planner-genom-0.2r1~openprs+tcl+tclserv_client [25%] Processing wip/soth:soth-2.0.1r1 ===> Bulk building for soth-2.0.1r1 Binary package for soth-2.0.1r1 is up-to-date. [26%] Processing wip/libmove3d-planners:libmove3d-planners-1.4.0 ===> Cleaning temporary files for libmove3d-planners-1.4.0 ===> Bulk building for libmove3d-planners-1.4.0 => Checking for clear installation => Installing digest-20080510.tgz => Installing tnftp-20130505~ssl.tgz => Required robotpkg package digest>=20080510: digest-20080510 found => Required robotpkg package tnftp>=20091122: tnftp-20130505~ssl found => Required system package gzip: gzip-1.6 found => Required system package pax and tar archivers: pax found => Required system package pkg_install>=20110805.7: pkg_install-20110805.7 found WARNING: Cannot check installed version of boost-lib-filesystem WARNING: Cannot check installed version of boost-lib-iostreams WARNING: Cannot check installed version of boost-lib-math WARNING: Cannot check installed version of boost-lib-thread => Dependency digest-20080510 already installed WARNING: Cannot check installed version of libXpm => Installing libmove3d-3.22.0r1.tgz => Installing libmove3d-hri-2.24.tgz => Dependency tnftp-20130505~ssl already installed => Building with no option. => Use the GNU C++ compiler: c++-compiler provided by g++>=3 => Use the GNU C compiler: c-compiler provided by gcc>=3 => Required system package boost-headers>=1.34.1: boost-headers-1.55 found => Required system package boostlib-filesystem{>=1.34.1<1.49,>=1.50}: boost-libs{ found => Required system package boostlib-iostreams{>=1.34.1<1.49,>=1.50}: boost-libs{ found => Required system package boostlib-math{>=1.34.1<1.49,>=1.50}: boost-libs{ found => Required system package boostlib-thread{>=1.34.1<1.49,>=1.50}: boost-libs{ found => Required system package cmake>=2.6: cmake-3.0.2 found => Required system package eigen3>=3.0.0: eigen3-3.2.2 found => Required system package g++>=3: g++-4.9.2 found => Required system package gcc>=3: gcc-4.9.2 found => Required system package glu>=7: glu-9.0.0 found => Required system package libXpm>=3.5.7: libXpm found => Required system package libstdc++: libstdc++ found => Required system package pkg-config>=0.22: pkg-config-0.28 found WARNING: Cannot check installed version of boost-lib-filesystem WARNING: Cannot check installed version of boost-lib-iostreams WARNING: Cannot check installed version of boost-lib-math WARNING: Cannot check installed version of boost-lib-thread WARNING: Cannot check installed version of libXpm => Required robotpkg package libmove3d>=3.22.0: libmove3d-3.22.0r1 found => Required robotpkg package libmove3d-hri>=2.24: libmove3d-hri-2.24 found => SHA1 checksums OK => RMD160 checksums OK An unexpected error occured. The last 10 log lines are shown below. | CMakeLists.txt:284 (PKG_CHECK_MODULES) | | | -- checking for module 'liblog4cxx' | -- found liblog4cxx, version 0.10.0 | -- Found LOG4CXX: /usr/lib/x86_64-linux-gnu/liblog4cxx.so | include dirs: /usr/include;/usr/include/libxml2;/usr/include;/usr/include/eigen3;/usr/include;/opt/openrobots/include;/opt/openrobots/include | -- Configuring incomplete, errors occurred! | See also "/local/robotpkg/var/tmp/robotpkg/wip/libmove3d-planners/work/libmove3d-planners-1.4.0/CMakeFiles/CMakeOutput.log". | See also "/local/robotpkg/var/tmp/robotpkg/wip/libmove3d-planners/work/libmove3d-planners-1.4.0/CMakeFiles/CMakeError.log". For details or bug reports, check the complete log file in: /local/robotpkg/var/tmp/robotpkg/wip/libmove3d-planners/work/configure.log make[3]: *** [do-configure-cmake] Error 1 => Marking libmove3d-planners-1.4.0 as broken make[2]: *** [pkg-check-installed] Error 2 ERROR: make: *** [package] Error 2 ===> Logging bulk summary for libmove3d-planners-1.4.0 => Checking leftover files => Creating bulk log files => Logging bulk metadata ===> Cleaning temporary files for libmove3d-planners-1.4.0 ===> Done bulk for libmove3d-planners-1.4.0 [26%] Processing wip/kukaFri-libs:kukaFri-libs-1.3 ===> Bulk building for kukaFri-libs-1.3 Binary package for kukaFri-libs-1.3 is up-to-date. [27%] Processing wip/talos-ros-controllers:talos-ros-controllers-0.2.9 ===> Cleaning temporary files for talos-ros-controllers-0.2.9 ===> Bulk building for talos-ros-controllers-0.2.9 => Checking for clear installation => Installing digest-20080510.tgz => Installing tnftp-20130505~ssl.tgz => Required robotpkg package digest>=20080510: digest-20080510 found => Required robotpkg package tnftp>=20091122: tnftp-20130505~ssl found => Required system package gzip: gzip-1.6 found => Required system package pax and tar archivers: pax found => Required system package pkg_install>=20110805.7: pkg_install-20110805.7 found => Dependency digest-20080510 already installed => Installing ros-actionlib-1.11.2.tgz => Dependency ros-catkin-0.6.9 already installed => Dependency ros-comm-1.11.20 already installed => Dependency ros-common-msgs-1.11.4 already installed => Installing ros-control-msgs-1.3.1.tgz => Installing ros-control-toolbox-1.13.2r1.tgz => Dependency ros-genmsg-0.5.3 already installed => Installing ros-geometry-1.11.3r1.tgz => Dependency ros-message-generation-0.2.10 already installed => Dependency ros-message-runtime-0.4.12 already installed => Installing ros-pluginlib-1.10.1.tgz => Installing ros-robot-model-1.11.5.tgz => Dependency ros-ros-1.11.4 already installed => Dependency ros-std-msgs-0.5.9 already installed => Installing ros-xacro-1.9.2.tgz => Installing talos-pal-hardware-interfaces-0.0.3.tgz => Dependency talos-ros-control-0.2.9r2 already installed => Dependency tnftp-20130505~ssl already installed => Building with no option. => Use the GNU C++ compiler: c++-compiler provided by g++>=3 => Use the GNU C compiler: c-compiler provided by gcc>=3 => Use python-2.7: python>=2.5<3.6 provided by python27>=2.7<2.8 => Use ros indigo: ros>=groovy ros>=hydro provided by ros-indigo => Required system package boost-headers>=1.34.1: boost-headers-1.55 found => Required system package boostlib-filesystem>=1.34.1: boost-libs-1.55.0 found => Required system package boostlib-iostreams>=1.34.1: boost-libs-1.55.0 found => Required system package boostlib-math>=1.34.1: boost-libs-1.55.0 found => Required system package boostlib-thread>=1.34.1: boost-libs-1.55.0 found => Required system package cmake>=2.8.3: cmake-3.0.2 found => Required system package eigen3>=3.0.0: eigen3-3.2.2 found => Required system package g++>=3: g++-4.9.2 found => Required system package gcc>=3: gcc-4.9.2 found => Required system package googletest: googletest found => Required system package libstdc++: libstdc++ found => Required system package pkg-config>=0.22: pkg-config-0.28 found => Required system package py27-nose>=0.10: py27-nose-1.3.4 found => Required system package python27>=2.7<2.8: python27-2.7.9 found => Required system package tinyxml>=2: tinyxml-2.6.2 found => Required robotpkg package ros-actionlib>=1.11<1.12: ros-actionlib-1.11.2 found => Required robotpkg package ros-catkin>=0.6<0.7: ros-catkin-0.6.9 found => Required robotpkg package ros-comm>=1.11<1.12: ros-comm-1.11.20 found => Required robotpkg package ros-common-msgs>=1.11<1.12: ros-common-msgs-1.11.4 found => Required robotpkg package ros-control-msgs>=1.3<1.4: ros-control-msgs-1.3.1 found => Required robotpkg package ros-control-toolbox>=1.13<1.15: ros-control-toolbox-1.13.2r1 found => Required robotpkg package ros-genmsg>=0.5<0.6: ros-genmsg-0.5.3 found => Required robotpkg package ros-geometry>=1.11<1.12: ros-geometry-1.11.3r1 found => Required robotpkg package ros-message-generation>=0.2<0.3: ros-message-generation-0.2.10 found => Required robotpkg package ros-message-runtime>=0.4<0.5: ros-message-runtime-0.4.12 found => Required robotpkg package ros-pluginlib>=1.10<1.11: ros-pluginlib-1.10.1 found => Required robotpkg package ros-robot-model>=1.11<1.12: ros-robot-model-1.11.5 found => Required robotpkg package ros-ros>=1.11<1.12: ros-ros-1.11.4 found => Required robotpkg package ros-std-msgs>=0.5: ros-std-msgs-0.5.9 found => Required robotpkg package ros-xacro>=1.9<1.10: ros-xacro-1.9.2 found => Required robotpkg package talos-pal-hardware-interfaces>=0.0.2: talos-pal-hardware-interfaces-0.0.3 found => Required robotpkg package talos-ros-control>=0.2: talos-ros-control-0.2.9r2 found => SHA1 checksums OK => RMD160 checksums OK An unexpected error occured. The last 10 log lines are shown below. | "cmake_modules_DIR" to a directory containing one of the above files. If | "cmake_modules" provides a separate development package or SDK, be sure it | has been installed. | Call Stack (most recent call first): | talos_joint_trajectory_controller/CMakeLists.txt:51 (find_package) | | | -- Configuring incomplete, errors occurred! | See also "/local/robotpkg/var/tmp/robotpkg/wip/talos-ros-controllers/work/talos_ros_controllers-0.2.9/build/CMakeFiles/CMakeOutput.log". | See also "/local/robotpkg/var/tmp/robotpkg/wip/talos-ros-controllers/work/talos_ros_controllers-0.2.9/build/CMakeFiles/CMakeError.log". For details or bug reports, check the complete log file in: /local/robotpkg/var/tmp/robotpkg/wip/talos-ros-controllers/work/configure.log make[3]: *** [do-configure-cmake] Error 1 make[2]: *** [pkg-check-installed] Error 2 => Marking talos-ros-controllers-0.2.9 as broken ERROR: make: *** [package] Error 2 ===> Logging bulk summary for talos-ros-controllers-0.2.9 => Checking leftover files => Creating bulk log files => Logging bulk metadata ===> Cleaning temporary files for talos-ros-controllers-0.2.9 ===> Done bulk for talos-ros-controllers-0.2.9 [27%] Processing wip/orocos-bfl:orocos-bfl-0.8.0 ===> Bulk building for orocos-bfl-0.8.0 Binary package for orocos-bfl-0.8.0 is up-to-date. [28%] Processing wip/laaswm-gui:laaswm-gui-1.4 ===> Bulk building for laaswm-gui-1.4 Binary package for laaswm-gui-1.4 is up-to-date. [28%] Processing wip/osg-dae:osg-dae-3.2.0 ===> Cleaning temporary files for osg-dae-3.2.0 ===> Bulk building for osg-dae-3.2.0 => Checking for clear installation => Installing digest-20080510.tgz => Installing tnftp-20130505~ssl.tgz => Required robotpkg package digest>=20080510: digest-20080510 found => Required robotpkg package tnftp>=20091122: tnftp-20130505~ssl found => Required system package gzip: gzip-1.6 found => Required system package pax and tar archivers: pax found => Required system package pkg_install>=20110805.7: pkg_install-20110805.7 found => Dependency digest-20080510 already installed => Dependency tnftp-20130505~ssl already installed => Building with no option. => Use the GNU C++ compiler: c++-compiler provided by g++>=3 => Use the GNU C compiler: c-compiler provided by gcc>=3 => Required system package boost-headers>=1.34.1: boost-headers-1.55 found => Required system package boostlib-filesystem>=1.34.1: boost-libs-1.55.0 found => Required system package boostlib-system>=1.34.1: boost-libs-1.55.0 found => Required system package cmake>=2.6: cmake-3.0.2 found => Required system package doxygen>=1.5: doxygen-1.8.8 found => Required system package g++>=3: g++-4.9.2 found => Required system package gcc>=3: gcc-4.9.2 found => Required system package libstdc++: libstdc++ found => Required system package pkg-config>=0.22: pkg-config-0.28 found => SHA1 checksums OK => RMD160 checksums OK An unexpected error occured. The last 10 log lines are shown below. | /usr/share/cmake-3.0/Modules/FindPkgConfig.cmake:395 (_pkg_check_modules_internal) | cmake/pkg-config.cmake:273 (PKG_CHECK_MODULES) | cmake/pkg-config.cmake:438 (ADD_DEPENDENCY) | CMakeLists.txt:61 (ADD_REQUIRED_DEPENDENCY) | | | -- **** Collada not found, not compiling DAE | -- Doxygen rendering: using LaTeX backend | -- Configuring incomplete, errors occurred! | See also "/local/robotpkg/var/tmp/robotpkg/wip/osg-dae/work/osg-dae-3.2.0/CMakeFiles/CMakeOutput.log". For details or bug reports, check the complete log file in: /local/robotpkg/var/tmp/robotpkg/wip/osg-dae/work/configure.log make[3]: *** [do-configure-cmake] Error 1 make[2]: *** [pkg-check-installed] Error 2 => Marking osg-dae-3.2.0 as broken ERROR: make: *** [package] Error 2 ===> Logging bulk summary for osg-dae-3.2.0 => Checking leftover files => Creating bulk log files => Logging bulk metadata ===> Cleaning temporary files for osg-dae-3.2.0 ===> Done bulk for osg-dae-3.2.0 [28%] Processing wip/morse-pocolibs:morse-pocolibs-1.4 ===> Bulk building for morse-pocolibs-1.4 Binary package for morse-pocolibs-1.4 is up-to-date. [29%] Processing wip/py-jsbsim:py27-jsbsim-20150424r1 ===> Cleaning temporary files for py27-jsbsim-20150424r1 ===> Bulk building for py27-jsbsim-20150424r1 => Checking for clear installation => Installing digest-20080510.tgz => Installing tnftp-20130505~ssl.tgz => Required robotpkg package digest>=20080510: digest-20080510 found => Required robotpkg package tnftp>=20091122: tnftp-20130505~ssl found => Required system package cvs>=1: cvs-1.12.1311 found => Required system package gzip: gzip-1.6 found => Required system package pax and tar archivers: pax found => Required system package pkg_install>=20110805.7: pkg_install-20110805.7 found => Dependency digest-20080510 already installed => Installing jsbsim-20150424.tgz => Dependency tnftp-20130505~ssl already installed => Building with no option. => Use the GNU C++ compiler: c++-compiler provided by g++>=3 => Use the GNU C compiler: c-compiler provided by gcc>=3 => Use python-2.7: python>=2.5<3.6 provided by python27>=2.7<2.8 => Required system package cmake>=2.6: cmake-3.0.2 found => Required system package g++>=3: g++-4.9.2 found => Required system package gcc>=3: gcc-4.9.2 found => Required system package libstdc++: libstdc++ found => Required system package python27>=2.7<2.8: python27-2.7.9 found => Required robotpkg package jsbsim>=1.0: jsbsim-20150424 found => SHA1 checksums OK => RMD160 checksums OK An unexpected error occured. The last 10 log lines are shown below. | -- Configuring incomplete, errors occurred! | See also "/local/robotpkg/var/tmp/robotpkg/wip/py-jsbsim/work/jsbsim-20150424/tests/CMakeFiles/CMakeOutput.log". | Could NOT find Cython (missing: CYTHON_EXECUTABLE) | Call Stack (most recent call first): | /usr/share/cmake-3.0/Modules/FindPackageHandleStandardArgs.cmake:343 (_FPHSA_FAILURE_MESSAGE) | CMakeModules/FindCython.cmake:42 (FIND_PACKAGE_HANDLE_STANDARD_ARGS) | CMakeModules/UseCython.cmake:74 (find_package) | CMakeLists.txt:6 (include) | | For details or bug reports, check the complete log file in: /local/robotpkg/var/tmp/robotpkg/wip/py-jsbsim/work/configure.log make[3]: *** [do-configure-cmake] Error 1 make[2]: *** [pkg-check-installed] Error 2 => Marking py27-jsbsim-20150424r1 as broken ERROR: make: *** [package] Error 2 ===> Logging bulk summary for py27-jsbsim-20150424r1 => Checking leftover files => Creating bulk log files => Logging bulk metadata ===> Cleaning temporary files for py27-jsbsim-20150424r1 ===> Done bulk for py27-jsbsim-20150424r1 [29%] Processing wip/py-jsbsim:py34-jsbsim-20150424r1 ===> Cleaning temporary files for py34-jsbsim-20150424r1 ===> Bulk building for py34-jsbsim-20150424r1 => Checking for clear installation => Installing digest-20080510.tgz => Installing tnftp-20130505~ssl.tgz => Required robotpkg package digest>=20080510: digest-20080510 found => Required robotpkg package tnftp>=20091122: tnftp-20130505~ssl found => Required system package cvs>=1: cvs-1.12.1311 found => Required system package gzip: gzip-1.6 found => Required system package pax and tar archivers: pax found => Required system package pkg_install>=20110805.7: pkg_install-20110805.7 found => Dependency digest-20080510 already installed => Installing jsbsim-20150424.tgz => Dependency tnftp-20130505~ssl already installed => Building with no option. => Use the GNU C++ compiler: c++-compiler provided by g++>=3 => Use the GNU C compiler: c-compiler provided by gcc>=3 => Use python-3.4: python>=2.5<3.6 provided by python34>=3.4<3.5 => Required system package cmake>=2.6: cmake-3.0.2 found => Required system package g++>=3: g++-4.9.2 found => Required system package gcc>=3: gcc-4.9.2 found => Required system package libstdc++: libstdc++ found => Required system package python34>=3.4<3.5: python34-3.4.2 found => Required robotpkg package jsbsim>=1.0: jsbsim-20150424 found => SHA1 checksums OK => RMD160 checksums OK An unexpected error occured. The last 10 log lines are shown below. | Could NOT find Cython (missing: CYTHON_EXECUTABLE) | Call Stack (most recent call first): | /usr/share/cmake-3.0/Modules/FindPackageHandleStandardArgs.cmake:343 (_FPHSA_FAILURE_MESSAGE) | CMakeModules/FindCython.cmake:42 (FIND_PACKAGE_HANDLE_STANDARD_ARGS) | CMakeModules/UseCython.cmake:74 (find_package) | CMakeLists.txt:6 (include) | | | -- Configuring incomplete, errors occurred! | See also "/local/robotpkg/var/tmp/robotpkg/wip/py-jsbsim/work/jsbsim-20150424/tests/CMakeFiles/CMakeOutput.log". For details or bug reports, check the complete log file in: /local/robotpkg/var/tmp/robotpkg/wip/py-jsbsim/work/configure.log make[3]: *** [do-configure-cmake] Error 1 => Marking py34-jsbsim-20150424r1 as broken make[2]: *** [pkg-check-installed] Error 2 ERROR: make: *** [package] Error 2 ===> Logging bulk summary for py34-jsbsim-20150424r1 => Checking leftover files => Creating bulk log files => Logging bulk metadata ===> Cleaning temporary files for py34-jsbsim-20150424r1 ===> Done bulk for py34-jsbsim-20150424r1 [30%] Processing wip/msgconnector:msgconnector-2.13.0 ===> Bulk building for msgconnector-2.13.0~bridge-print+liboro+openprs+yarp Binary package for msgconnector-2.13.0~bridge-print+liboro+openprs+yarp is up-to-date. [30%] Processing wip/gladys:gladys-0.2.8 ===> Cleaning temporary files for gladys-0.2.8~python ===> Bulk building for gladys-0.2.8~python => Checking for clear installation => Installing digest-20080510.tgz => Installing tnftp-20130505~ssl.tgz => Required robotpkg package digest>=20080510: digest-20080510 found => Required robotpkg package tnftp>=20091122: tnftp-20130505~ssl found => Required system package gzip: gzip-1.6 found => Required system package pax and tar archivers: pax found => Required system package pkg_install>=20110805.7: pkg_install-20110805.7 found => Dependency digest-20080510 already installed => Required robotpkg package gdalwrap>=0.1: N/A => Dependency tnftp-20130505~ssl already installed ===> Logging bulk summary for gladys-0.2.8~python => Checking leftover files => Creating bulk log files => Logging bulk metadata ===> Cleaning temporary files for gladys-0.2.8~python ===> Done bulk for gladys-0.2.8~python [31%] Processing wip/lua-rfsm:lua-rfsm-20131212.44fcec2db5r2 ===> Bulk building for lua-rfsm-20131212.44fcec2db5r2 Binary package for lua-rfsm-20131212.44fcec2db5r2 is up-to-date. [31%] Processing wip/roralink:roralink-0.1 ===> Bulk building for roralink-0.1 Binary package for roralink-0.1 is up-to-date. [32%] Processing wip/morse-mavlink:morse-mavlink-1.4 ===> Cleaning temporary files for morse-mavlink-1.4 ===> Bulk building for morse-mavlink-1.4 => Checking for clear installation => Installing digest-20080510.tgz => Installing tnftp-20130505~ssl.tgz => Required robotpkg package digest>=20080510: digest-20080510 found => Required robotpkg package tnftp>=20091122: tnftp-20130505~ssl found => Required system package gzip: gzip-1.6 found => Required system package patch>=2.0: patch-2.7.5 found => Required system package pax and tar archivers: pax found => Required system package pkg_install>=20110805.7: pkg_install-20110805.7 found => Dependency digest-20080510 already installed => Installing mavlink-20150929.tgz => Installing morse-1.4~doc.tgz ERROR: Required robotpkg package py34-mavlink>=1.1.62: BROKEN => Dependency tnftp-20130505~ssl already installed ===> Logging bulk summary for morse-mavlink-1.4 => Checking leftover files => Creating bulk log files => Logging bulk metadata ===> Cleaning temporary files for morse-mavlink-1.4 ===> Done bulk for morse-mavlink-1.4 [32%] Processing wip/antlr2:antlr2-2.7.7 ===> Bulk building for antlr2-2.7.7 Binary package for antlr2-2.7.7 is up-to-date. [33%] Processing wip/libfreenect:libfreenect-20110118.2ea3ebr1 ===> Bulk building for libfreenect-20110118.2ea3ebr1 Binary package for libfreenect-20110118.2ea3ebr1 is up-to-date. [33%] Processing wip/robotModelParser-libs:robotModelParser-libs-1.0 ===> Bulk building for robotModelParser-libs-1.0 Binary package for robotModelParser-libs-1.0 is up-to-date. [33%] Processing wip/py-flann:py27-flann-1.7.1 ===> Cleaning temporary files for py27-flann-1.7.1 ===> Bulk building for py27-flann-1.7.1 => Checking for clear installation => Installing digest-20080510.tgz => Installing tnftp-20130505~ssl.tgz => Required robotpkg package digest>=20080510: digest-20080510 found => Required robotpkg package tnftp>=20091122: tnftp-20130505~ssl found => Required system package gzip: gzip-1.6 found => Required system package patch>=2.0: patch-2.7.5 found => Required system package pkg_install>=20110805.7: pkg_install-20110805.7 found => Required system package unzip: unzip found => Dependency digest-20080510 already installed => Installing flann-1.7.1.tgz => Dependency tnftp-20130505~ssl already installed => Building with no option. => Use the GNU C++ compiler: c++-compiler provided by g++>=3 => Use the GNU C compiler: c-compiler provided by gcc>=3 => Use python-2.7: python>=2.5<3.6 provided by python27>=2.7<2.8 => Required system package cmake>=2.6: cmake-3.0.2 found => Required system package g++>=3: g++-4.9.2 found => Required system package gcc>=3: gcc-4.9.2 found => Required system package libstdc++: libstdc++ found => Required system package python27>=2.7<2.8: python27-2.7.9 found => Required robotpkg package flann>=1.7: flann-1.7.1 found => SHA1 checksums OK => RMD160 checksums OK => Applying robotpkg patches for py27-flann-1.7.1 An unexpected error occured. The last 10 log lines are shown below. | | -- Install prefix: /opt/openrobots | -- Build type: Release | -- Building C bindings: OFF | -- Building python bindings: ON | -- Building matlab bindings: OFF | -- Building CUDA library: OFF | -- Using MPI support: OFF | -- Configuring incomplete, errors occurred! | See also "/local/robotpkg/var/tmp/robotpkg/wip/py-flann/work/flann-1.7.1-src/CMakeFiles/CMakeOutput.log". For details or bug reports, check the complete log file in: /local/robotpkg/var/tmp/robotpkg/wip/py-flann/work/configure.log make[3]: *** [do-configure-cmake] Error 1 make[2]: *** [pkg-check-installed] Error 2 => Marking py27-flann-1.7.1 as broken ERROR: make: *** [package] Error 2 ===> Logging bulk summary for py27-flann-1.7.1 => Checking leftover files => Creating bulk log files => Logging bulk metadata ===> Cleaning temporary files for py27-flann-1.7.1 ===> Done bulk for py27-flann-1.7.1 [34%] Processing wip/py-flann:py34-flann-1.7.1 ===> Cleaning temporary files for py34-flann-1.7.1 ===> Bulk building for py34-flann-1.7.1 => Checking for clear installation => Installing digest-20080510.tgz => Installing tnftp-20130505~ssl.tgz => Required robotpkg package digest>=20080510: digest-20080510 found => Required robotpkg package tnftp>=20091122: tnftp-20130505~ssl found => Required system package gzip: gzip-1.6 found => Required system package patch>=2.0: patch-2.7.5 found => Required system package pkg_install>=20110805.7: pkg_install-20110805.7 found => Required system package unzip: unzip found => Dependency digest-20080510 already installed => Installing flann-1.7.1.tgz => Dependency tnftp-20130505~ssl already installed => Building with no option. => Use the GNU C++ compiler: c++-compiler provided by g++>=3 => Use the GNU C compiler: c-compiler provided by gcc>=3 => Use python-3.4: python>=2.5<3.6 provided by python34>=3.4<3.5 => Required system package cmake>=2.6: cmake-3.0.2 found => Required system package g++>=3: g++-4.9.2 found => Required system package gcc>=3: gcc-4.9.2 found => Required system package libstdc++: libstdc++ found => Required system package python34>=3.4<3.5: python34-3.4.2 found => Required robotpkg package flann>=1.7: flann-1.7.1 found => SHA1 checksums OK => RMD160 checksums OK => Applying robotpkg patches for py34-flann-1.7.1 An unexpected error occured. The last 10 log lines are shown below. | | -- Install prefix: /opt/openrobots | -- Build type: Release | -- Building C bindings: OFF | -- Building python bindings: ON | -- Building matlab bindings: OFF | -- Building CUDA library: OFF | -- Using MPI support: OFF | -- Configuring incomplete, errors occurred! | See also "/local/robotpkg/var/tmp/robotpkg/wip/py-flann/work/flann-1.7.1-src/CMakeFiles/CMakeOutput.log". For details or bug reports, check the complete log file in: /local/robotpkg/var/tmp/robotpkg/wip/py-flann/work/configure.log make[3]: *** [do-configure-cmake] Error 1 make[2]: *** [pkg-check-installed] Error 2 => Marking py34-flann-1.7.1 as broken ERROR: make: *** [package] Error 2 ===> Logging bulk summary for py34-flann-1.7.1 => Checking leftover files => Creating bulk log files => Logging bulk metadata ===> Cleaning temporary files for py34-flann-1.7.1 ===> Done bulk for py34-flann-1.7.1 [34%] Processing wip/orocos-yarp_transport:orocos-yarp_transport-20150316 ===> Bulk building for orocos-yarp_transport-20150316~doc Binary package for orocos-yarp_transport-20150316~doc is up-to-date. [35%] Processing wip/atlaas:atlaas-0.1.6 ===> Cleaning temporary files for atlaas-0.1.6 ===> Bulk building for atlaas-0.1.6 => Checking for clear installation => Installing digest-20080510.tgz => Installing tnftp-20130505~ssl.tgz => Required robotpkg package digest>=20080510: digest-20080510 found => Required robotpkg package tnftp>=20091122: tnftp-20130505~ssl found => Required system package gzip: gzip-1.6 found => Required system package pax and tar archivers: pax found => Required system package pkg_install>=20110805.7: pkg_install-20110805.7 found => Dependency digest-20080510 already installed => Required robotpkg package gdalwrap>=0.1: N/A => Dependency tnftp-20130505~ssl already installed ===> Logging bulk summary for atlaas-0.1.6 => Checking leftover files => Creating bulk log files => Logging bulk metadata ===> Cleaning temporary files for atlaas-0.1.6 ===> Done bulk for atlaas-0.1.6 [35%] Processing wip/talos-robot:talos-robot-0.0.14 ===> Bulk building for talos-robot-0.0.14 Binary package for talos-robot-0.0.14 is up-to-date. [36%] Processing wip/oro-view:oro-view-1.0.1 ===> Cleaning temporary files for oro-view-1.0.1 ===> Bulk building for oro-view-1.0.1 => Checking for clear installation => Installing digest-20080510.tgz => Installing tnftp-20130505~ssl.tgz => Required robotpkg package digest>=20080510: digest-20080510 found => Required robotpkg package tnftp>=20091122: tnftp-20130505~ssl found => Required system package gzip: gzip-1.6 found => Required system package patch>=2.0: patch-2.7.5 found => Required system package pax and tar archivers: pax found => Required system package pkg_install>=20110805.7: pkg_install-20110805.7 found => Dependency digest-20080510 already installed => Installing jsoncpp-0.5.0~doc.tgz => Installing liboro-1.1r1~doc.tgz => Dependency tnftp-20130505~ssl already installed => Building with no option. => Use the GNU C++ compiler: c++-compiler provided by g++>=3 => Use the GNU C compiler: c-compiler provided by gcc>=3 => Required system package SDL>=1.2: SDL-1.2.15 found => Required system package SDL_image>=1.2: SDL_image-1.2.12 found => Required system package ftgl>=2: ftgl-2.1.35 found => Required system package g++>=3: g++-4.9.2 found => Required system package gcc>=3: gcc-4.9.2 found => Required system package libstdc++: libstdc++ found => Required system package pkg-config>=0.22: pkg-config-0.28 found => Required robotpkg package jsoncpp>=0.5.0: jsoncpp-0.5.0~doc found => Required robotpkg package liboro>=1.0: liboro-1.1r1~doc found => SHA1 checksums OK => RMD160 checksums OK => Applying robotpkg patches for oro-view-1.0.1 => Modifying GNU configure scripts to avoid --recheck An unexpected error occured. The last 10 log lines are shown below. | depbase=`echo src/spline.o | sed 's|[^/]*$|.deps/&|;s|.o$||'`;/usr/bin/g++ -DPACKAGE_NAME="oro-view" -DPACKAGE_TARNAME="oro-view" -DPACKAGE_VERSION="1.0.1" -DPACKAGE_STRING="oro-view 1.0.1" -DPACKAGE_BUGREPORT="severin.lemaignan@laas.fr" -DPACKAGE_URL="" -DPACKAGE="oro-view" -DVERSION="1.0.1" -DHAVE_PTHREAD=1 -DSTDC_HEADERS=1 -DHAVE_SYS_TYPES_H=1 -DHAVE_SYS_STAT_H=1 -DHAVE_STDLIB_H=1 -DHAVE_STRING_H=1 -DHAVE_MEMORY_H=1 -DHAVE_STRINGS_H=1 -DHAVE_INTTYPES_H=1 -DHAVE_STDINT_H=1 -DHAVE_UNISTD_H=1 -DHAVE_GL_GL_H=1 -DHAVE_GL_GLU_H=1 -I. -DSDLAPP_RESOURCE_DIR="/opt/openrobots/share/oro-view" -pipe -O3 -DNDEBUG -pthread -I/usr/include/SDL -D_GNU_SOURCE=1 -D_REENTRANT -I/usr/include/FTGL -I/usr/include/freetype2 -pthread -I/opt/openrobots/include/liboro -I/opt/openrobots/include -MT src/spline.o -MD -MP -MF $depbase.Tpo -c -o src/spline.o src/spline.cpp &&mv -f $depbase.Tpo $depbase.Po | depbase=`echo src/styles.o | sed 's|[^/]*$|.deps/&|;s|.o$||'`;/usr/bin/g++ -DPACKAGE_NAME="oro-view" -DPACKAGE_TARNAME="oro-view" -DPACKAGE_VERSION="1.0.1" -DPACKAGE_STRING="oro-view 1.0.1" -DPACKAGE_BUGREPORT="severin.lemaignan@laas.fr" -DPACKAGE_URL="" -DPACKAGE="oro-view" -DVERSION="1.0.1" -DHAVE_PTHREAD=1 -DSTDC_HEADERS=1 -DHAVE_SYS_TYPES_H=1 -DHAVE_SYS_STAT_H=1 -DHAVE_STDLIB_H=1 -DHAVE_STRING_H=1 -DHAVE_MEMORY_H=1 -DHAVE_STRINGS_H=1 -DHAVE_INTTYPES_H=1 -DHAVE_STDINT_H=1 -DHAVE_UNISTD_H=1 -DHAVE_GL_GL_H=1 -DHAVE_GL_GLU_H=1 -I. -DSDLAPP_RESOURCE_DIR="/opt/openrobots/share/oro-view" -pipe -O3 -DNDEBUG -pthread -I/usr/include/SDL -D_GNU_SOURCE=1 -D_REENTRANT -I/usr/include/FTGL -I/usr/include/freetype2 -pthread -I/opt/openrobots/include/liboro -I/opt/openrobots/include -MT src/styles.o -MD -MP -MF $depbase.Tpo -c -o src/styles.o src/styles.cpp &&mv -f $depbase.Tpo $depbase.Po | depbase=`echo src/graph.o | sed 's|[^/]*$|.deps/&|;s|.o$||'`;/usr/bin/g++ -DPACKAGE_NAME="oro-view" -DPACKAGE_TARNAME="oro-view" -DPACKAGE_VERSION="1.0.1" -DPACKAGE_STRING="oro-view 1.0.1" -DPACKAGE_BUGREPORT="severin.lemaignan@laas.fr" -DPACKAGE_URL="" -DPACKAGE="oro-view" -DVERSION="1.0.1" -DHAVE_PTHREAD=1 -DSTDC_HEADERS=1 -DHAVE_SYS_TYPES_H=1 -DHAVE_SYS_STAT_H=1 -DHAVE_STDLIB_H=1 -DHAVE_STRING_H=1 -DHAVE_MEMORY_H=1 -DHAVE_STRINGS_H=1 -DHAVE_INTTYPES_H=1 -DHAVE_STDINT_H=1 -DHAVE_UNISTD_H=1 -DHAVE_GL_GL_H=1 -DHAVE_GL_GLU_H=1 -I. -DSDLAPP_RESOURCE_DIR="/opt/openrobots/share/oro-view" -pipe -O3 -DNDEBUG -pthread -I/usr/include/SDL -D_GNU_SOURCE=1 -D_REENTRANT -I/usr/include/FTGL -I/usr/include/freetype2 -pthread -I/opt/openrobots/include/liboro -I/opt/openrobots/include -MT src/graph.o -MD -MP -MF $depbase.Tpo -c -o src/graph.o src/graph.cpp &&mv -f $depbase.Tpo $depbase.Po | depbase=`echo src/zoomcamera.o | sed 's|[^/]*$|.deps/&|;s|.o$||'`;/usr/bin/g++ -DPACKAGE_NAME="oro-view" -DPACKAGE_TARNAME="oro-view" -DPACKAGE_VERSION="1.0.1" -DPACKAGE_STRING="oro-view 1.0.1" -DPACKAGE_BUGREPORT="severin.lemaignan@laas.fr" -DPACKAGE_URL="" -DPACKAGE="oro-view" -DVERSION="1.0.1" -DHAVE_PTHREAD=1 -DSTDC_HEADERS=1 -DHAVE_SYS_TYPES_H=1 -DHAVE_SYS_STAT_H=1 -DHAVE_STDLIB_H=1 -DHAVE_STRING_H=1 -DHAVE_MEMORY_H=1 -DHAVE_STRINGS_H=1 -DHAVE_INTTYPES_H=1 -DHAVE_STDINT_H=1 -DHAVE_UNISTD_H=1 -DHAVE_GL_GL_H=1 -DHAVE_GL_GLU_H=1 -I. -DSDLAPP_RESOURCE_DIR="/opt/openrobots/share/oro-view" -pipe -O3 -DNDEBUG -pthread -I/usr/include/SDL -D_GNU_SOURCE=1 -D_REENTRANT -I/usr/include/FTGL -I/usr/include/freetype2 -pthread -I/opt/openrobots/include/liboro -I/opt/openrobots/include -MT src/zoomcamera.o -MD -MP -MF $depbase.Tpo -c -o src/zoomcamera.o src/zoomcamera.cpp &&mv -f $depbase.Tpo $depbase.Po | /usr/bin/g++ -pipe -O3 -DNDEBUG -pthread -I/usr/include/SDL -D_GNU_SOURCE=1 -D_REENTRANT -I/usr/include/FTGL -I/usr/include/freetype2 -pthread -I/opt/openrobots/include/liboro -I/opt/openrobots/include -o oroview src/core/camera.o src/core/display.o src/core/extensions.o src/core/frustum.o src/core/fxfont.o src/core/logger.o src/core/plane.o src/core/quadtree.o src/core/resource.o src/core/sdlapp.o src/core/seeklog.o src/core/stringhash.o src/core/texture.o src/node.o src/node_renderer.o src/node_relation.o src/oro_connector.o src/oroview.o src/main.o src/edge.o src/edge_renderer.o src/spline.o src/styles.o src/graph.o src/zoomcamera.o -lGLU -lGL -lm -L/usr/lib/x86_64-linux-gnu -lSDL -lftgl -L/opt/openrobots/lib -loro -ljson -lSDL_image | /usr/bin/ld: src/node.o: undefined reference to symbol '_ZN5boost6system15system_categoryEv' | //usr/lib/x86_64-linux-gnu/libboost_system.so.1.55.0: error adding symbols: DSO missing from command line | collect2: error: ld returned 1 exit status | Makefile:432: recipe for target 'oroview' failed | make: *** [oroview] Error 1 For details or bug reports, check the complete log file in: /local/robotpkg/var/tmp/robotpkg/wip/oro-view/work/build.log make[3]: *** [do-build] Error 2 => Marking oro-view-1.0.1 as broken make[2]: *** [pkg-check-installed] Error 2 ERROR: make: *** [package] Error 2 ===> Logging bulk summary for oro-view-1.0.1 => Checking leftover files => Creating bulk log files => Logging bulk metadata ===> Cleaning temporary files for oro-view-1.0.1 ===> Done bulk for oro-view-1.0.1 [36%] Processing wip/gest-genom:gest-genom-1.0r1 ===> Cleaning temporary files for gest-genom-1.0r1~openprs+tcl+tclserv_client ===> Bulk building for gest-genom-1.0r1~openprs+tcl+tclserv_client => Checking for clear installation => Installing digest-20080510.tgz => Installing tnftp-20130505~ssl.tgz => Required robotpkg package digest>=20080510: digest-20080510 found => Required robotpkg package tnftp>=20091122: tnftp-20130505~ssl found => Required system package gzip: gzip-1.6 found => Required system package patch>=2.0: patch-2.7.5 found => Required system package pax and tar archivers: pax found => Required system package pkg_install>=20110805.7: pkg_install-20110805.7 found => Dependency digest-20080510 already installed => Installing genom-2.12~doc.tgz => Installing libt3d-2.6~doc.tgz => Installing libtclserv_client-0.5r1.tgz => Installing mkdep-2.7r1.tgz => Dependency pocolibs-2.15 already installed => Installing pom-genom-0.7~openprs+tcl+tclserv_client.tgz => Dependency tclserv-2.8.1 already installed => Dependency tnftp-20130505~ssl already installed => Dependency transgen-1.1b1 already installed => Installing viam-genom-1.10~display+openprs+tcl+tclserv_client.tgz => Dependency viam-libs-1.12~doc+opencv already installed => Building with the following options: => Use the GNU C++ compiler: c++-compiler provided by g++>=3 => Use the GNU C compiler: c-compiler provided by gcc>=3 => Use tcl-8.6: tcl>=8.4 provided by tcl86>=8.6<8.7 => Required system package autoconf>=2.59: autoconf-2.69 found => Required system package g++>=3: g++-4.9.2 found => Required system package gcc>=3: gcc-4.9.2 found => Required system package libstdc++: libstdc++ found => Required system package libtool>=1.5.22: libtool-2.4.2 found => Required system package opencv>=2.2.0: opencv-2.4.9.1 found => Required system package perl>=5: perl-5 found => Required system package pkg-config>=0.22: pkg-config-0.28 found => Required system package tcl86>=8.6<8.7: tcl86-8.6 found => Required robotpkg package genom>=2.9: genom-2.12~doc found => Required robotpkg package libt3d>=2.6: libt3d-2.6~doc found => Required robotpkg package libtclserv_client>=0.3: libtclserv_client-0.5r1 found => Required robotpkg package mkdep>=2.6: mkdep-2.7r1 found => Required robotpkg package pocolibs>=2.11: pocolibs-2.15 found => Required robotpkg package pom-genom>=0.5r1: pom-genom-0.7~openprs+tcl+tclserv_client found => Required robotpkg package tclserv>=2.7: tclserv-2.8.1 found => Required robotpkg package transgen>=1.1b0: transgen-1.1b1 found => Required robotpkg package viam-genom>=1.6: viam-genom-1.10~display+openprs+tcl+tclserv_client found => Required robotpkg package viam-libs>=1.12: viam-libs-1.12~doc+opencv found => SHA1 checksums OK => RMD160 checksums OK => Applying robotpkg patches for gest-genom-1.0r1~openprs+tcl+tclserv_client => Generating gest module => Modifying GNU configure scripts to avoid --recheck An unexpected error occured. The last 10 log lines are shown below. | make[3]: Leaving directory '/local/robotpkg/var/tmp/robotpkg/wip/gest-genom/work/gest-genom-1.0/code' | Makefile:7: recipe for target 'genom' failed | make[2]: Leaving directory '/local/robotpkg/var/tmp/robotpkg/wip/gest-genom/work/gest-genom-1.0/code' | make[3]: *** [dox] Error 2 | make[2]: *** [genom] Error 2 | make[1]: *** [all-posix] Error 2 | make: *** [all] Error 2 | Makefile:70: recipe for target 'all-posix' failed | make[1]: Leaving directory '/local/robotpkg/var/tmp/robotpkg/wip/gest-genom/work/gest-genom-1.0' | Makefile:37: recipe for target 'all' failed For details or bug reports, check the complete log file in: /local/robotpkg/var/tmp/robotpkg/wip/gest-genom/work/build.log make[3]: *** [do-build] Error 2 make[2]: *** [pkg-check-installed] Error 2 => Marking gest-genom-1.0r1~openprs+tcl+tclserv_client as broken ERROR: make: *** [package] Error 2 ===> Logging bulk summary for gest-genom-1.0r1~openprs+tcl+tclserv_client => Checking leftover files => Creating bulk log files => Logging bulk metadata ===> Cleaning temporary files for gest-genom-1.0r1~openprs+tcl+tclserv_client ===> Done bulk for gest-genom-1.0r1~openprs+tcl+tclserv_client [37%] Processing wip/libnabo:libnabo-1.0.4 ===> Bulk building for libnabo-1.0.4 Binary package for libnabo-1.0.4 is up-to-date. [37%] Processing wip/py-dynamic-graph-v3:py27-dynamic-graph-v3-3.0.2 ===> Bulk building for py27-dynamic-graph-v3-3.0.2 Binary package for py27-dynamic-graph-v3-3.0.2 is up-to-date. [38%] Processing wip/hatponboard-lib:hatponboard-lib-3.4.0 ===> Bulk building for hatponboard-lib-3.4.0~enable-goal Binary package for hatponboard-lib-3.4.0~enable-goal is up-to-date. [38%] Processing wip/talos-gazebo-ros-control:talos-gazebo-ros-control-2.6.5 ===> Cleaning temporary files for talos-gazebo-ros-control-2.6.5 ===> Bulk building for talos-gazebo-ros-control-2.6.5 => Checking for clear installation => Installing digest-20080510.tgz => Installing tnftp-20130505~ssl.tgz => Required robotpkg package digest>=20080510: digest-20080510 found => Required robotpkg package tnftp>=20091122: tnftp-20130505~ssl found => Required system package gzip: gzip-1.6 found => Required system package pax and tar archivers: pax found => Required system package pkg_install>=20110805.7: pkg_install-20110805.7 found => Dependency digest-20080510 already installed => Installing ros-actionlib-1.11.2.tgz => Dependency ros-catkin-0.6.9 already installed => Dependency ros-comm-1.11.20 already installed => Dependency ros-common-msgs-1.11.4 already installed => Installing ros-control-toolbox-1.13.2r1.tgz => Dependency ros-genmsg-0.5.3 already installed => Installing ros-geometry-1.11.3r1.tgz => Dependency ros-message-generation-0.2.10 already installed => Dependency ros-message-runtime-0.4.12 already installed => Installing ros-pluginlib-1.10.1.tgz => Installing ros-robot-model-1.11.5.tgz => Dependency ros-ros-1.11.4 already installed => Dependency ros-std-msgs-0.5.9 already installed => Installing talos-ros-control-0.2.9r2.tgz => Dependency tnftp-20130505~ssl already installed => Building with no option. => Use the GNU C++ compiler: c++-compiler provided by g++>=3 => Use the GNU C compiler: c-compiler provided by gcc>=3 => Use python-2.7: python>=2.5<3.6 provided by python27>=2.7<2.8 => Use ros indigo: ros>=groovy ros>=hydro provided by ros-indigo => Required system package boost-headers>=1.34.1: boost-headers-1.55 found => Required system package boostlib-filesystem>=1.34.1: boost-libs-1.55.0 found => Required system package boostlib-iostreams>=1.34.1: boost-libs-1.55.0 found => Required system package boostlib-math>=1.34.1: boost-libs-1.55.0 found => Required system package boostlib-thread>=1.34.1: boost-libs-1.55.0 found => Required system package cmake>=2.8.3: cmake-3.0.2 found => Required system package eigen3>=3.0.0: eigen3-3.2.2 found => Required system package g++>=3: g++-4.9.2 found => Required system package gcc>=3: gcc-4.9.2 found => Required system package googletest: googletest found => Required system package libstdc++: libstdc++ found => Required system package pkg-config>=0.22: pkg-config-0.28 found => Required system package py27-nose>=0.10: py27-nose-1.3.4 found => Required system package python27>=2.7<2.8: python27-2.7.9 found => Required system package tinyxml>=2: tinyxml-2.6.2 found => Required robotpkg package ros-actionlib>=1.11<1.12: ros-actionlib-1.11.2 found => Required robotpkg package ros-catkin>=0.6<0.7: ros-catkin-0.6.9 found => Required robotpkg package ros-comm>=1.11<1.12: ros-comm-1.11.20 found => Required robotpkg package ros-common-msgs>=1.11<1.12: ros-common-msgs-1.11.4 found => Required robotpkg package ros-control-toolbox>=1.13<1.15: ros-control-toolbox-1.13.2r1 found => Required robotpkg package ros-genmsg>=0.5<0.6: ros-genmsg-0.5.3 found => Required robotpkg package ros-geometry>=1.11<1.12: ros-geometry-1.11.3r1 found => Required robotpkg package ros-message-generation>=0.2<0.3: ros-message-generation-0.2.10 found => Required robotpkg package ros-message-runtime>=0.4<0.5: ros-message-runtime-0.4.12 found => Required robotpkg package ros-pluginlib>=1.10<1.11: ros-pluginlib-1.10.1 found => Required robotpkg package ros-robot-model>=1.11<1.12: ros-robot-model-1.11.5 found => Required robotpkg package ros-ros>=1.11<1.12: ros-ros-1.11.4 found => Required robotpkg package ros-std-msgs>=0.5: ros-std-msgs-0.5.9 found => Required robotpkg package talos-ros-control>=0.2: talos-ros-control-0.2.9r2 found => SHA1 checksums OK => RMD160 checksums OK An unexpected error occured. The last 10 log lines are shown below. | | Add the installation prefix of "gazebo" to CMAKE_PREFIX_PATH or set | "gazebo_DIR" to a directory containing one of the above files. If "gazebo" | provides a separate development package or SDK, be sure it has been | installed. | | | -- Configuring incomplete, errors occurred! | See also "/local/robotpkg/var/tmp/robotpkg/wip/talos-gazebo-ros-control/work/talos_gazebo_ros_control-2.6.5/CMakeFiles/CMakeOutput.log". | See also "/local/robotpkg/var/tmp/robotpkg/wip/talos-gazebo-ros-control/work/talos_gazebo_ros_control-2.6.5/CMakeFiles/CMakeError.log". For details or bug reports, check the complete log file in: /local/robotpkg/var/tmp/robotpkg/wip/talos-gazebo-ros-control/work/configure.log make[3]: *** [do-configure-cmake] Error 1 make[2]: *** [pkg-check-installed] Error 2 => Marking talos-gazebo-ros-control-2.6.5 as broken ERROR: make: *** [package] Error 2 ===> Logging bulk summary for talos-gazebo-ros-control-2.6.5 => Checking leftover files => Creating bulk log files => Logging bulk metadata ===> Cleaning temporary files for talos-gazebo-ros-control-2.6.5 ===> Done bulk for talos-gazebo-ros-control-2.6.5 [38%] Processing wip/laas-rackham:laas-rackham-20101209 ===> Bulk building for laas-rackham-20101209 Binary package for laas-rackham-20101209 is up-to-date. [39%] Processing wip/orocos-dot_service:orocos-dot_service-20120308 ===> Bulk building for orocos-dot_service-20120308 Binary package for orocos-dot_service-20120308 is up-to-date. [39%] Processing wip/talos-roboticsgroup-gazebo-plugins:talos-roboticsgroup-gazebo-plugins-0.0.3 ===> Cleaning temporary files for talos-roboticsgroup-gazebo-plugins-0.0.3 ===> Bulk building for talos-roboticsgroup-gazebo-plugins-0.0.3 => Checking for clear installation => Installing digest-20080510.tgz => Installing tnftp-20130505~ssl.tgz => Required robotpkg package digest>=20080510: digest-20080510 found => Required robotpkg package tnftp>=20091122: tnftp-20130505~ssl found => Required system package gzip: gzip-1.6 found => Required system package pax and tar archivers: pax found => Required system package pkg_install>=20110805.7: pkg_install-20110805.7 found => Dependency digest-20080510 already installed => Installing ros-actionlib-1.11.2.tgz => Dependency ros-catkin-0.6.9 already installed => Dependency ros-comm-1.11.20 already installed => Dependency ros-common-msgs-1.11.4 already installed => Installing ros-control-toolbox-1.13.2r1.tgz => Dependency ros-genmsg-0.5.3 already installed => Installing ros-geometry-1.11.3r1.tgz => Dependency ros-message-generation-0.2.10 already installed => Dependency ros-message-runtime-0.4.12 already installed => Installing ros-pluginlib-1.10.1.tgz => Installing ros-robot-model-1.11.5.tgz => Dependency ros-ros-1.11.4 already installed => Dependency ros-std-msgs-0.5.9 already installed => Installing talos-pal-hardware-interfaces-0.0.3.tgz => Dependency tnftp-20130505~ssl already installed => Building with no option. => Use the GNU C++ compiler: c++-compiler provided by g++>=3 => Use the GNU C compiler: c-compiler provided by gcc>=3 => Use python-2.7: python>=2.5<3.6 provided by python27>=2.7<2.8 => Use ros indigo: ros>=groovy ros>=hydro provided by ros-indigo => Required system package boost-headers>=1.34.1: boost-headers-1.55 found => Required system package boostlib-filesystem>=1.34.1: boost-libs-1.55.0 found => Required system package boostlib-iostreams>=1.34.1: boost-libs-1.55.0 found => Required system package boostlib-math>=1.34.1: boost-libs-1.55.0 found => Required system package boostlib-thread>=1.34.1: boost-libs-1.55.0 found => Required system package cmake>=2.8.3: cmake-3.0.2 found => Required system package eigen3>=3.0.0: eigen3-3.2.2 found => Required system package g++>=3: g++-4.9.2 found => Required system package gcc>=3: gcc-4.9.2 found => Required system package googletest: googletest found => Required system package libstdc++: libstdc++ found => Required system package pkg-config>=0.22: pkg-config-0.28 found => Required system package py27-nose>=0.10: py27-nose-1.3.4 found => Required system package python27>=2.7<2.8: python27-2.7.9 found => Required system package tinyxml>=2: tinyxml-2.6.2 found => Required robotpkg package ros-actionlib>=1.11<1.12: ros-actionlib-1.11.2 found => Required robotpkg package ros-catkin>=0.6<0.7: ros-catkin-0.6.9 found => Required robotpkg package ros-comm>=1.11<1.12: ros-comm-1.11.20 found => Required robotpkg package ros-common-msgs>=1.11<1.12: ros-common-msgs-1.11.4 found => Required robotpkg package ros-control-toolbox>=1.13<1.15: ros-control-toolbox-1.13.2r1 found => Required robotpkg package ros-genmsg>=0.5<0.6: ros-genmsg-0.5.3 found => Required robotpkg package ros-geometry>=1.11<1.12: ros-geometry-1.11.3r1 found => Required robotpkg package ros-message-generation>=0.2<0.3: ros-message-generation-0.2.10 found => Required robotpkg package ros-message-runtime>=0.4<0.5: ros-message-runtime-0.4.12 found => Required robotpkg package ros-pluginlib>=1.10<1.11: ros-pluginlib-1.10.1 found => Required robotpkg package ros-robot-model>=1.11<1.12: ros-robot-model-1.11.5 found => Required robotpkg package ros-ros>=1.11<1.12: ros-ros-1.11.4 found => Required robotpkg package ros-std-msgs>=0.5: ros-std-msgs-0.5.9 found => Required robotpkg package talos-pal-hardware-interfaces>=0.0.2: talos-pal-hardware-interfaces-0.0.3 found => Fetching talos_roboticsgroup_gazebo_plugins-0.0.3.tar.gz => Total size: 5305 bytes tnftp: Invalid URL `ftp://@softs.laas.fr/talos/talos_roboticsgroup_gazebo_plugins/talos_roboticsgroup_gazebo_plugins-0.0.3.tar.gz' fetch: Unable to fetch expected file talos_roboticsgroup_gazebo_plugins-0.0.3.tar.gz => Total size: 5305 bytes tnftp: Error retrieving file `404 Not Found' fetch: Unable to fetch expected file talos_roboticsgroup_gazebo_plugins-0.0.3.tar.gz ERROR: Could not fetch the following file: ERROR: talos_roboticsgroup_gazebo_plugins-0.0.3.tar.gz ERROR: ERROR: Please retrieve this file manually into: ERROR: /opt/robotpkg/var/lib/robotpkg/distfiles/ make[3]: *** [/opt/robotpkg/var/lib/robotpkg/distfiles/talos_roboticsgroup_gazebo_plugins-0.0.3.tar.gz] Error 1 make[2]: *** [pkg-check-installed] Error 2 => Marking talos-roboticsgroup-gazebo-plugins-0.0.3 as broken ERROR: make: *** [package] Error 2 ===> Logging bulk summary for talos-roboticsgroup-gazebo-plugins-0.0.3 => Checking leftover files => Creating bulk log files => Logging bulk metadata ===> Cleaning temporary files for talos-roboticsgroup-gazebo-plugins-0.0.3 ===> Done bulk for talos-roboticsgroup-gazebo-plugins-0.0.3 [40%] Processing wip/hrp2-14-description:hrp2-14-description-1.0.3 ===> Bulk building for hrp2-14-description-1.0.3 Binary package for hrp2-14-description-1.0.3 is up-to-date. [40%] Processing wip/sot-dyninv:sot-dyninv-2.0.0 ===> Bulk building for sot-dyninv-2.0.0 Binary package for sot-dyninv-2.0.0 is up-to-date. [41%] Processing wip/mhp-genom:mhp-genom-3.15 ===> Cleaning temporary files for mhp-genom-3.15~openprs+pr2+spark+tcl+tclserv_client ===> Bulk building for mhp-genom-3.15~openprs+pr2+spark+tcl+tclserv_client => Checking for clear installation => Installing digest-20080510.tgz => Installing tnftp-20130505~ssl.tgz => Required robotpkg package digest>=20080510: digest-20080510 found => Required robotpkg package tnftp>=20091122: tnftp-20130505~ssl found => Required system package gzip: gzip-1.6 found => Required system package pax and tar archivers: pax found => Required system package pkg_install>=20110805.7: pkg_install-20110805.7 found => Dependency digest-20080510 already installed => Installing gbM-0.11~tcl.tgz => Installing genManip-genom-0.9~openprs+tcl+tclserv_client.tgz => Dependency genom-2.12~doc already installed => Installing libmove3d-3.22.0r1.tgz => Installing libmove3d-hri-2.24.tgz => Installing libt3d-2.6~doc.tgz => Dependency libtclserv_client-0.5r1 already installed => Installing mkdep-2.7r1.tgz => Dependency pocolibs-2.15 already installed => Installing pom-genom-0.7~openprs+tcl+tclserv_client.tgz ERROR: Required robotpkg package spark-genom>=3.9: BROKEN => Dependency tclserv-2.8.1 already installed => Dependency tnftp-20130505~ssl already installed => Dependency transgen-1.1b1 already installed ===> Logging bulk summary for mhp-genom-3.15~openprs+pr2+spark+tcl+tclserv_client => Checking leftover files => Creating bulk log files => Logging bulk metadata ===> Cleaning temporary files for mhp-genom-3.15~openprs+pr2+spark+tcl+tclserv_client ===> Done bulk for mhp-genom-3.15~openprs+pr2+spark+tcl+tclserv_client [41%] Processing wip/libpointmatcher:libpointmatcher-1.1.0 ===> Cleaning temporary files for libpointmatcher-1.1.0 ===> Bulk building for libpointmatcher-1.1.0 => Checking for clear installation => Installing digest-20080510.tgz => Installing tnftp-20130505~ssl.tgz => Required robotpkg package digest>=20080510: digest-20080510 found => Required robotpkg package tnftp>=20130505~ssl: tnftp-20130505~ssl found => Required system package gzip: gzip-1.6 found => Required system package patch>=2.0: patch-2.7.5 found => Required system package pax and tar archivers: pax found => Required system package pkg_install>=20110805.7: pkg_install-20110805.7 found => Dependency digest-20080510 already installed => Installing libnabo-1.0.4.tgz => Dependency tnftp-20130505~ssl already installed => Building with no option. => Use the GNU C++ compiler: c++-compiler provided by g++>=3 => Use the GNU C compiler: c-compiler provided by gcc>=3 => Required system package boost-headers>=1.34.1: boost-headers-1.55 found => Required system package boostlib-filesystem>=1.34.1: boost-libs-1.55.0 found => Required system package boostlib-iostreams>=1.34.1: boost-libs-1.55.0 found => Required system package boostlib-math>=1.34.1: boost-libs-1.55.0 found => Required system package boostlib-thread>=1.34.1: boost-libs-1.55.0 found => Required system package cmake>=2.6: cmake-3.0.2 found => Required system package doxygen>=1.5: doxygen-1.8.8 found => Required system package eigen3>=3.0.0: eigen3-3.2.2 found => Required system package g++>=3: g++-4.9.2 found => Required system package gcc>=3: gcc-4.9.2 found => Required system package googletest: googletest found => Required system package latex>=3.14: latex-3.14159265 found => Required system package libstdc++: libstdc++ found => Required system package ncurses>=5: ncurses-5.9 found => Required system package pkg-config>=0.22: pkg-config-0.28 found => Required system package yaml-cpp>=0.2: yaml-cpp-0.5.1 found => Required robotpkg package libnabo>=1.0.4: libnabo-1.0.4 found => SHA1 checksums OK => RMD160 checksums OK => Applying robotpkg patches for libpointmatcher-1.1.0 An unexpected error occured. The last 10 log lines are shown below. | CMakeFiles/pointmatcher.dir/build.make:57: recipe for target 'CMakeFiles/pointmatcher.dir/pointmatcher/Logger.cpp.o' failed | make[2]: *** [CMakeFiles/pointmatcher.dir/pointmatcher/Logger.cpp.o] Error 1 | CMakeFiles/pointmatcher.dir/build.make:126: recipe for target 'CMakeFiles/pointmatcher.dir/pointmatcher/Matches.cpp.o' failed | make[2]: *** [CMakeFiles/pointmatcher.dir/pointmatcher/Matches.cpp.o] Error 1 | make[2]: Leaving directory '/local/robotpkg/var/tmp/robotpkg/wip/libpointmatcher/work/libpointmatcher-1.1.0' | make[1]: *** [CMakeFiles/pointmatcher.dir/all] Error 2 | make: *** [all] Error 2 | CMakeFiles/Makefile2:125: recipe for target 'CMakeFiles/pointmatcher.dir/all' failed | make[1]: Leaving directory '/local/robotpkg/var/tmp/robotpkg/wip/libpointmatcher/work/libpointmatcher-1.1.0' | Makefile:130: recipe for target 'all' failed For details or bug reports, check the complete log file in: /local/robotpkg/var/tmp/robotpkg/wip/libpointmatcher/work/build.log make[3]: *** [do-build] Error 2 make[2]: *** [pkg-check-installed] Error 2 => Marking libpointmatcher-1.1.0 as broken ERROR: make: *** [package] Error 2 ===> Logging bulk summary for libpointmatcher-1.1.0 => Checking leftover files => Creating bulk log files => Logging bulk metadata ===> Cleaning temporary files for libpointmatcher-1.1.0 ===> Done bulk for libpointmatcher-1.1.0 [42%] Processing wip/pinocchio:pinocchio-1.2.3 ===> Bulk building for pinocchio-1.2.3 Binary package for pinocchio-1.2.3 is up-to-date. [42%] Processing wip/hatpconsole:hatpconsole-2.0.0 ===> Bulk building for hatpconsole-2.0.0 Binary package for hatpconsole-2.0.0 is up-to-date. [42%] Processing wip/jrl-walkgen-v3:jrl-walkgen-v3-4.0.1 ===> Bulk building for jrl-walkgen-v3-4.0.1 Binary package for jrl-walkgen-v3-4.0.1 is up-to-date. [43%] Processing wip/move3d-studio:move3d-studio-1.4r3 ===> Cleaning temporary files for move3d-studio-1.4r3~qtstudio ===> Bulk building for move3d-studio-1.4r3~qtstudio => Checking for clear installation => Installing digest-20080510.tgz => Installing tnftp-20130505~ssl.tgz => Required robotpkg package digest>=20080510: digest-20080510 found => Required robotpkg package tnftp>=20091122: tnftp-20130505~ssl found => Required system package gzip: gzip-1.6 found => Required system package pax and tar archivers: pax found => Required system package pkg_install>=20110805.7: pkg_install-20110805.7 found => Dependency digest-20080510 already installed => Installing gbM-0.11~tcl.tgz WARNING: Cannot check installed version of glpk WARNING: Cannot check installed version of libXpm => Installing libmove3d-3.22.0r1.tgz => Installing libmove3d-hri-2.24.tgz ERROR: Required robotpkg package libmove3d-planners>=1.4.0: BROKEN => Dependency softMotion-libs-3.12~tcl already installed => Dependency tnftp-20130505~ssl already installed WARNING: Cannot check installed version of glpk WARNING: Cannot check installed version of libXpm ===> Logging bulk summary for move3d-studio-1.4r3~qtstudio => Checking leftover files => Creating bulk log files => Logging bulk metadata ===> Cleaning temporary files for move3d-studio-1.4r3~qtstudio ===> Done bulk for move3d-studio-1.4r3~qtstudio [43%] Processing wip/hyper-genom-plugin:hyper-genom-plugin-0.12 ===> Bulk building for hyper-genom-plugin-0.12 Binary package for hyper-genom-plugin-0.12 is up-to-date. [44%] Processing wip/hyper-viewer:hyper-viewer-0.1r1 ===> Bulk building for hyper-viewer-0.1r1 Binary package for hyper-viewer-0.1r1 is up-to-date. [44%] Processing wip/hrp2-bringup:hrp2-bringup-1.0.6 ===> Bulk building for hrp2-bringup-1.0.6 Binary package for hrp2-bringup-1.0.6 is up-to-date. [45%] Processing wip/hatptester:hatptester-1.5.3 ===> Bulk building for hatptester-1.5.3 Binary package for hatptester-1.5.3 is up-to-date. [45%] Processing wip/pr2-pick-object:laas-pr2-pick-object ===> Bulk building for laas-pr2-pick-object Binary package for laas-pr2-pick-object is up-to-date. [46%] Processing wip/MPC_avoidObs-genom:MPC_avoidObs-genom-0.2r1 ===> Cleaning temporary files for MPC_avoidObs-genom-0.2r1~openprs+tcl+tclserv_client ===> Bulk building for MPC_avoidObs-genom-0.2r1~openprs+tcl+tclserv_client => Checking for clear installation Warning: the LICENSE of wip/MPC_avoidObs-genom is undefined. => Installing digest-20080510.tgz => Installing tnftp-20130505~ssl.tgz Warning: the LICENSE of wip/MPC_avoidObs-genom is undefined. => Required robotpkg package digest>=20080510: digest-20080510 found => Required robotpkg package tnftp>=20091122: tnftp-20130505~ssl found => Required system package gzip: gzip-1.6 found => Required system package patch>=2.0: patch-2.7.5 found => Required system package pax and tar archivers: pax found => Required system package pkg_install>=20110805.7: pkg_install-20110805.7 found Warning: the LICENSE of wip/MPC_avoidObs-genom is undefined. Warning: the LICENSE of wip/MPC_avoidObs-genom is undefined. => Installing GPS-genom-1.7~openprs+tcl+tclserv_client.tgz => Installing MPC-1.0r2.tgz => Installing MPC_DEMTreatment-genom-0.2~openprs+tcl+tclserv_client.tgz => Installing MPC_planner-genom-0.2r1~openprs+tcl+tclserv_client.tgz => Dependency digest-20080510 already installed => Dependency dtm-genom-1.5~openprs+tcl+tclserv_client already installed => Dependency genBasic-genom-0.4r1~openprs+tcl+tclserv_client already installed => Dependency genPos-genom-0.3r1~openprs+tcl+tclserv_client already installed => Dependency genom-2.12~doc already installed => Dependency libt3d-2.6~doc already installed => Dependency libtclserv_client-0.5r1 already installed => Installing mkdep-2.7r1.tgz => Dependency pocolibs-2.15 already installed => Dependency pom-genom-0.7~openprs+tcl+tclserv_client already installed => Dependency stereopixel-genom-1.3~openprs+tcl+tclserv_client already installed => Dependency tclserv-2.8.1 already installed => Dependency tnftp-20130505~ssl already installed => Dependency transgen-1.1b1 already installed => Dependency velodyne-genom-1.6~openprs+tcl+tclserv_client already installed Warning: the LICENSE of wip/MPC_avoidObs-genom is undefined. => Building with the following options: => Use the GNU C++ compiler: c++-compiler provided by g++>=3 => Use the GNU C compiler: c-compiler provided by gcc>=3 => Use tcl-8.6: tcl>=8.4 provided by tcl86>=8.6<8.7 => Required system package autoconf>=2.59: autoconf-2.69 found => Required system package g++>=3: g++-4.9.2 found => Required system package gcc>=3: gcc-4.9.2 found => Required system package glu>=7: glu-9.0.0 found => Required system package libstdc++: libstdc++ found => Required system package libtool>=1.5.22: libtool-2.4.2 found => Required system package mesa>=6.5: mesa-10.3.2 found => Required system package perl>=5: perl-5 found => Required system package pkg-config>=0.22: pkg-config-0.28 found => Required system package tcl86>=8.6<8.7: tcl86-8.6 found => Required robotpkg package GPS-genom>=1.2: GPS-genom-1.7~openprs+tcl+tclserv_client found => Required robotpkg package MPC>=1.0: MPC-1.0r2 found => Required robotpkg package MPC_DEMTreatment-genom>=0.2: MPC_DEMTreatment-genom-0.2~openprs+tcl+tclserv_client found => Required robotpkg package MPC_planner-genom>=0.2: MPC_planner-genom-0.2r1~openprs+tcl+tclserv_client found => Required robotpkg package dtm-genom>=1.3: dtm-genom-1.5~openprs+tcl+tclserv_client found => Required robotpkg package genBasic-genom>=0.1: genBasic-genom-0.4r1~openprs+tcl+tclserv_client found => Required robotpkg package genPos-genom>=0.1: genPos-genom-0.3r1~openprs+tcl+tclserv_client found => Required robotpkg package genom>=2.9: genom-2.12~doc found => Required robotpkg package libt3d>=2.6: libt3d-2.6~doc found => Required robotpkg package libtclserv_client>=0.3: libtclserv_client-0.5r1 found => Required robotpkg package mkdep>=2.6: mkdep-2.7r1 found => Required robotpkg package pocolibs>=2.11: pocolibs-2.15 found => Required robotpkg package pom-genom>=0.5r1: pom-genom-0.7~openprs+tcl+tclserv_client found => Required robotpkg package stereopixel-genom>=1.2: stereopixel-genom-1.3~openprs+tcl+tclserv_client found => Required robotpkg package tclserv>=2.7: tclserv-2.8.1 found => Required robotpkg package transgen>=1.1b0: transgen-1.1b1 found => Required robotpkg package velodyne-genom>=1.6: velodyne-genom-1.6~openprs+tcl+tclserv_client found Warning: the LICENSE of wip/MPC_avoidObs-genom is undefined. Warning: the LICENSE of wip/MPC_avoidObs-genom is undefined. Warning: the LICENSE of wip/MPC_avoidObs-genom is undefined. => SHA1 checksums OK => RMD160 checksums OK => Applying robotpkg patches for MPC_avoidObs-genom-0.2r1~openprs+tcl+tclserv_client => Generating MPC_avoidObs module => Modifying GNU configure scripts to avoid --recheck Warning: the LICENSE of wip/MPC_avoidObs-genom is undefined. => Adding run-time search paths to pkg-config files => Registering installation for MPC_avoidObs-genom-0.2r1~openprs+tcl+tclserv_client => Linking package in /opt/robotpkg/var/lib/robotpkg/packages/bsd/Debian-8.2-x86_64/pub Warning: the LICENSE of wip/MPC_avoidObs-genom is undefined. ===> Logging bulk summary for MPC_avoidObs-genom-0.2r1~openprs+tcl+tclserv_client => Checking leftover files => Creating bulk log files => Logging bulk metadata ===> Cleaning temporary files for MPC_avoidObs-genom-0.2r1~openprs+tcl+tclserv_client ===> Done bulk for MPC_avoidObs-genom-0.2r1~openprs+tcl+tclserv_client [46%] Processing wip/atlaas-genom:atlaas-genom-0.1.6 ===> Cleaning temporary files for atlaas-genom-0.1.6~openprs+tcl+tclserv_client ===> Bulk building for atlaas-genom-0.1.6~openprs+tcl+tclserv_client => Checking for clear installation => Installing digest-20080510.tgz => Installing tnftp-20130505~ssl.tgz => Required robotpkg package digest>=20080510: digest-20080510 found => Required robotpkg package tnftp>=20091122: tnftp-20130505~ssl found => Required system package gzip: gzip-1.6 found => Required system package pax and tar archivers: pax found => Required system package pkg_install>=20110805.7: pkg_install-20110805.7 found => Required robotpkg package atlaas>=0.1: N/A => Dependency digest-20080510 already installed => Required robotpkg package gdalwrap>=0.1: N/A => Installing genBasic-genom-0.4r1~openprs+tcl+tclserv_client.tgz => Installing genPos-genom-0.3r1~openprs+tcl+tclserv_client.tgz => Dependency genom-2.12~doc already installed => Installing libimages3d-3.4r3.tgz => Dependency libt3d-2.6~doc already installed => Dependency libtclserv_client-0.5r1 already installed => Installing mkdep-2.7r1.tgz => Dependency pocolibs-2.15 already installed => Installing pom-genom-0.7~openprs+tcl+tclserv_client.tgz => Dependency tclserv-2.8.1 already installed => Dependency tnftp-20130505~ssl already installed => Dependency transgen-1.1b1 already installed => Installing velodyne-genom-1.6~openprs+tcl+tclserv_client.tgz ===> Logging bulk summary for atlaas-genom-0.1.6~openprs+tcl+tclserv_client => Checking leftover files => Creating bulk log files => Logging bulk metadata ===> Cleaning temporary files for atlaas-genom-0.1.6~openprs+tcl+tclserv_client ===> Done bulk for atlaas-genom-0.1.6~openprs+tcl+tclserv_client [47%] Processing wip/sot-hrprtc-hrp2:sot-hrprtc-hrp2-1.2.2 ===> Cleaning temporary files for sot-hrprtc-hrp2-1.2.2 ===> Bulk building for sot-hrprtc-hrp2-1.2.2 => Checking for clear installation => Installing digest-20080510.tgz => Installing tnftp-20130505~ssl.tgz => Required robotpkg package digest>=20080510: digest-20080510 found => Required robotpkg package tnftp>=20091122: tnftp-20130505~ssl found => Required system package gzip: gzip-1.6 found => Required system package pax and tar archivers: pax found => Required system package pkg_install>=20110805.7: pkg_install-20110805.7 found => Dependency digest-20080510 already installed => Installing dynamic-graph-2.5.7.tgz => Installing dynamic-graph-bridge-2.0.9.tgz => Dependency dynamic-graph-bridge-msgs-0.2.0 already installed => Installing hrp2-14-1.9.3.tgz => Installing hrp2-14-description-1.0.3.tgz => Installing hrp2-bringup-1.0.6.tgz => Dependency hrp2-computer-monitor-1.0.2 already installed => Installing hrp2-dynamics-1.5.3.tgz => Dependency hrp2-machine-1.0.2 already installed => Installing openrtm-aist-1.1.1.tgz => Dependency py27-dynamic-graph-2.5.6r1 already installed => Dependency py27-sot-tools-1.0.1 already installed => Dependency ros-comm-1.11.20 already installed => Dependency ros-message-runtime-0.4.12 already installed => Dependency ros-std-msgs-0.5.9 already installed => Installing sot-application-1.0.0r1.tgz => Dependency sot-core-2.9.10 already installed => Dependency sot-dynamic-2.9.2 already installed => Installing sot-dyninv-2.0.0.tgz => Installing sot-pattern-generator-2.9.1.tgz => Dependency tnftp-20130505~ssl already installed => Building with no option. => Use the GNU C++ compiler: c++-compiler provided by g++>=3 => Use the GNU C compiler: c-compiler provided by gcc>=3 => Use python-2.7: python>=2.5<3.6 provided by python27>=2.7<2.8 => Use ros indigo: ros>=groovy ros>=groovy provided by ros-indigo => Required system package cmake>=2.6: cmake-3.0.2 found => Required system package doxygen>=1.5: doxygen-1.8.8 found => Required system package g++>=3: g++-4.9.2 found => Required system package gcc>=3: gcc-4.9.2 found => Required system package graphviz>=2: graphviz-2.38.0 found => Required system package libstdc++: libstdc++ found => Required system package pdflatex: pdflatex found => Required system package pkg-config>=0.22: pkg-config-0.28 found => Required system package python27>=2.7<2.8: python27-2.7.9 found => Required robotpkg package dynamic-graph>=2.5.6: dynamic-graph-2.5.7 found => Required robotpkg package dynamic-graph-bridge>=1.0.0: dynamic-graph-bridge-2.0.9 found => Required robotpkg package dynamic-graph-bridge-msgs>=0.2.0: dynamic-graph-bridge-msgs-0.2.0 found => Required robotpkg package hrp2-14>=1.7.5: hrp2-14-1.9.3 found => Required robotpkg package hrp2-14-description>=1.0.0: hrp2-14-description-1.0.3 found => Required robotpkg package hrp2-bringup>=1.0.0: hrp2-bringup-1.0.6 found => Required robotpkg package hrp2-computer-monitor>=1.0.0: hrp2-computer-monitor-1.0.2 found => Required robotpkg package hrp2-dynamics>=1.5: hrp2-dynamics-1.5.3 found => Required robotpkg package hrp2-machine>=1.0.0: hrp2-machine-1.0.2 found => Required robotpkg package openrtm-aist>=1: openrtm-aist-1.1.1 found => Required robotpkg package py27-dynamic-graph>=2.5: py27-dynamic-graph-2.5.6r1 found => Required robotpkg package py27-sot-tools>=1.0: py27-sot-tools-1.0.1 found => Required robotpkg package ros-comm>=1.11<1.12: ros-comm-1.11.20 found => Required robotpkg package ros-message-runtime>=0.4<0.5: ros-message-runtime-0.4.12 found => Required robotpkg package ros-std-msgs>=0.5: ros-std-msgs-0.5.9 found => Required robotpkg package sot-application>=1.0.0: sot-application-1.0.0r1 found => Required robotpkg package sot-core>=2.5: sot-core-2.9.10 found => Required robotpkg package sot-dynamic>=2.5: sot-dynamic-2.9.2 found => Required robotpkg package sot-dyninv>=2.0.0: sot-dyninv-2.0.0 found => Required robotpkg package sot-pattern-generator>=2.7: sot-pattern-generator-2.9.1 found ERROR: ====================================================================== ERROR: A package matching `openrtm-aist>=1' ERROR: should be installed but some files are missing. ERROR: ERROR: searching in /opt/openrobots ERROR: found: /opt/openrobots/bin/rtm-config ERROR: missing: /opt/openrobots/include/rtm/RTC.h ERROR: ERROR: Please reinstall the package in ../../middleware/openrtm-aist ERROR: ====================================================================== make[2]: *** [do-depends] Error 1 ERROR: make: *** [depends] Error 2 ===> Logging bulk summary for sot-hrprtc-hrp2-1.2.2 => Checking leftover files => Creating bulk log files => Logging bulk metadata ===> Cleaning temporary files for sot-hrprtc-hrp2-1.2.2 ===> Done bulk for sot-hrprtc-hrp2-1.2.2 [47%] Processing wip/sot-hrp2:sot-hrp2-1.1.2 ===> Bulk building for sot-hrp2-1.1.2 Binary package for sot-hrp2-1.1.2 is up-to-date. [47%] Processing wip/sot-core-v3:sot-core-v3-3.0.0r3 ===> Bulk building for sot-core-v3-3.0.0r3 Binary package for sot-core-v3-3.0.0r3 is up-to-date. [48%] Processing wip/hri-simulation:hri-simulationr1 ===> Cleaning temporary files for hri-simulationr1 ===> Bulk building for hri-simulationr1 => Checking for clear installation => Installing digest-20080510.tgz => Installing tnftp-20130505~ssl.tgz => Required robotpkg package digest>=20080510: digest-20080510 found => Required robotpkg package tnftp>=20091122: tnftp-20130505~ssl found => Required system package gzip: gzip-1.6 found => Required system package pax and tar archivers: pax found => Required system package pkg_install>=20110805.7: pkg_install-20110805.7 found => Installing alog-0.5.tgz => Dependency digest-20080510 already installed => Installing genPos-genom-0.3r1~openprs+tcl+tclserv_client.tgz => Dependency genom-2.12~doc already installed => Installing libt3d-2.6~doc.tgz ERROR: Required robotpkg package mhp-genom>=3.15: BROKEN => Installing morse-pocolibs-1.4.tgz => Installing move3d-assets-20120125.tgz => Installing platine-genom-0.5~openprs+tcl+tclserv_client.tgz => Dependency pom-genom-0.7~openprs+tcl+tclserv_client already installed => Installing py27-poco-1.5.tgz ERROR: Required robotpkg package spark-genom>=3.9: BROKEN => Dependency tnftp-20130505~ssl already installed => Installing viman-genom-1.6~openprs+tcl+tclserv_client.tgz ===> Logging bulk summary for hri-simulationr1 => Checking leftover files => Creating bulk log files => Logging bulk metadata ===> Cleaning temporary files for hri-simulationr1 ===> Done bulk for hri-simulationr1 [48%] Processing wip/py-sot-tools-v3:py27-sot-tools-v3-2.0.2 ===> Bulk building for py27-sot-tools-v3-2.0.2 Binary package for py27-sot-tools-v3-2.0.2 is up-to-date. [49%] Processing wip/MPC_controller-genom:MPC_controller-genom-0.2 ===> Cleaning temporary files for MPC_controller-genom-0.2~openprs+tcl+tclserv_client ===> Bulk building for MPC_controller-genom-0.2~openprs+tcl+tclserv_client => Checking for clear installation Warning: the LICENSE of wip/MPC_controller-genom is undefined. => Installing digest-20080510.tgz => Installing tnftp-20130505~ssl.tgz Warning: the LICENSE of wip/MPC_controller-genom is undefined. => Required robotpkg package digest>=20080510: digest-20080510 found => Required robotpkg package tnftp>=20091122: tnftp-20130505~ssl found => Required system package gzip: gzip-1.6 found => Required system package pax and tar archivers: pax found => Required system package pkg_install>=20110805.7: pkg_install-20110805.7 found Warning: the LICENSE of wip/MPC_controller-genom is undefined. Warning: the LICENSE of wip/MPC_controller-genom is undefined. => Installing MPC-1.0r2.tgz => Installing MPC_avoidObs-genom-0.2r1~openprs+tcl+tclserv_client.tgz => Dependency MPC_planner-genom-0.2r1~openprs+tcl+tclserv_client already installed => Dependency digest-20080510 already installed => Dependency dtm-genom-1.5~openprs+tcl+tclserv_client already installed => Dependency genBasic-genom-0.4r1~openprs+tcl+tclserv_client already installed => Dependency genPos-genom-0.3r1~openprs+tcl+tclserv_client already installed => Dependency genom-2.12~doc already installed => Dependency libt3d-2.6~doc already installed => Dependency libtclserv_client-0.5r1 already installed => Installing mkdep-2.7r1.tgz => Dependency pocolibs-2.15 already installed => Dependency pom-genom-0.7~openprs+tcl+tclserv_client already installed => Dependency stereopixel-genom-1.3~openprs+tcl+tclserv_client already installed => Dependency tclserv-2.8.1 already installed => Dependency tnftp-20130505~ssl already installed => Dependency transgen-1.1b1 already installed => Dependency velodyne-genom-1.6~openprs+tcl+tclserv_client already installed Warning: the LICENSE of wip/MPC_controller-genom is undefined. => Building with the following options: => Use the GNU C++ compiler: c++-compiler provided by g++>=3 => Use the GNU C compiler: c-compiler provided by gcc>=3 => Use tcl-8.6: tcl>=8.4 provided by tcl86>=8.6<8.7 => Required system package autoconf>=2.59: autoconf-2.69 found => Required system package g++>=3: g++-4.9.2 found => Required system package gcc>=3: gcc-4.9.2 found => Required system package glu>=7: glu-9.0.0 found => Required system package libstdc++: libstdc++ found => Required system package libtool>=1.5.22: libtool-2.4.2 found => Required system package mesa>=6.5: mesa-10.3.2 found => Required system package perl>=5: perl-5 found => Required system package pkg-config>=0.22: pkg-config-0.28 found => Required system package tcl86>=8.6<8.7: tcl86-8.6 found => Required robotpkg package MPC>=1.0: MPC-1.0r2 found => Required robotpkg package MPC_avoidObs-genom>=0.2: MPC_avoidObs-genom-0.2r1~openprs+tcl+tclserv_client found => Required robotpkg package MPC_planner-genom>=0.2: MPC_planner-genom-0.2r1~openprs+tcl+tclserv_client found => Required robotpkg package dtm-genom>=1.3: dtm-genom-1.5~openprs+tcl+tclserv_client found => Required robotpkg package genBasic-genom>=0.1: genBasic-genom-0.4r1~openprs+tcl+tclserv_client found => Required robotpkg package genPos-genom>=0.1: genPos-genom-0.3r1~openprs+tcl+tclserv_client found => Required robotpkg package genom>=2.9: genom-2.12~doc found => Required robotpkg package libt3d>=2.6: libt3d-2.6~doc found => Required robotpkg package libtclserv_client>=0.3: libtclserv_client-0.5r1 found => Required robotpkg package mkdep>=2.6: mkdep-2.7r1 found => Required robotpkg package pocolibs>=2.11: pocolibs-2.15 found => Required robotpkg package pom-genom>=0.5r1: pom-genom-0.7~openprs+tcl+tclserv_client found => Required robotpkg package stereopixel-genom>=1.2: stereopixel-genom-1.3~openprs+tcl+tclserv_client found => Required robotpkg package tclserv>=2.7: tclserv-2.8.1 found => Required robotpkg package transgen>=1.1b0: transgen-1.1b1 found => Required robotpkg package velodyne-genom>=1.6: velodyne-genom-1.6~openprs+tcl+tclserv_client found Warning: the LICENSE of wip/MPC_controller-genom is undefined. Warning: the LICENSE of wip/MPC_controller-genom is undefined. Warning: the LICENSE of wip/MPC_controller-genom is undefined. => SHA1 checksums OK => RMD160 checksums OK => Generating MPC_controller module => Modifying GNU configure scripts to avoid --recheck Warning: the LICENSE of wip/MPC_controller-genom is undefined. => Adding run-time search paths to pkg-config files => Registering installation for MPC_controller-genom-0.2~openprs+tcl+tclserv_client => Linking package in /opt/robotpkg/var/lib/robotpkg/packages/bsd/Debian-8.2-x86_64/pub Warning: the LICENSE of wip/MPC_controller-genom is undefined. ===> Logging bulk summary for MPC_controller-genom-0.2~openprs+tcl+tclserv_client => Checking leftover files => Creating bulk log files => Logging bulk metadata ===> Cleaning temporary files for MPC_controller-genom-0.2~openprs+tcl+tclserv_client ===> Done bulk for MPC_controller-genom-0.2~openprs+tcl+tclserv_client [49%] Processing wip/sot-dynamic-pinocchio-v3:sot-dynamic-pinocchio-v3-3.1.4r2 ===> Bulk building for sot-dynamic-pinocchio-v3-3.1.4r2 Binary package for sot-dynamic-pinocchio-v3-3.1.4r2 is up-to-date. [50%] Processing wip/sot-dyninv-v3:sot-dyninv-v3-3.0.0 ===> Bulk building for sot-dyninv-v3-3.0.0 Binary package for sot-dyninv-v3-3.0.0 is up-to-date. [50%] Processing wip/sot-application-v3:sot-application-v3-1.1.2 ===> Bulk building for sot-application-v3-1.1.2 Binary package for sot-application-v3-1.1.2 is up-to-date. [51%] Processing wip/dynamic-graph-bridge-v3:dynamic-graph-bridge-v3-3.0.6r2 ===> Bulk building for dynamic-graph-bridge-v3-3.0.6r2 Binary package for dynamic-graph-bridge-v3-3.0.6r2 is up-to-date. [51%] Processing wip/sot-pattern-generator-v3:sot-pattern-generator-v3-3.0.0 ===> Bulk building for sot-pattern-generator-v3-3.0.0 Binary package for sot-pattern-generator-v3-3.0.0 is up-to-date. [52%] Processing wip/sot-talos:sot-talos-0.0.1 ===> Cleaning temporary files for sot-talos-0.0.1 ===> Bulk building for sot-talos-0.0.1 => Checking for clear installation => Installing digest-20080510.tgz => Installing tnftp-20130505~ssl.tgz => Required robotpkg package digest>=20080510: digest-20080510 found => Required robotpkg package tnftp>=20091122: tnftp-20130505~ssl found => Required system package gzip: gzip-1.6 found => Required system package pax and tar archivers: pax found => Required system package pkg_install>=20110805.7: pkg_install-20110805.7 found => Dependency digest-20080510 already installed => Installing dynamic-graph-bridge-msgs-0.2.0.tgz => Installing dynamic-graph-bridge-v3-3.0.6r2.tgz => Dependency dynamic-graph-v3-3.0.0r2 already installed => Dependency py27-dynamic-graph-v3-3.0.2 already installed => Dependency py27-sot-tools-v3-2.0.2 already installed => Dependency ros-comm-1.11.20 already installed => Dependency ros-message-runtime-0.4.12 already installed => Dependency ros-std-msgs-0.5.9 already installed => Installing sot-application-v3-1.1.2.tgz => Dependency sot-core-v3-3.0.0r3 already installed => Dependency sot-dynamic-pinocchio-v3-3.1.4r2 already installed => Dependency tnftp-20130505~ssl already installed => Building with no option. => Use the GNU C++ compiler: c++-compiler provided by g++>=3 => Use the GNU C compiler: c-compiler provided by gcc>=3 => Use python-2.7: python>=2.5<3.6 provided by python27>=2.7<2.8 => Use ros indigo: ros>=groovy ros>=groovy provided by ros-indigo => Required system package cmake>=2.6: cmake-3.0.2 found => Required system package doxygen>=1.5: doxygen-1.8.8 found => Required system package g++>=3: g++-4.9.2 found => Required system package gcc>=3: gcc-4.9.2 found => Required system package graphviz>=2: graphviz-2.38.0 found => Required system package libstdc++: libstdc++ found => Required system package pdflatex: pdflatex found => Required system package pkg-config>=0.22: pkg-config-0.28 found => Required system package python27>=2.7<2.8: python27-2.7.9 found => Required robotpkg package dynamic-graph-bridge-msgs>=0.2.0: dynamic-graph-bridge-msgs-0.2.0 found => Required robotpkg package dynamic-graph-bridge-v3>=3.0.0: dynamic-graph-bridge-v3-3.0.6r2 found => Required robotpkg package dynamic-graph-v3>=3.0.0: dynamic-graph-v3-3.0.0r2 found => Required robotpkg package py27-dynamic-graph-v3>=3.0: py27-dynamic-graph-v3-3.0.2 found => Required robotpkg package py27-sot-tools-v3>=2.0: py27-sot-tools-v3-2.0.2 found => Required robotpkg package ros-comm>=1.11<1.12: ros-comm-1.11.20 found => Required robotpkg package ros-message-runtime>=0.4<0.5: ros-message-runtime-0.4.12 found => Required robotpkg package ros-std-msgs>=0.5: ros-std-msgs-0.5.9 found => Required robotpkg package sot-application-v3>=1.1.0: sot-application-v3-1.1.2 found => Required robotpkg package sot-core-v3>=3.0.0: sot-core-v3-3.0.0r3 found => Required robotpkg package sot-dynamic-pinocchio-v3>=3.1.1: sot-dynamic-pinocchio-v3-3.1.4r2 found => SHA1 checksums OK => RMD160 checksums OK => Compiling python files => Adding run-time search paths to pkg-config files robotpkg_create: can't stat `/opt/openrobots/share/doc/sot-talos/doxygen-html/arrowdown.png' robotpkg_create: can't stat `/opt/openrobots/share/doc/sot-talos/doxygen-html/arrowright.png' robotpkg_create: can't stat `/opt/openrobots/share/doc/sot-talos/doxygen-html/doc.png' robotpkg_create: can't stat `/opt/openrobots/share/doc/sot-talos/doxygen-html/folderclosed.png' robotpkg_create: can't stat `/opt/openrobots/share/doc/sot-talos/doxygen-html/folderopen.png' robotpkg_create: can't stat `/opt/openrobots/share/doc/sot-talos/doxygen-html/navtreedata.js' robotpkg_create: can't stat `/opt/openrobots/share/doc/sot-talos/doxygen-html/search/searchdata.js' robotpkg_create: can't stat `/opt/openrobots/share/doc/sot-talos/doxygen-html/splitbar.png' robotpkg_create: can't stat `/opt/openrobots/sot-talos/tests/katana_holding.py' robotpkg_create: can't stat `/opt/openrobots/sot-talos/tests/kinetalos.py' => Registering installation for sot-talos-0.0.1 robotpkg_admin: sot-talos-0.0.1: File `/opt/openrobots/share/doc/sot-talos/doxygen-html/arrowdown.png' is in +CONTENTS but not on filesystem! robotpkg_admin: sot-talos-0.0.1: File `/opt/openrobots/share/doc/sot-talos/doxygen-html/arrowright.png' is in +CONTENTS but not on filesystem! robotpkg_admin: sot-talos-0.0.1: File `/opt/openrobots/share/doc/sot-talos/doxygen-html/doc.png' is in +CONTENTS but not on filesystem! robotpkg_admin: sot-talos-0.0.1: File `/opt/openrobots/share/doc/sot-talos/doxygen-html/folderclosed.png' is in +CONTENTS but not on filesystem! robotpkg_admin: sot-talos-0.0.1: File `/opt/openrobots/share/doc/sot-talos/doxygen-html/folderopen.png' is in +CONTENTS but not on filesystem! robotpkg_admin: sot-talos-0.0.1: File `/opt/openrobots/share/doc/sot-talos/doxygen-html/navtreedata.js' is in +CONTENTS but not on filesystem! robotpkg_admin: sot-talos-0.0.1: File `/opt/openrobots/share/doc/sot-talos/doxygen-html/search/searchdata.js' is in +CONTENTS but not on filesystem! robotpkg_admin: sot-talos-0.0.1: File `/opt/openrobots/share/doc/sot-talos/doxygen-html/splitbar.png' is in +CONTENTS but not on filesystem! robotpkg_admin: sot-talos-0.0.1: File `/opt/openrobots/sot-talos/tests/katana_holding.py' is in +CONTENTS but not on filesystem! robotpkg_admin: sot-talos-0.0.1: File `/opt/openrobots/sot-talos/tests/kinetalos.py' is in +CONTENTS but not on filesystem! robotpkg_create: can't stat `/opt/openrobots/share/doc/sot-talos/doxygen-html/arrowdown.png' robotpkg_create: can't stat `/opt/openrobots/share/doc/sot-talos/doxygen-html/arrowright.png' robotpkg_create: can't stat `/opt/openrobots/share/doc/sot-talos/doxygen-html/doc.png' robotpkg_create: can't stat `/opt/openrobots/share/doc/sot-talos/doxygen-html/folderclosed.png' robotpkg_create: can't stat `/opt/openrobots/share/doc/sot-talos/doxygen-html/folderopen.png' robotpkg_create: can't stat `/opt/openrobots/share/doc/sot-talos/doxygen-html/navtreedata.js' robotpkg_create: can't stat `/opt/openrobots/share/doc/sot-talos/doxygen-html/search/searchdata.js' robotpkg_create: can't stat `/opt/openrobots/share/doc/sot-talos/doxygen-html/splitbar.png' robotpkg_create: can't stat `/opt/openrobots/sot-talos/tests/katana_holding.py' robotpkg_create: can't stat `/opt/openrobots/sot-talos/tests/kinetalos.py' robotpkg_create: lstat failed for file share/doc/sot-talos/doxygen-html/arrowdown.png: No such file or directory make[2]: *** [pkg-tarup] Error 2 => Marking sot-talos-0.0.1 as broken ERROR: make: *** [package] Error 2 robotpkg_delete: Couldn't remove /opt/openrobots/share/doc/sot-talos/doxygen-html/arrowdown.png robotpkg_delete: Couldn't remove /opt/openrobots/share/doc/sot-talos/doxygen-html/arrowright.png robotpkg_delete: Couldn't remove /opt/openrobots/share/doc/sot-talos/doxygen-html/doc.png robotpkg_delete: Couldn't remove /opt/openrobots/share/doc/sot-talos/doxygen-html/folderclosed.png robotpkg_delete: Couldn't remove /opt/openrobots/share/doc/sot-talos/doxygen-html/folderopen.png robotpkg_delete: Couldn't remove /opt/openrobots/share/doc/sot-talos/doxygen-html/navtreedata.js robotpkg_delete: Couldn't remove /opt/openrobots/share/doc/sot-talos/doxygen-html/search/searchdata.js robotpkg_delete: Couldn't remove /opt/openrobots/share/doc/sot-talos/doxygen-html/splitbar.png robotpkg_delete: Couldn't remove /opt/openrobots/sot-talos/tests/katana_holding.py robotpkg_delete: Couldn't remove /opt/openrobots/sot-talos/tests/kinetalos.py ===> Logging bulk summary for sot-talos-0.0.1 => Checking leftover files => Creating bulk log files => Logging bulk metadata ===> Cleaning temporary files for sot-talos-0.0.1 ===> Done bulk for sot-talos-0.0.1 [52%] Processing wip/sot-hrp2-v3:sot-hrp2-v3-2.0.1 ===> Bulk building for sot-hrp2-v3-2.0.1 Binary package for sot-hrp2-v3-2.0.1 is up-to-date. [52%] Processing wip/openhrp3-hrp2:openhrp3-hrp2-1.0.4 ===> Bulk building for openhrp3-hrp2-1.0.4 Binary package for openhrp3-hrp2-1.0.4 is up-to-date. [53%] Processing wip/talos-ros-control-sot:metapkg-talos-roscontrol-sot-0.0.2 ===> Cleaning temporary files for metapkg-talos-roscontrol-sot-0.0.2 ===> Bulk building for metapkg-talos-roscontrol-sot-0.0.2 => Checking for clear installation => Installing digest-20080510.tgz => Installing tnftp-20130505~ssl.tgz => Required robotpkg package digest>=20080510: digest-20080510 found => Required robotpkg package tnftp>=20091122: tnftp-20130505~ssl found => Required system package gzip: gzip-1.6 found => Required system package pax and tar archivers: pax found => Required system package pkg_install>=20110805.7: pkg_install-20110805.7 found => Dependency digest-20080510 already installed => Installing dynamic-graph-bridge-v3-3.0.6r2.tgz => Dependency ros-actionlib-1.11.2 already installed => Dependency ros-catkin-0.6.9 already installed => Dependency ros-comm-1.11.20 already installed => Dependency ros-common-msgs-1.11.4 already installed => Installing ros-control-toolbox-1.13.2r1.tgz => Dependency ros-genmsg-0.5.3 already installed => Dependency ros-geometry-1.11.3r1 already installed => Dependency ros-message-generation-0.2.10 already installed => Dependency ros-message-runtime-0.4.12 already installed => Installing ros-pluginlib-1.10.1.tgz => Installing ros-robot-model-1.11.5.tgz => Dependency ros-ros-1.11.4 already installed => Dependency ros-std-msgs-0.5.9 already installed ERROR: Required robotpkg package talos-simulation>=0.0.13: BROKEN => Dependency tnftp-20130505~ssl already installed ===> Logging bulk summary for metapkg-talos-roscontrol-sot-0.0.2 => Checking leftover files => Creating bulk log files => Logging bulk metadata ===> Cleaning temporary files for metapkg-talos-roscontrol-sot-0.0.2 ===> Done bulk for metapkg-talos-roscontrol-sot-0.0.2 [53%] Processing wip/sot-romeo-v3:sot-romeo-v3-2.0.1 ===> Bulk building for sot-romeo-v3-2.0.1 Binary package for sot-romeo-v3-2.0.1 is up-to-date. ===> Done bulk for rbulk wip set --- Bulk started Tue May 23 18:55:59 CEST 2017 --- Bulk stopped Tue May 23 19:22:51 CEST 2017